[Testbot] Plone 5.2 - Python 2.7 - Build # 1364 - Failure!

jenkins at plone.org jenkins at plone.org
Sat Mar 27 00:17:43 UTC 2021


Plone 5.2 - Python 2.7 - Build # 1364 - Failure:

Check console output at https://jenkins.plone.org/job/plone-5.2-python-2.7/1364/ to view the results.


Plone 5.2 - Python 2.7 - Build # 1364 - Failure:

Check console output at https://jenkins.plone.org/job/plone-5.2-python-2.7/1364/ to view the results.

Test Results:

3 tests failed.
FAILED:  Products.CMFDiffTool.tests.testListDiff.TestListDiff.test_inline_diff_vocabulary

Error Message:
u'<div class="InlineDiff">first_value</div>' != u'<div class="InlineDiff">First Title</div>'

Stack Trace:
u'<div class="InlineDiff">first_value</div>' != u'<div class="InlineDiff">First Title</div>'
- <div class="InlineDiff">first_value</div>
?                         ^    ^^^ -
+ <div class="InlineDiff">First Title</div>
?                         ^    ^^^^


  File "/srv/python2.7/lib/python2.7/unittest/case.py", line 329, in run
    testMethod()
  File "/home/jenkins/.buildout/eggs/cp27m/Products.CMFDiffTool-3.3.2-py2.7.egg/Products/CMFDiffTool/tests/testListDiff.py", line 134, in test_inline_diff_vocabulary
    [testing.VOCABULARY_TUPLES[0][0]], True, expected)
  File "/home/jenkins/.buildout/eggs/cp27m/Products.CMFDiffTool-3.3.2-py2.7.egg/Products/CMFDiffTool/tests/testListDiff.py", line 207, in _test_diff_list
    self.assertEqual(diff.inline_diff(), expected)
  File "/srv/python2.7/lib/python2.7/unittest/case.py", line 513, in assertEqual
    assertion_func(first, second, msg=msg)
  File "/srv/python2.7/lib/python2.7/unittest/case.py", line 925, in assertMultiLineEqual
    self.fail(self._formatMessage(msg, standardMsg))
  File "/srv/python2.7/lib/python2.7/unittest/case.py", line 410, in fail
    raise self.failureException(msg)


FAILED:  Products.CMFDiffTool.tests.test_choicediff.ChoiceDiffTestCase.test_should_diff_choice_field

Error Message:
False is not true

Stack Trace:
False is not true

  File "/srv/python2.7/lib/python2.7/unittest/case.py", line 329, in run
    testMethod()
  File "/home/jenkins/.buildout/eggs/cp27m/Products.CMFDiffTool-3.3.2-py2.7.egg/Products/CMFDiffTool/tests/test_choicediff.py", line 32, in test_should_diff_choice_field
    testing.VOCABULARY_TUPLES[1][0], False)
  File "/home/jenkins/.buildout/eggs/cp27m/Products.CMFDiffTool-3.3.2-py2.7.egg/Products/CMFDiffTool/tests/test_choicediff.py", line 57, in _test_diff_choice
    title_or_value(testing.VOCABULARY, value1) in inline_diff)
  File "/srv/python2.7/lib/python2.7/unittest/case.py", line 422, in assertTrue
    raise self.failureException(msg)


FAILED:  plone.restapi.tests.test_services_types.TestServicesTypes.test_types_document_update_min_max

Error Message:
2 != None

Stack Trace:
2 != None

  File "/srv/python2.7/lib/python2.7/unittest/case.py", line 329, in run
    testMethod()
  File "/home/jenkins/workspace/plone-5.2-python-2.7/src/plone.restapi/src/plone/restapi/tests/test_services_types.py", line 357, in test_types_document_update_min_max
    self.assertEqual(2, response.json().get("minLength"))
  File "/srv/python2.7/lib/python2.7/unittest/case.py", line 513, in assertEqual
    assertion_func(first, second, msg=msg)
  File "/srv/python2.7/lib/python2.7/unittest/case.py", line 506, in _baseAssertEqual
    raise self.failureException(msg)


More information about the Testbot mailing list