[Testbot] Plone 5.2 - Python 2.7 - Build # 1361 - Failure!

jenkins at plone.org jenkins at plone.org
Wed Mar 24 16:44:01 UTC 2021


Plone 5.2 - Python 2.7 - Build # 1361 - Failure:

Check console output at https://jenkins.plone.org/job/plone-5.2-python-2.7/1361/ to view the results.


Plone 5.2 - Python 2.7 - Build # 1361 - Failure:

Check console output at https://jenkins.plone.org/job/plone-5.2-python-2.7/1361/ to view the results.

Test Results:

50 tests failed.
FAILED:  plone.api.tests.test_content.TestPloneApiContent.test_copy

Error Message:
image

Stack Trace:
image

  File "/srv/python2.7/lib/python2.7/unittest/case.py", line 320, in run
    self.setUp()
  File "/home/jenkins/workspace/plone-5.2-python-2.7/src/plone.api/src/plone/api/tests/test_content.py", line 113, in setUp
    id='image',
  File "<decorator-gen-9>", line 2, in create
  File "/home/jenkins/workspace/plone-5.2-python-2.7/src/plone.api/src/plone/api/validation.py", line 81, in wrapped
    return function(*args, **kwargs)
  File "<decorator-gen-8>", line 2, in create
  File "/home/jenkins/workspace/plone-5.2-python-2.7/src/plone.api/src/plone/api/validation.py", line 153, in wrapped
    return function(*args, **kwargs)
  File "/home/jenkins/workspace/plone-5.2-python-2.7/src/plone.api/src/plone/api/content.py", line 88, in create
    container.invokeFactory(type, content_id, **kwargs)
  File "/home/jenkins/.buildout/eggs/cp27m/Products.CMFCore-2.5.1-py2.7.egg/Products/CMFCore/PortalFolder.py", line 300, in invokeFactory
    *args, **kw)
  File "/home/jenkins/.buildout/eggs/cp27m/Products.CMFCore-2.5.1-py2.7.egg/Products/CMFCore/TypesTool.py", line 809, in constructContent
    ob = info.constructInstance(container, id, *args, **kw)
  File "/home/jenkins/.buildout/eggs/cp27m/Products.CMFCore-2.5.1-py2.7.egg/Products/CMFCore/TypesTool.py", line 308, in constructInstance
    return self._constructInstance(container, id, *args, **kw)
  File "/home/jenkins/.buildout/eggs/cp27m/Products.CMFCore-2.5.1-py2.7.egg/Products/CMFCore/TypesTool.py", line 569, in _constructInstance
    notify(ObjectCreatedEvent(obj))
  File "/home/jenkins/.buildout/eggs/cp27m/zope.event-4.5.0-py2.7.egg/zope/event/__init__.py", line 32, in notify
    subscriber(event)
  File "/home/jenkins/.buildout/eggs/cp27m/zope.component-4.6.2-py2.7.egg/zope/component/event.py", line 27, in dispatch
    component_subscribers(event, None)
  File "/home/jenkins/.buildout/eggs/cp27m/zope.component-4.6.2-py2.7.egg/zope/component/_api.py", line 134, in subscribers
    return sitemanager.subscribers(objects, interface)
  File "/home/jenkins/.buildout/eggs/cp27m/zope.interface-5.2.0-py2.7-linux-x86_64.egg/zope/interface/registry.py", line 448, in subscribers
    return self.adapters.subscribers(objects, provided)
  File "/home/jenkins/.buildout/eggs/cp27m/zope.interface-5.2.0-py2.7-linux-x86_64.egg/zope/interface/adapter.py", line 619, in subscribers
    subscription(*objects)
  File "/home/jenkins/.buildout/eggs/cp27m/zope.component-4.6.2-py2.7.egg/zope/component/event.py", line 36, in objectEventNotify
    component_subscribers((event.object, event), None)
  File "/home/jenkins/.buildout/eggs/cp27m/zope.component-4.6.2-py2.7.egg/zope/component/_api.py", line 134, in subscribers
    return sitemanager.subscribers(objects, interface)
  File "/home/jenkins/.buildout/eggs/cp27m/zope.interface-5.2.0-py2.7-linux-x86_64.egg/zope/interface/registry.py", line 448, in subscribers
    return self.adapters.subscribers(objects, provided)
  File "/home/jenkins/.buildout/eggs/cp27m/zope.interface-5.2.0-py2.7-linux-x86_64.egg/zope/interface/adapter.py", line 619, in subscribers
    subscription(*objects)
  File "/home/jenkins/workspace/plone-5.2-python-2.7/src/plone.app.contenttypes/plone/app/contenttypes/subscribers.py", line 14, in set_title_description
    datafield = obj.image
  File "/home/jenkins/workspace/plone-5.2-python-2.7/src/plone.dexterity/plone/dexterity/content.py", line 411, in __getattr__
    raise AttributeError(name)


FAILED:  plone.api.tests.test_content.TestPloneApiContent.test_copy_constraints

Error Message:
image

Stack Trace:
image

  File "/srv/python2.7/lib/python2.7/unittest/case.py", line 320, in run
    self.setUp()
  File "/home/jenkins/workspace/plone-5.2-python-2.7/src/plone.api/src/plone/api/tests/test_content.py", line 113, in setUp
    id='image',
  File "<decorator-gen-9>", line 2, in create
  File "/home/jenkins/workspace/plone-5.2-python-2.7/src/plone.api/src/plone/api/validation.py", line 81, in wrapped
    return function(*args, **kwargs)
  File "<decorator-gen-8>", line 2, in create
  File "/home/jenkins/workspace/plone-5.2-python-2.7/src/plone.api/src/plone/api/validation.py", line 153, in wrapped
    return function(*args, **kwargs)
  File "/home/jenkins/workspace/plone-5.2-python-2.7/src/plone.api/src/plone/api/content.py", line 88, in create
    container.invokeFactory(type, content_id, **kwargs)
  File "/home/jenkins/.buildout/eggs/cp27m/Products.CMFCore-2.5.1-py2.7.egg/Products/CMFCore/PortalFolder.py", line 300, in invokeFactory
    *args, **kw)
  File "/home/jenkins/.buildout/eggs/cp27m/Products.CMFCore-2.5.1-py2.7.egg/Products/CMFCore/TypesTool.py", line 809, in constructContent
    ob = info.constructInstance(container, id, *args, **kw)
  File "/home/jenkins/.buildout/eggs/cp27m/Products.CMFCore-2.5.1-py2.7.egg/Products/CMFCore/TypesTool.py", line 308, in constructInstance
    return self._constructInstance(container, id, *args, **kw)
  File "/home/jenkins/.buildout/eggs/cp27m/Products.CMFCore-2.5.1-py2.7.egg/Products/CMFCore/TypesTool.py", line 569, in _constructInstance
    notify(ObjectCreatedEvent(obj))
  File "/home/jenkins/.buildout/eggs/cp27m/zope.event-4.5.0-py2.7.egg/zope/event/__init__.py", line 32, in notify
    subscriber(event)
  File "/home/jenkins/.buildout/eggs/cp27m/zope.component-4.6.2-py2.7.egg/zope/component/event.py", line 27, in dispatch
    component_subscribers(event, None)
  File "/home/jenkins/.buildout/eggs/cp27m/zope.component-4.6.2-py2.7.egg/zope/component/_api.py", line 134, in subscribers
    return sitemanager.subscribers(objects, interface)
  File "/home/jenkins/.buildout/eggs/cp27m/zope.interface-5.2.0-py2.7-linux-x86_64.egg/zope/interface/registry.py", line 448, in subscribers
    return self.adapters.subscribers(objects, provided)
  File "/home/jenkins/.buildout/eggs/cp27m/zope.interface-5.2.0-py2.7-linux-x86_64.egg/zope/interface/adapter.py", line 619, in subscribers
    subscription(*objects)
  File "/home/jenkins/.buildout/eggs/cp27m/zope.component-4.6.2-py2.7.egg/zope/component/event.py", line 36, in objectEventNotify
    component_subscribers((event.object, event), None)
  File "/home/jenkins/.buildout/eggs/cp27m/zope.component-4.6.2-py2.7.egg/zope/component/_api.py", line 134, in subscribers
    return sitemanager.subscribers(objects, interface)
  File "/home/jenkins/.buildout/eggs/cp27m/zope.interface-5.2.0-py2.7-linux-x86_64.egg/zope/interface/registry.py", line 448, in subscribers
    return self.adapters.subscribers(objects, provided)
  File "/home/jenkins/.buildout/eggs/cp27m/zope.interface-5.2.0-py2.7-linux-x86_64.egg/zope/interface/adapter.py", line 619, in subscribers
    subscription(*objects)
  File "/home/jenkins/workspace/plone-5.2-python-2.7/src/plone.app.contenttypes/plone/app/contenttypes/subscribers.py", line 14, in set_title_description
    datafield = obj.image
  File "/home/jenkins/workspace/plone-5.2-python-2.7/src/plone.dexterity/plone/dexterity/content.py", line 411, in __getattr__
    raise AttributeError(name)


FAILED:  plone.api.tests.test_content.TestPloneApiContent.test_copy_same_id

Error Message:
image

Stack Trace:
image

  File "/srv/python2.7/lib/python2.7/unittest/case.py", line 320, in run
    self.setUp()
  File "/home/jenkins/workspace/plone-5.2-python-2.7/src/plone.api/src/plone/api/tests/test_content.py", line 113, in setUp
    id='image',
  File "<decorator-gen-9>", line 2, in create
  File "/home/jenkins/workspace/plone-5.2-python-2.7/src/plone.api/src/plone/api/validation.py", line 81, in wrapped
    return function(*args, **kwargs)
  File "<decorator-gen-8>", line 2, in create
  File "/home/jenkins/workspace/plone-5.2-python-2.7/src/plone.api/src/plone/api/validation.py", line 153, in wrapped
    return function(*args, **kwargs)
  File "/home/jenkins/workspace/plone-5.2-python-2.7/src/plone.api/src/plone/api/content.py", line 88, in create
    container.invokeFactory(type, content_id, **kwargs)
  File "/home/jenkins/.buildout/eggs/cp27m/Products.CMFCore-2.5.1-py2.7.egg/Products/CMFCore/PortalFolder.py", line 300, in invokeFactory
    *args, **kw)
  File "/home/jenkins/.buildout/eggs/cp27m/Products.CMFCore-2.5.1-py2.7.egg/Products/CMFCore/TypesTool.py", line 809, in constructContent
    ob = info.constructInstance(container, id, *args, **kw)
  File "/home/jenkins/.buildout/eggs/cp27m/Products.CMFCore-2.5.1-py2.7.egg/Products/CMFCore/TypesTool.py", line 308, in constructInstance
    return self._constructInstance(container, id, *args, **kw)
  File "/home/jenkins/.buildout/eggs/cp27m/Products.CMFCore-2.5.1-py2.7.egg/Products/CMFCore/TypesTool.py", line 569, in _constructInstance
    notify(ObjectCreatedEvent(obj))
  File "/home/jenkins/.buildout/eggs/cp27m/zope.event-4.5.0-py2.7.egg/zope/event/__init__.py", line 32, in notify
    subscriber(event)
  File "/home/jenkins/.buildout/eggs/cp27m/zope.component-4.6.2-py2.7.egg/zope/component/event.py", line 27, in dispatch
    component_subscribers(event, None)
  File "/home/jenkins/.buildout/eggs/cp27m/zope.component-4.6.2-py2.7.egg/zope/component/_api.py", line 134, in subscribers
    return sitemanager.subscribers(objects, interface)
  File "/home/jenkins/.buildout/eggs/cp27m/zope.interface-5.2.0-py2.7-linux-x86_64.egg/zope/interface/registry.py", line 448, in subscribers
    return self.adapters.subscribers(objects, provided)
  File "/home/jenkins/.buildout/eggs/cp27m/zope.interface-5.2.0-py2.7-linux-x86_64.egg/zope/interface/adapter.py", line 619, in subscribers
    subscription(*objects)
  File "/home/jenkins/.buildout/eggs/cp27m/zope.component-4.6.2-py2.7.egg/zope/component/event.py", line 36, in objectEventNotify
    component_subscribers((event.object, event), None)
  File "/home/jenkins/.buildout/eggs/cp27m/zope.component-4.6.2-py2.7.egg/zope/component/_api.py", line 134, in subscribers
    return sitemanager.subscribers(objects, interface)
  File "/home/jenkins/.buildout/eggs/cp27m/zope.interface-5.2.0-py2.7-linux-x86_64.egg/zope/interface/registry.py", line 448, in subscribers
    return self.adapters.subscribers(objects, provided)
  File "/home/jenkins/.buildout/eggs/cp27m/zope.interface-5.2.0-py2.7-linux-x86_64.egg/zope/interface/adapter.py", line 619, in subscribers
    subscription(*objects)
  File "/home/jenkins/workspace/plone-5.2-python-2.7/src/plone.app.contenttypes/plone/app/contenttypes/subscribers.py", line 14, in set_title_description
    datafield = obj.image
  File "/home/jenkins/workspace/plone-5.2-python-2.7/src/plone.dexterity/plone/dexterity/content.py", line 411, in __getattr__
    raise AttributeError(name)


FAILED:  plone.api.tests.test_content.TestPloneApiContent.test_create_at_with_title_in_request

Error Message:
image

Stack Trace:
image

  File "/srv/python2.7/lib/python2.7/unittest/case.py", line 320, in run
    self.setUp()
  File "/home/jenkins/workspace/plone-5.2-python-2.7/src/plone.api/src/plone/api/tests/test_content.py", line 113, in setUp
    id='image',
  File "<decorator-gen-9>", line 2, in create
  File "/home/jenkins/workspace/plone-5.2-python-2.7/src/plone.api/src/plone/api/validation.py", line 81, in wrapped
    return function(*args, **kwargs)
  File "<decorator-gen-8>", line 2, in create
  File "/home/jenkins/workspace/plone-5.2-python-2.7/src/plone.api/src/plone/api/validation.py", line 153, in wrapped
    return function(*args, **kwargs)
  File "/home/jenkins/workspace/plone-5.2-python-2.7/src/plone.api/src/plone/api/content.py", line 88, in create
    container.invokeFactory(type, content_id, **kwargs)
  File "/home/jenkins/.buildout/eggs/cp27m/Products.CMFCore-2.5.1-py2.7.egg/Products/CMFCore/PortalFolder.py", line 300, in invokeFactory
    *args, **kw)
  File "/home/jenkins/.buildout/eggs/cp27m/Products.CMFCore-2.5.1-py2.7.egg/Products/CMFCore/TypesTool.py", line 809, in constructContent
    ob = info.constructInstance(container, id, *args, **kw)
  File "/home/jenkins/.buildout/eggs/cp27m/Products.CMFCore-2.5.1-py2.7.egg/Products/CMFCore/TypesTool.py", line 308, in constructInstance
    return self._constructInstance(container, id, *args, **kw)
  File "/home/jenkins/.buildout/eggs/cp27m/Products.CMFCore-2.5.1-py2.7.egg/Products/CMFCore/TypesTool.py", line 569, in _constructInstance
    notify(ObjectCreatedEvent(obj))
  File "/home/jenkins/.buildout/eggs/cp27m/zope.event-4.5.0-py2.7.egg/zope/event/__init__.py", line 32, in notify
    subscriber(event)
  File "/home/jenkins/.buildout/eggs/cp27m/zope.component-4.6.2-py2.7.egg/zope/component/event.py", line 27, in dispatch
    component_subscribers(event, None)
  File "/home/jenkins/.buildout/eggs/cp27m/zope.component-4.6.2-py2.7.egg/zope/component/_api.py", line 134, in subscribers
    return sitemanager.subscribers(objects, interface)
  File "/home/jenkins/.buildout/eggs/cp27m/zope.interface-5.2.0-py2.7-linux-x86_64.egg/zope/interface/registry.py", line 448, in subscribers
    return self.adapters.subscribers(objects, provided)
  File "/home/jenkins/.buildout/eggs/cp27m/zope.interface-5.2.0-py2.7-linux-x86_64.egg/zope/interface/adapter.py", line 619, in subscribers
    subscription(*objects)
  File "/home/jenkins/.buildout/eggs/cp27m/zope.component-4.6.2-py2.7.egg/zope/component/event.py", line 36, in objectEventNotify
    component_subscribers((event.object, event), None)
  File "/home/jenkins/.buildout/eggs/cp27m/zope.component-4.6.2-py2.7.egg/zope/component/_api.py", line 134, in subscribers
    return sitemanager.subscribers(objects, interface)
  File "/home/jenkins/.buildout/eggs/cp27m/zope.interface-5.2.0-py2.7-linux-x86_64.egg/zope/interface/registry.py", line 448, in subscribers
    return self.adapters.subscribers(objects, provided)
  File "/home/jenkins/.buildout/eggs/cp27m/zope.interface-5.2.0-py2.7-linux-x86_64.egg/zope/interface/adapter.py", line 619, in subscribers
    subscription(*objects)
  File "/home/jenkins/workspace/plone-5.2-python-2.7/src/plone.app.contenttypes/plone/app/contenttypes/subscribers.py", line 14, in set_title_description
    datafield = obj.image
  File "/home/jenkins/workspace/plone-5.2-python-2.7/src/plone.dexterity/plone/dexterity/content.py", line 411, in __getattr__
    raise AttributeError(name)


FAILED:  plone.api.tests.test_content.TestPloneApiContent.test_create_collection

Error Message:
image

Stack Trace:
image

  File "/srv/python2.7/lib/python2.7/unittest/case.py", line 320, in run
    self.setUp()
  File "/home/jenkins/workspace/plone-5.2-python-2.7/src/plone.api/src/plone/api/tests/test_content.py", line 113, in setUp
    id='image',
  File "<decorator-gen-9>", line 2, in create
  File "/home/jenkins/workspace/plone-5.2-python-2.7/src/plone.api/src/plone/api/validation.py", line 81, in wrapped
    return function(*args, **kwargs)
  File "<decorator-gen-8>", line 2, in create
  File "/home/jenkins/workspace/plone-5.2-python-2.7/src/plone.api/src/plone/api/validation.py", line 153, in wrapped
    return function(*args, **kwargs)
  File "/home/jenkins/workspace/plone-5.2-python-2.7/src/plone.api/src/plone/api/content.py", line 88, in create
    container.invokeFactory(type, content_id, **kwargs)
  File "/home/jenkins/.buildout/eggs/cp27m/Products.CMFCore-2.5.1-py2.7.egg/Products/CMFCore/PortalFolder.py", line 300, in invokeFactory
    *args, **kw)
  File "/home/jenkins/.buildout/eggs/cp27m/Products.CMFCore-2.5.1-py2.7.egg/Products/CMFCore/TypesTool.py", line 809, in constructContent
    ob = info.constructInstance(container, id, *args, **kw)
  File "/home/jenkins/.buildout/eggs/cp27m/Products.CMFCore-2.5.1-py2.7.egg/Products/CMFCore/TypesTool.py", line 308, in constructInstance
    return self._constructInstance(container, id, *args, **kw)
  File "/home/jenkins/.buildout/eggs/cp27m/Products.CMFCore-2.5.1-py2.7.egg/Products/CMFCore/TypesTool.py", line 569, in _constructInstance
    notify(ObjectCreatedEvent(obj))
  File "/home/jenkins/.buildout/eggs/cp27m/zope.event-4.5.0-py2.7.egg/zope/event/__init__.py", line 32, in notify
    subscriber(event)
  File "/home/jenkins/.buildout/eggs/cp27m/zope.component-4.6.2-py2.7.egg/zope/component/event.py", line 27, in dispatch
    component_subscribers(event, None)
  File "/home/jenkins/.buildout/eggs/cp27m/zope.component-4.6.2-py2.7.egg/zope/component/_api.py", line 134, in subscribers
    return sitemanager.subscribers(objects, interface)
  File "/home/jenkins/.buildout/eggs/cp27m/zope.interface-5.2.0-py2.7-linux-x86_64.egg/zope/interface/registry.py", line 448, in subscribers
    return self.adapters.subscribers(objects, provided)
  File "/home/jenkins/.buildout/eggs/cp27m/zope.interface-5.2.0-py2.7-linux-x86_64.egg/zope/interface/adapter.py", line 619, in subscribers
    subscription(*objects)
  File "/home/jenkins/.buildout/eggs/cp27m/zope.component-4.6.2-py2.7.egg/zope/component/event.py", line 36, in objectEventNotify
    component_subscribers((event.object, event), None)
  File "/home/jenkins/.buildout/eggs/cp27m/zope.component-4.6.2-py2.7.egg/zope/component/_api.py", line 134, in subscribers
    return sitemanager.subscribers(objects, interface)
  File "/home/jenkins/.buildout/eggs/cp27m/zope.interface-5.2.0-py2.7-linux-x86_64.egg/zope/interface/registry.py", line 448, in subscribers
    return self.adapters.subscribers(objects, provided)
  File "/home/jenkins/.buildout/eggs/cp27m/zope.interface-5.2.0-py2.7-linux-x86_64.egg/zope/interface/adapter.py", line 619, in subscribers
    subscription(*objects)
  File "/home/jenkins/workspace/plone-5.2-python-2.7/src/plone.app.contenttypes/plone/app/contenttypes/subscribers.py", line 14, in set_title_description
    datafield = obj.image
  File "/home/jenkins/workspace/plone-5.2-python-2.7/src/plone.dexterity/plone/dexterity/content.py", line 411, in __getattr__
    raise AttributeError(name)


FAILED:  plone.api.tests.test_content.TestPloneApiContent.test_create_constraints

Error Message:
image

Stack Trace:
image

  File "/srv/python2.7/lib/python2.7/unittest/case.py", line 320, in run
    self.setUp()
  File "/home/jenkins/workspace/plone-5.2-python-2.7/src/plone.api/src/plone/api/tests/test_content.py", line 113, in setUp
    id='image',
  File "<decorator-gen-9>", line 2, in create
  File "/home/jenkins/workspace/plone-5.2-python-2.7/src/plone.api/src/plone/api/validation.py", line 81, in wrapped
    return function(*args, **kwargs)
  File "<decorator-gen-8>", line 2, in create
  File "/home/jenkins/workspace/plone-5.2-python-2.7/src/plone.api/src/plone/api/validation.py", line 153, in wrapped
    return function(*args, **kwargs)
  File "/home/jenkins/workspace/plone-5.2-python-2.7/src/plone.api/src/plone/api/content.py", line 88, in create
    container.invokeFactory(type, content_id, **kwargs)
  File "/home/jenkins/.buildout/eggs/cp27m/Products.CMFCore-2.5.1-py2.7.egg/Products/CMFCore/PortalFolder.py", line 300, in invokeFactory
    *args, **kw)
  File "/home/jenkins/.buildout/eggs/cp27m/Products.CMFCore-2.5.1-py2.7.egg/Products/CMFCore/TypesTool.py", line 809, in constructContent
    ob = info.constructInstance(container, id, *args, **kw)
  File "/home/jenkins/.buildout/eggs/cp27m/Products.CMFCore-2.5.1-py2.7.egg/Products/CMFCore/TypesTool.py", line 308, in constructInstance
    return self._constructInstance(container, id, *args, **kw)
  File "/home/jenkins/.buildout/eggs/cp27m/Products.CMFCore-2.5.1-py2.7.egg/Products/CMFCore/TypesTool.py", line 569, in _constructInstance
    notify(ObjectCreatedEvent(obj))
  File "/home/jenkins/.buildout/eggs/cp27m/zope.event-4.5.0-py2.7.egg/zope/event/__init__.py", line 32, in notify
    subscriber(event)
  File "/home/jenkins/.buildout/eggs/cp27m/zope.component-4.6.2-py2.7.egg/zope/component/event.py", line 27, in dispatch
    component_subscribers(event, None)
  File "/home/jenkins/.buildout/eggs/cp27m/zope.component-4.6.2-py2.7.egg/zope/component/_api.py", line 134, in subscribers
    return sitemanager.subscribers(objects, interface)
  File "/home/jenkins/.buildout/eggs/cp27m/zope.interface-5.2.0-py2.7-linux-x86_64.egg/zope/interface/registry.py", line 448, in subscribers
    return self.adapters.subscribers(objects, provided)
  File "/home/jenkins/.buildout/eggs/cp27m/zope.interface-5.2.0-py2.7-linux-x86_64.egg/zope/interface/adapter.py", line 619, in subscribers
    subscription(*objects)
  File "/home/jenkins/.buildout/eggs/cp27m/zope.component-4.6.2-py2.7.egg/zope/component/event.py", line 36, in objectEventNotify
    component_subscribers((event.object, event), None)
  File "/home/jenkins/.buildout/eggs/cp27m/zope.component-4.6.2-py2.7.egg/zope/component/_api.py", line 134, in subscribers
    return sitemanager.subscribers(objects, interface)
  File "/home/jenkins/.buildout/eggs/cp27m/zope.interface-5.2.0-py2.7-linux-x86_64.egg/zope/interface/registry.py", line 448, in subscribers
    return self.adapters.subscribers(objects, provided)
  File "/home/jenkins/.buildout/eggs/cp27m/zope.interface-5.2.0-py2.7-linux-x86_64.egg/zope/interface/adapter.py", line 619, in subscribers
    subscription(*objects)
  File "/home/jenkins/workspace/plone-5.2-python-2.7/src/plone.app.contenttypes/plone/app/contenttypes/subscribers.py", line 14, in set_title_description
    datafield = obj.image
  File "/home/jenkins/workspace/plone-5.2-python-2.7/src/plone.dexterity/plone/dexterity/content.py", line 411, in __getattr__
    raise AttributeError(name)


FAILED:  plone.api.tests.test_content.TestPloneApiContent.test_create_content

Error Message:
image

Stack Trace:
image

  File "/srv/python2.7/lib/python2.7/unittest/case.py", line 320, in run
    self.setUp()
  File "/home/jenkins/workspace/plone-5.2-python-2.7/src/plone.api/src/plone/api/tests/test_content.py", line 113, in setUp
    id='image',
  File "<decorator-gen-9>", line 2, in create
  File "/home/jenkins/workspace/plone-5.2-python-2.7/src/plone.api/src/plone/api/validation.py", line 81, in wrapped
    return function(*args, **kwargs)
  File "<decorator-gen-8>", line 2, in create
  File "/home/jenkins/workspace/plone-5.2-python-2.7/src/plone.api/src/plone/api/validation.py", line 153, in wrapped
    return function(*args, **kwargs)
  File "/home/jenkins/workspace/plone-5.2-python-2.7/src/plone.api/src/plone/api/content.py", line 88, in create
    container.invokeFactory(type, content_id, **kwargs)
  File "/home/jenkins/.buildout/eggs/cp27m/Products.CMFCore-2.5.1-py2.7.egg/Products/CMFCore/PortalFolder.py", line 300, in invokeFactory
    *args, **kw)
  File "/home/jenkins/.buildout/eggs/cp27m/Products.CMFCore-2.5.1-py2.7.egg/Products/CMFCore/TypesTool.py", line 809, in constructContent
    ob = info.constructInstance(container, id, *args, **kw)
  File "/home/jenkins/.buildout/eggs/cp27m/Products.CMFCore-2.5.1-py2.7.egg/Products/CMFCore/TypesTool.py", line 308, in constructInstance
    return self._constructInstance(container, id, *args, **kw)
  File "/home/jenkins/.buildout/eggs/cp27m/Products.CMFCore-2.5.1-py2.7.egg/Products/CMFCore/TypesTool.py", line 569, in _constructInstance
    notify(ObjectCreatedEvent(obj))
  File "/home/jenkins/.buildout/eggs/cp27m/zope.event-4.5.0-py2.7.egg/zope/event/__init__.py", line 32, in notify
    subscriber(event)
  File "/home/jenkins/.buildout/eggs/cp27m/zope.component-4.6.2-py2.7.egg/zope/component/event.py", line 27, in dispatch
    component_subscribers(event, None)
  File "/home/jenkins/.buildout/eggs/cp27m/zope.component-4.6.2-py2.7.egg/zope/component/_api.py", line 134, in subscribers
    return sitemanager.subscribers(objects, interface)
  File "/home/jenkins/.buildout/eggs/cp27m/zope.interface-5.2.0-py2.7-linux-x86_64.egg/zope/interface/registry.py", line 448, in subscribers
    return self.adapters.subscribers(objects, provided)
  File "/home/jenkins/.buildout/eggs/cp27m/zope.interface-5.2.0-py2.7-linux-x86_64.egg/zope/interface/adapter.py", line 619, in subscribers
    subscription(*objects)
  File "/home/jenkins/.buildout/eggs/cp27m/zope.component-4.6.2-py2.7.egg/zope/component/event.py", line 36, in objectEventNotify
    component_subscribers((event.object, event), None)
  File "/home/jenkins/.buildout/eggs/cp27m/zope.component-4.6.2-py2.7.egg/zope/component/_api.py", line 134, in subscribers
    return sitemanager.subscribers(objects, interface)
  File "/home/jenkins/.buildout/eggs/cp27m/zope.interface-5.2.0-py2.7-linux-x86_64.egg/zope/interface/registry.py", line 448, in subscribers
    return self.adapters.subscribers(objects, provided)
  File "/home/jenkins/.buildout/eggs/cp27m/zope.interface-5.2.0-py2.7-linux-x86_64.egg/zope/interface/adapter.py", line 619, in subscribers
    subscription(*objects)
  File "/home/jenkins/workspace/plone-5.2-python-2.7/src/plone.app.contenttypes/plone/app/contenttypes/subscribers.py", line 14, in set_title_description
    datafield = obj.image
  File "/home/jenkins/workspace/plone-5.2-python-2.7/src/plone.dexterity/plone/dexterity/content.py", line 411, in __getattr__
    raise AttributeError(name)


FAILED:  plone.api.tests.test_content.TestPloneApiContent.test_create_dexterity

Error Message:
image

Stack Trace:
image

  File "/srv/python2.7/lib/python2.7/unittest/case.py", line 320, in run
    self.setUp()
  File "/home/jenkins/workspace/plone-5.2-python-2.7/src/plone.api/src/plone/api/tests/test_content.py", line 113, in setUp
    id='image',
  File "<decorator-gen-9>", line 2, in create
  File "/home/jenkins/workspace/plone-5.2-python-2.7/src/plone.api/src/plone/api/validation.py", line 81, in wrapped
    return function(*args, **kwargs)
  File "<decorator-gen-8>", line 2, in create
  File "/home/jenkins/workspace/plone-5.2-python-2.7/src/plone.api/src/plone/api/validation.py", line 153, in wrapped
    return function(*args, **kwargs)
  File "/home/jenkins/workspace/plone-5.2-python-2.7/src/plone.api/src/plone/api/content.py", line 88, in create
    container.invokeFactory(type, content_id, **kwargs)
  File "/home/jenkins/.buildout/eggs/cp27m/Products.CMFCore-2.5.1-py2.7.egg/Products/CMFCore/PortalFolder.py", line 300, in invokeFactory
    *args, **kw)
  File "/home/jenkins/.buildout/eggs/cp27m/Products.CMFCore-2.5.1-py2.7.egg/Products/CMFCore/TypesTool.py", line 809, in constructContent
    ob = info.constructInstance(container, id, *args, **kw)
  File "/home/jenkins/.buildout/eggs/cp27m/Products.CMFCore-2.5.1-py2.7.egg/Products/CMFCore/TypesTool.py", line 308, in constructInstance
    return self._constructInstance(container, id, *args, **kw)
  File "/home/jenkins/.buildout/eggs/cp27m/Products.CMFCore-2.5.1-py2.7.egg/Products/CMFCore/TypesTool.py", line 569, in _constructInstance
    notify(ObjectCreatedEvent(obj))
  File "/home/jenkins/.buildout/eggs/cp27m/zope.event-4.5.0-py2.7.egg/zope/event/__init__.py", line 32, in notify
    subscriber(event)
  File "/home/jenkins/.buildout/eggs/cp27m/zope.component-4.6.2-py2.7.egg/zope/component/event.py", line 27, in dispatch
    component_subscribers(event, None)
  File "/home/jenkins/.buildout/eggs/cp27m/zope.component-4.6.2-py2.7.egg/zope/component/_api.py", line 134, in subscribers
    return sitemanager.subscribers(objects, interface)
  File "/home/jenkins/.buildout/eggs/cp27m/zope.interface-5.2.0-py2.7-linux-x86_64.egg/zope/interface/registry.py", line 448, in subscribers
    return self.adapters.subscribers(objects, provided)
  File "/home/jenkins/.buildout/eggs/cp27m/zope.interface-5.2.0-py2.7-linux-x86_64.egg/zope/interface/adapter.py", line 619, in subscribers
    subscription(*objects)
  File "/home/jenkins/.buildout/eggs/cp27m/zope.component-4.6.2-py2.7.egg/zope/component/event.py", line 36, in objectEventNotify
    component_subscribers((event.object, event), None)
  File "/home/jenkins/.buildout/eggs/cp27m/zope.component-4.6.2-py2.7.egg/zope/component/_api.py", line 134, in subscribers
    return sitemanager.subscribers(objects, interface)
  File "/home/jenkins/.buildout/eggs/cp27m/zope.interface-5.2.0-py2.7-linux-x86_64.egg/zope/interface/registry.py", line 448, in subscribers
    return self.adapters.subscribers(objects, provided)
  File "/home/jenkins/.buildout/eggs/cp27m/zope.interface-5.2.0-py2.7-linux-x86_64.egg/zope/interface/adapter.py", line 619, in subscribers
    subscription(*objects)
  File "/home/jenkins/workspace/plone-5.2-python-2.7/src/plone.app.contenttypes/plone/app/contenttypes/subscribers.py", line 14, in set_title_description
    datafield = obj.image
  File "/home/jenkins/workspace/plone-5.2-python-2.7/src/plone.dexterity/plone/dexterity/content.py", line 411, in __getattr__
    raise AttributeError(name)


FAILED:  plone.api.tests.test_content.TestPloneApiContent.test_create_dx_event

Error Message:
image

Stack Trace:
image

  File "/srv/python2.7/lib/python2.7/unittest/case.py", line 320, in run
    self.setUp()
  File "/home/jenkins/workspace/plone-5.2-python-2.7/src/plone.api/src/plone/api/tests/test_content.py", line 113, in setUp
    id='image',
  File "<decorator-gen-9>", line 2, in create
  File "/home/jenkins/workspace/plone-5.2-python-2.7/src/plone.api/src/plone/api/validation.py", line 81, in wrapped
    return function(*args, **kwargs)
  File "<decorator-gen-8>", line 2, in create
  File "/home/jenkins/workspace/plone-5.2-python-2.7/src/plone.api/src/plone/api/validation.py", line 153, in wrapped
    return function(*args, **kwargs)
  File "/home/jenkins/workspace/plone-5.2-python-2.7/src/plone.api/src/plone/api/content.py", line 88, in create
    container.invokeFactory(type, content_id, **kwargs)
  File "/home/jenkins/.buildout/eggs/cp27m/Products.CMFCore-2.5.1-py2.7.egg/Products/CMFCore/PortalFolder.py", line 300, in invokeFactory
    *args, **kw)
  File "/home/jenkins/.buildout/eggs/cp27m/Products.CMFCore-2.5.1-py2.7.egg/Products/CMFCore/TypesTool.py", line 809, in constructContent
    ob = info.constructInstance(container, id, *args, **kw)
  File "/home/jenkins/.buildout/eggs/cp27m/Products.CMFCore-2.5.1-py2.7.egg/Products/CMFCore/TypesTool.py", line 308, in constructInstance
    return self._constructInstance(container, id, *args, **kw)
  File "/home/jenkins/.buildout/eggs/cp27m/Products.CMFCore-2.5.1-py2.7.egg/Products/CMFCore/TypesTool.py", line 569, in _constructInstance
    notify(ObjectCreatedEvent(obj))
  File "/home/jenkins/.buildout/eggs/cp27m/zope.event-4.5.0-py2.7.egg/zope/event/__init__.py", line 32, in notify
    subscriber(event)
  File "/home/jenkins/.buildout/eggs/cp27m/zope.component-4.6.2-py2.7.egg/zope/component/event.py", line 27, in dispatch
    component_subscribers(event, None)
  File "/home/jenkins/.buildout/eggs/cp27m/zope.component-4.6.2-py2.7.egg/zope/component/_api.py", line 134, in subscribers
    return sitemanager.subscribers(objects, interface)
  File "/home/jenkins/.buildout/eggs/cp27m/zope.interface-5.2.0-py2.7-linux-x86_64.egg/zope/interface/registry.py", line 448, in subscribers
    return self.adapters.subscribers(objects, provided)
  File "/home/jenkins/.buildout/eggs/cp27m/zope.interface-5.2.0-py2.7-linux-x86_64.egg/zope/interface/adapter.py", line 619, in subscribers
    subscription(*objects)
  File "/home/jenkins/.buildout/eggs/cp27m/zope.component-4.6.2-py2.7.egg/zope/component/event.py", line 36, in objectEventNotify
    component_subscribers((event.object, event), None)
  File "/home/jenkins/.buildout/eggs/cp27m/zope.component-4.6.2-py2.7.egg/zope/component/_api.py", line 134, in subscribers
    return sitemanager.subscribers(objects, interface)
  File "/home/jenkins/.buildout/eggs/cp27m/zope.interface-5.2.0-py2.7-linux-x86_64.egg/zope/interface/registry.py", line 448, in subscribers
    return self.adapters.subscribers(objects, provided)
  File "/home/jenkins/.buildout/eggs/cp27m/zope.interface-5.2.0-py2.7-linux-x86_64.egg/zope/interface/adapter.py", line 619, in subscribers
    subscription(*objects)
  File "/home/jenkins/workspace/plone-5.2-python-2.7/src/plone.app.contenttypes/plone/app/contenttypes/subscribers.py", line 14, in set_title_description
    datafield = obj.image
  File "/home/jenkins/workspace/plone-5.2-python-2.7/src/plone.dexterity/plone/dexterity/content.py", line 411, in __getattr__
    raise AttributeError(name)


FAILED:  plone.api.tests.test_content.TestPloneApiContent.test_create_raises_unicodedecodeerror

Error Message:
image

Stack Trace:
image

  File "/srv/python2.7/lib/python2.7/unittest/case.py", line 320, in run
    self.setUp()
  File "/home/jenkins/workspace/plone-5.2-python-2.7/src/plone.api/src/plone/api/tests/test_content.py", line 113, in setUp
    id='image',
  File "<decorator-gen-9>", line 2, in create
  File "/home/jenkins/workspace/plone-5.2-python-2.7/src/plone.api/src/plone/api/validation.py", line 81, in wrapped
    return function(*args, **kwargs)
  File "<decorator-gen-8>", line 2, in create
  File "/home/jenkins/workspace/plone-5.2-python-2.7/src/plone.api/src/plone/api/validation.py", line 153, in wrapped
    return function(*args, **kwargs)
  File "/home/jenkins/workspace/plone-5.2-python-2.7/src/plone.api/src/plone/api/content.py", line 88, in create
    container.invokeFactory(type, content_id, **kwargs)
  File "/home/jenkins/.buildout/eggs/cp27m/Products.CMFCore-2.5.1-py2.7.egg/Products/CMFCore/PortalFolder.py", line 300, in invokeFactory
    *args, **kw)
  File "/home/jenkins/.buildout/eggs/cp27m/Products.CMFCore-2.5.1-py2.7.egg/Products/CMFCore/TypesTool.py", line 809, in constructContent
    ob = info.constructInstance(container, id, *args, **kw)
  File "/home/jenkins/.buildout/eggs/cp27m/Products.CMFCore-2.5.1-py2.7.egg/Products/CMFCore/TypesTool.py", line 308, in constructInstance
    return self._constructInstance(container, id, *args, **kw)
  File "/home/jenkins/.buildout/eggs/cp27m/Products.CMFCore-2.5.1-py2.7.egg/Products/CMFCore/TypesTool.py", line 569, in _constructInstance
    notify(ObjectCreatedEvent(obj))
  File "/home/jenkins/.buildout/eggs/cp27m/zope.event-4.5.0-py2.7.egg/zope/event/__init__.py", line 32, in notify
    subscriber(event)
  File "/home/jenkins/.buildout/eggs/cp27m/zope.component-4.6.2-py2.7.egg/zope/component/event.py", line 27, in dispatch
    component_subscribers(event, None)
  File "/home/jenkins/.buildout/eggs/cp27m/zope.component-4.6.2-py2.7.egg/zope/component/_api.py", line 134, in subscribers
    return sitemanager.subscribers(objects, interface)
  File "/home/jenkins/.buildout/eggs/cp27m/zope.interface-5.2.0-py2.7-linux-x86_64.egg/zope/interface/registry.py", line 448, in subscribers
    return self.adapters.subscribers(objects, provided)
  File "/home/jenkins/.buildout/eggs/cp27m/zope.interface-5.2.0-py2.7-linux-x86_64.egg/zope/interface/adapter.py", line 619, in subscribers
    subscription(*objects)
  File "/home/jenkins/.buildout/eggs/cp27m/zope.component-4.6.2-py2.7.egg/zope/component/event.py", line 36, in objectEventNotify
    component_subscribers((event.object, event), None)
  File "/home/jenkins/.buildout/eggs/cp27m/zope.component-4.6.2-py2.7.egg/zope/component/_api.py", line 134, in subscribers
    return sitemanager.subscribers(objects, interface)
  File "/home/jenkins/.buildout/eggs/cp27m/zope.interface-5.2.0-py2.7-linux-x86_64.egg/zope/interface/registry.py", line 448, in subscribers
    return self.adapters.subscribers(objects, provided)
  File "/home/jenkins/.buildout/eggs/cp27m/zope.interface-5.2.0-py2.7-linux-x86_64.egg/zope/interface/adapter.py", line 619, in subscribers
    subscription(*objects)
  File "/home/jenkins/workspace/plone-5.2-python-2.7/src/plone.app.contenttypes/plone/app/contenttypes/subscribers.py", line 14, in set_title_description
    datafield = obj.image
  File "/home/jenkins/workspace/plone-5.2-python-2.7/src/plone.dexterity/plone/dexterity/content.py", line 411, in __getattr__
    raise AttributeError(name)


FAILED:  plone.api.tests.test_content.TestPloneApiContent.test_create_with_safe_id

Error Message:
image

Stack Trace:
image

  File "/srv/python2.7/lib/python2.7/unittest/case.py", line 320, in run
    self.setUp()
  File "/home/jenkins/workspace/plone-5.2-python-2.7/src/plone.api/src/plone/api/tests/test_content.py", line 113, in setUp
    id='image',
  File "<decorator-gen-9>", line 2, in create
  File "/home/jenkins/workspace/plone-5.2-python-2.7/src/plone.api/src/plone/api/validation.py", line 81, in wrapped
    return function(*args, **kwargs)
  File "<decorator-gen-8>", line 2, in create
  File "/home/jenkins/workspace/plone-5.2-python-2.7/src/plone.api/src/plone/api/validation.py", line 153, in wrapped
    return function(*args, **kwargs)
  File "/home/jenkins/workspace/plone-5.2-python-2.7/src/plone.api/src/plone/api/content.py", line 88, in create
    container.invokeFactory(type, content_id, **kwargs)
  File "/home/jenkins/.buildout/eggs/cp27m/Products.CMFCore-2.5.1-py2.7.egg/Products/CMFCore/PortalFolder.py", line 300, in invokeFactory
    *args, **kw)
  File "/home/jenkins/.buildout/eggs/cp27m/Products.CMFCore-2.5.1-py2.7.egg/Products/CMFCore/TypesTool.py", line 809, in constructContent
    ob = info.constructInstance(container, id, *args, **kw)
  File "/home/jenkins/.buildout/eggs/cp27m/Products.CMFCore-2.5.1-py2.7.egg/Products/CMFCore/TypesTool.py", line 308, in constructInstance
    return self._constructInstance(container, id, *args, **kw)
  File "/home/jenkins/.buildout/eggs/cp27m/Products.CMFCore-2.5.1-py2.7.egg/Products/CMFCore/TypesTool.py", line 569, in _constructInstance
    notify(ObjectCreatedEvent(obj))
  File "/home/jenkins/.buildout/eggs/cp27m/zope.event-4.5.0-py2.7.egg/zope/event/__init__.py", line 32, in notify
    subscriber(event)
  File "/home/jenkins/.buildout/eggs/cp27m/zope.component-4.6.2-py2.7.egg/zope/component/event.py", line 27, in dispatch
    component_subscribers(event, None)
  File "/home/jenkins/.buildout/eggs/cp27m/zope.component-4.6.2-py2.7.egg/zope/component/_api.py", line 134, in subscribers
    return sitemanager.subscribers(objects, interface)
  File "/home/jenkins/.buildout/eggs/cp27m/zope.interface-5.2.0-py2.7-linux-x86_64.egg/zope/interface/registry.py", line 448, in subscribers
    return self.adapters.subscribers(objects, provided)
  File "/home/jenkins/.buildout/eggs/cp27m/zope.interface-5.2.0-py2.7-linux-x86_64.egg/zope/interface/adapter.py", line 619, in subscribers
    subscription(*objects)
  File "/home/jenkins/.buildout/eggs/cp27m/zope.component-4.6.2-py2.7.egg/zope/component/event.py", line 36, in objectEventNotify
    component_subscribers((event.object, event), None)
  File "/home/jenkins/.buildout/eggs/cp27m/zope.component-4.6.2-py2.7.egg/zope/component/_api.py", line 134, in subscribers
    return sitemanager.subscribers(objects, interface)
  File "/home/jenkins/.buildout/eggs/cp27m/zope.interface-5.2.0-py2.7-linux-x86_64.egg/zope/interface/registry.py", line 448, in subscribers
    return self.adapters.subscribers(objects, provided)
  File "/home/jenkins/.buildout/eggs/cp27m/zope.interface-5.2.0-py2.7-linux-x86_64.egg/zope/interface/adapter.py", line 619, in subscribers
    subscription(*objects)
  File "/home/jenkins/workspace/plone-5.2-python-2.7/src/plone.app.contenttypes/plone/app/contenttypes/subscribers.py", line 14, in set_title_description
    datafield = obj.image
  File "/home/jenkins/workspace/plone-5.2-python-2.7/src/plone.dexterity/plone/dexterity/content.py", line 411, in __getattr__
    raise AttributeError(name)


FAILED:  plone.api.tests.test_content.TestPloneApiContent.test_delete

Error Message:
image

Stack Trace:
image

  File "/srv/python2.7/lib/python2.7/unittest/case.py", line 320, in run
    self.setUp()
  File "/home/jenkins/workspace/plone-5.2-python-2.7/src/plone.api/src/plone/api/tests/test_content.py", line 113, in setUp
    id='image',
  File "<decorator-gen-9>", line 2, in create
  File "/home/jenkins/workspace/plone-5.2-python-2.7/src/plone.api/src/plone/api/validation.py", line 81, in wrapped
    return function(*args, **kwargs)
  File "<decorator-gen-8>", line 2, in create
  File "/home/jenkins/workspace/plone-5.2-python-2.7/src/plone.api/src/plone/api/validation.py", line 153, in wrapped
    return function(*args, **kwargs)
  File "/home/jenkins/workspace/plone-5.2-python-2.7/src/plone.api/src/plone/api/content.py", line 88, in create
    container.invokeFactory(type, content_id, **kwargs)
  File "/home/jenkins/.buildout/eggs/cp27m/Products.CMFCore-2.5.1-py2.7.egg/Products/CMFCore/PortalFolder.py", line 300, in invokeFactory
    *args, **kw)
  File "/home/jenkins/.buildout/eggs/cp27m/Products.CMFCore-2.5.1-py2.7.egg/Products/CMFCore/TypesTool.py", line 809, in constructContent
    ob = info.constructInstance(container, id, *args, **kw)
  File "/home/jenkins/.buildout/eggs/cp27m/Products.CMFCore-2.5.1-py2.7.egg/Products/CMFCore/TypesTool.py", line 308, in constructInstance
    return self._constructInstance(container, id, *args, **kw)
  File "/home/jenkins/.buildout/eggs/cp27m/Products.CMFCore-2.5.1-py2.7.egg/Products/CMFCore/TypesTool.py", line 569, in _constructInstance
    notify(ObjectCreatedEvent(obj))
  File "/home/jenkins/.buildout/eggs/cp27m/zope.event-4.5.0-py2.7.egg/zope/event/__init__.py", line 32, in notify
    subscriber(event)
  File "/home/jenkins/.buildout/eggs/cp27m/zope.component-4.6.2-py2.7.egg/zope/component/event.py", line 27, in dispatch
    component_subscribers(event, None)
  File "/home/jenkins/.buildout/eggs/cp27m/zope.component-4.6.2-py2.7.egg/zope/component/_api.py", line 134, in subscribers
    return sitemanager.subscribers(objects, interface)
  File "/home/jenkins/.buildout/eggs/cp27m/zope.interface-5.2.0-py2.7-linux-x86_64.egg/zope/interface/registry.py", line 448, in subscribers
    return self.adapters.subscribers(objects, provided)
  File "/home/jenkins/.buildout/eggs/cp27m/zope.interface-5.2.0-py2.7-linux-x86_64.egg/zope/interface/adapter.py", line 619, in subscribers
    subscription(*objects)
  File "/home/jenkins/.buildout/eggs/cp27m/zope.component-4.6.2-py2.7.egg/zope/component/event.py", line 36, in objectEventNotify
    component_subscribers((event.object, event), None)
  File "/home/jenkins/.buildout/eggs/cp27m/zope.component-4.6.2-py2.7.egg/zope/component/_api.py", line 134, in subscribers
    return sitemanager.subscribers(objects, interface)
  File "/home/jenkins/.buildout/eggs/cp27m/zope.interface-5.2.0-py2.7-linux-x86_64.egg/zope/interface/registry.py", line 448, in subscribers
    return self.adapters.subscribers(objects, provided)
  File "/home/jenkins/.buildout/eggs/cp27m/zope.interface-5.2.0-py2.7-linux-x86_64.egg/zope/interface/adapter.py", line 619, in subscribers
    subscription(*objects)
  File "/home/jenkins/workspace/plone-5.2-python-2.7/src/plone.app.contenttypes/plone/app/contenttypes/subscribers.py", line 14, in set_title_description
    datafield = obj.image
  File "/home/jenkins/workspace/plone-5.2-python-2.7/src/plone.dexterity/plone/dexterity/content.py", line 411, in __getattr__
    raise AttributeError(name)


FAILED:  plone.api.tests.test_content.TestPloneApiContent.test_delete_check_linkintegrity

Error Message:
image

Stack Trace:
image

  File "/srv/python2.7/lib/python2.7/unittest/case.py", line 320, in run
    self.setUp()
  File "/home/jenkins/workspace/plone-5.2-python-2.7/src/plone.api/src/plone/api/tests/test_content.py", line 113, in setUp
    id='image',
  File "<decorator-gen-9>", line 2, in create
  File "/home/jenkins/workspace/plone-5.2-python-2.7/src/plone.api/src/plone/api/validation.py", line 81, in wrapped
    return function(*args, **kwargs)
  File "<decorator-gen-8>", line 2, in create
  File "/home/jenkins/workspace/plone-5.2-python-2.7/src/plone.api/src/plone/api/validation.py", line 153, in wrapped
    return function(*args, **kwargs)
  File "/home/jenkins/workspace/plone-5.2-python-2.7/src/plone.api/src/plone/api/content.py", line 88, in create
    container.invokeFactory(type, content_id, **kwargs)
  File "/home/jenkins/.buildout/eggs/cp27m/Products.CMFCore-2.5.1-py2.7.egg/Products/CMFCore/PortalFolder.py", line 300, in invokeFactory
    *args, **kw)
  File "/home/jenkins/.buildout/eggs/cp27m/Products.CMFCore-2.5.1-py2.7.egg/Products/CMFCore/TypesTool.py", line 809, in constructContent
    ob = info.constructInstance(container, id, *args, **kw)
  File "/home/jenkins/.buildout/eggs/cp27m/Products.CMFCore-2.5.1-py2.7.egg/Products/CMFCore/TypesTool.py", line 308, in constructInstance
    return self._constructInstance(container, id, *args, **kw)
  File "/home/jenkins/.buildout/eggs/cp27m/Products.CMFCore-2.5.1-py2.7.egg/Products/CMFCore/TypesTool.py", line 569, in _constructInstance
    notify(ObjectCreatedEvent(obj))
  File "/home/jenkins/.buildout/eggs/cp27m/zope.event-4.5.0-py2.7.egg/zope/event/__init__.py", line 32, in notify
    subscriber(event)
  File "/home/jenkins/.buildout/eggs/cp27m/zope.component-4.6.2-py2.7.egg/zope/component/event.py", line 27, in dispatch
    component_subscribers(event, None)
  File "/home/jenkins/.buildout/eggs/cp27m/zope.component-4.6.2-py2.7.egg/zope/component/_api.py", line 134, in subscribers
    return sitemanager.subscribers(objects, interface)
  File "/home/jenkins/.buildout/eggs/cp27m/zope.interface-5.2.0-py2.7-linux-x86_64.egg/zope/interface/registry.py", line 448, in subscribers
    return self.adapters.subscribers(objects, provided)
  File "/home/jenkins/.buildout/eggs/cp27m/zope.interface-5.2.0-py2.7-linux-x86_64.egg/zope/interface/adapter.py", line 619, in subscribers
    subscription(*objects)
  File "/home/jenkins/.buildout/eggs/cp27m/zope.component-4.6.2-py2.7.egg/zope/component/event.py", line 36, in objectEventNotify
    component_subscribers((event.object, event), None)
  File "/home/jenkins/.buildout/eggs/cp27m/zope.component-4.6.2-py2.7.egg/zope/component/_api.py", line 134, in subscribers
    return sitemanager.subscribers(objects, interface)
  File "/home/jenkins/.buildout/eggs/cp27m/zope.interface-5.2.0-py2.7-linux-x86_64.egg/zope/interface/registry.py", line 448, in subscribers
    return self.adapters.subscribers(objects, provided)
  File "/home/jenkins/.buildout/eggs/cp27m/zope.interface-5.2.0-py2.7-linux-x86_64.egg/zope/interface/adapter.py", line 619, in subscribers
    subscription(*objects)
  File "/home/jenkins/workspace/plone-5.2-python-2.7/src/plone.app.contenttypes/plone/app/contenttypes/subscribers.py", line 14, in set_title_description
    datafield = obj.image
  File "/home/jenkins/workspace/plone-5.2-python-2.7/src/plone.dexterity/plone/dexterity/content.py", line 411, in __getattr__
    raise AttributeError(name)


FAILED:  plone.api.tests.test_content.TestPloneApiContent.test_delete_constraints

Error Message:
image

Stack Trace:
image

  File "/srv/python2.7/lib/python2.7/unittest/case.py", line 320, in run
    self.setUp()
  File "/home/jenkins/workspace/plone-5.2-python-2.7/src/plone.api/src/plone/api/tests/test_content.py", line 113, in setUp
    id='image',
  File "<decorator-gen-9>", line 2, in create
  File "/home/jenkins/workspace/plone-5.2-python-2.7/src/plone.api/src/plone/api/validation.py", line 81, in wrapped
    return function(*args, **kwargs)
  File "<decorator-gen-8>", line 2, in create
  File "/home/jenkins/workspace/plone-5.2-python-2.7/src/plone.api/src/plone/api/validation.py", line 153, in wrapped
    return function(*args, **kwargs)
  File "/home/jenkins/workspace/plone-5.2-python-2.7/src/plone.api/src/plone/api/content.py", line 88, in create
    container.invokeFactory(type, content_id, **kwargs)
  File "/home/jenkins/.buildout/eggs/cp27m/Products.CMFCore-2.5.1-py2.7.egg/Products/CMFCore/PortalFolder.py", line 300, in invokeFactory
    *args, **kw)
  File "/home/jenkins/.buildout/eggs/cp27m/Products.CMFCore-2.5.1-py2.7.egg/Products/CMFCore/TypesTool.py", line 809, in constructContent
    ob = info.constructInstance(container, id, *args, **kw)
  File "/home/jenkins/.buildout/eggs/cp27m/Products.CMFCore-2.5.1-py2.7.egg/Products/CMFCore/TypesTool.py", line 308, in constructInstance
    return self._constructInstance(container, id, *args, **kw)
  File "/home/jenkins/.buildout/eggs/cp27m/Products.CMFCore-2.5.1-py2.7.egg/Products/CMFCore/TypesTool.py", line 569, in _constructInstance
    notify(ObjectCreatedEvent(obj))
  File "/home/jenkins/.buildout/eggs/cp27m/zope.event-4.5.0-py2.7.egg/zope/event/__init__.py", line 32, in notify
    subscriber(event)
  File "/home/jenkins/.buildout/eggs/cp27m/zope.component-4.6.2-py2.7.egg/zope/component/event.py", line 27, in dispatch
    component_subscribers(event, None)
  File "/home/jenkins/.buildout/eggs/cp27m/zope.component-4.6.2-py2.7.egg/zope/component/_api.py", line 134, in subscribers
    return sitemanager.subscribers(objects, interface)
  File "/home/jenkins/.buildout/eggs/cp27m/zope.interface-5.2.0-py2.7-linux-x86_64.egg/zope/interface/registry.py", line 448, in subscribers
    return self.adapters.subscribers(objects, provided)
  File "/home/jenkins/.buildout/eggs/cp27m/zope.interface-5.2.0-py2.7-linux-x86_64.egg/zope/interface/adapter.py", line 619, in subscribers
    subscription(*objects)
  File "/home/jenkins/.buildout/eggs/cp27m/zope.component-4.6.2-py2.7.egg/zope/component/event.py", line 36, in objectEventNotify
    component_subscribers((event.object, event), None)
  File "/home/jenkins/.buildout/eggs/cp27m/zope.component-4.6.2-py2.7.egg/zope/component/_api.py", line 134, in subscribers
    return sitemanager.subscribers(objects, interface)
  File "/home/jenkins/.buildout/eggs/cp27m/zope.interface-5.2.0-py2.7-linux-x86_64.egg/zope/interface/registry.py", line 448, in subscribers
    return self.adapters.subscribers(objects, provided)
  File "/home/jenkins/.buildout/eggs/cp27m/zope.interface-5.2.0-py2.7-linux-x86_64.egg/zope/interface/adapter.py", line 619, in subscribers
    subscription(*objects)
  File "/home/jenkins/workspace/plone-5.2-python-2.7/src/plone.app.contenttypes/plone/app/contenttypes/subscribers.py", line 14, in set_title_description
    datafield = obj.image
  File "/home/jenkins/workspace/plone-5.2-python-2.7/src/plone.dexterity/plone/dexterity/content.py", line 411, in __getattr__
    raise AttributeError(name)


FAILED:  plone.api.tests.test_content.TestPloneApiContent.test_delete_ignore_linkintegrity

Error Message:
image

Stack Trace:
image

  File "/srv/python2.7/lib/python2.7/unittest/case.py", line 320, in run
    self.setUp()
  File "/home/jenkins/workspace/plone-5.2-python-2.7/src/plone.api/src/plone/api/tests/test_content.py", line 113, in setUp
    id='image',
  File "<decorator-gen-9>", line 2, in create
  File "/home/jenkins/workspace/plone-5.2-python-2.7/src/plone.api/src/plone/api/validation.py", line 81, in wrapped
    return function(*args, **kwargs)
  File "<decorator-gen-8>", line 2, in create
  File "/home/jenkins/workspace/plone-5.2-python-2.7/src/plone.api/src/plone/api/validation.py", line 153, in wrapped
    return function(*args, **kwargs)
  File "/home/jenkins/workspace/plone-5.2-python-2.7/src/plone.api/src/plone/api/content.py", line 88, in create
    container.invokeFactory(type, content_id, **kwargs)
  File "/home/jenkins/.buildout/eggs/cp27m/Products.CMFCore-2.5.1-py2.7.egg/Products/CMFCore/PortalFolder.py", line 300, in invokeFactory
    *args, **kw)
  File "/home/jenkins/.buildout/eggs/cp27m/Products.CMFCore-2.5.1-py2.7.egg/Products/CMFCore/TypesTool.py", line 809, in constructContent
    ob = info.constructInstance(container, id, *args, **kw)
  File "/home/jenkins/.buildout/eggs/cp27m/Products.CMFCore-2.5.1-py2.7.egg/Products/CMFCore/TypesTool.py", line 308, in constructInstance
    return self._constructInstance(container, id, *args, **kw)
  File "/home/jenkins/.buildout/eggs/cp27m/Products.CMFCore-2.5.1-py2.7.egg/Products/CMFCore/TypesTool.py", line 569, in _constructInstance
    notify(ObjectCreatedEvent(obj))
  File "/home/jenkins/.buildout/eggs/cp27m/zope.event-4.5.0-py2.7.egg/zope/event/__init__.py", line 32, in notify
    subscriber(event)
  File "/home/jenkins/.buildout/eggs/cp27m/zope.component-4.6.2-py2.7.egg/zope/component/event.py", line 27, in dispatch
    component_subscribers(event, None)
  File "/home/jenkins/.buildout/eggs/cp27m/zope.component-4.6.2-py2.7.egg/zope/component/_api.py", line 134, in subscribers
    return sitemanager.subscribers(objects, interface)
  File "/home/jenkins/.buildout/eggs/cp27m/zope.interface-5.2.0-py2.7-linux-x86_64.egg/zope/interface/registry.py", line 448, in subscribers
    return self.adapters.subscribers(objects, provided)
  File "/home/jenkins/.buildout/eggs/cp27m/zope.interface-5.2.0-py2.7-linux-x86_64.egg/zope/interface/adapter.py", line 619, in subscribers
    subscription(*objects)
  File "/home/jenkins/.buildout/eggs/cp27m/zope.component-4.6.2-py2.7.egg/zope/component/event.py", line 36, in objectEventNotify
    component_subscribers((event.object, event), None)
  File "/home/jenkins/.buildout/eggs/cp27m/zope.component-4.6.2-py2.7.egg/zope/component/_api.py", line 134, in subscribers
    return sitemanager.subscribers(objects, interface)
  File "/home/jenkins/.buildout/eggs/cp27m/zope.interface-5.2.0-py2.7-linux-x86_64.egg/zope/interface/registry.py", line 448, in subscribers
    return self.adapters.subscribers(objects, provided)
  File "/home/jenkins/.buildout/eggs/cp27m/zope.interface-5.2.0-py2.7-linux-x86_64.egg/zope/interface/adapter.py", line 619, in subscribers
    subscription(*objects)
  File "/home/jenkins/workspace/plone-5.2-python-2.7/src/plone.app.contenttypes/plone/app/contenttypes/subscribers.py", line 14, in set_title_description
    datafield = obj.image
  File "/home/jenkins/workspace/plone-5.2-python-2.7/src/plone.dexterity/plone/dexterity/content.py", line 411, in __getattr__
    raise AttributeError(name)


FAILED:  plone.api.tests.test_content.TestPloneApiContent.test_delete_multiple

Error Message:
image

Stack Trace:
image

  File "/srv/python2.7/lib/python2.7/unittest/case.py", line 320, in run
    self.setUp()
  File "/home/jenkins/workspace/plone-5.2-python-2.7/src/plone.api/src/plone/api/tests/test_content.py", line 113, in setUp
    id='image',
  File "<decorator-gen-9>", line 2, in create
  File "/home/jenkins/workspace/plone-5.2-python-2.7/src/plone.api/src/plone/api/validation.py", line 81, in wrapped
    return function(*args, **kwargs)
  File "<decorator-gen-8>", line 2, in create
  File "/home/jenkins/workspace/plone-5.2-python-2.7/src/plone.api/src/plone/api/validation.py", line 153, in wrapped
    return function(*args, **kwargs)
  File "/home/jenkins/workspace/plone-5.2-python-2.7/src/plone.api/src/plone/api/content.py", line 88, in create
    container.invokeFactory(type, content_id, **kwargs)
  File "/home/jenkins/.buildout/eggs/cp27m/Products.CMFCore-2.5.1-py2.7.egg/Products/CMFCore/PortalFolder.py", line 300, in invokeFactory
    *args, **kw)
  File "/home/jenkins/.buildout/eggs/cp27m/Products.CMFCore-2.5.1-py2.7.egg/Products/CMFCore/TypesTool.py", line 809, in constructContent
    ob = info.constructInstance(container, id, *args, **kw)
  File "/home/jenkins/.buildout/eggs/cp27m/Products.CMFCore-2.5.1-py2.7.egg/Products/CMFCore/TypesTool.py", line 308, in constructInstance
    return self._constructInstance(container, id, *args, **kw)
  File "/home/jenkins/.buildout/eggs/cp27m/Products.CMFCore-2.5.1-py2.7.egg/Products/CMFCore/TypesTool.py", line 569, in _constructInstance
    notify(ObjectCreatedEvent(obj))
  File "/home/jenkins/.buildout/eggs/cp27m/zope.event-4.5.0-py2.7.egg/zope/event/__init__.py", line 32, in notify
    subscriber(event)
  File "/home/jenkins/.buildout/eggs/cp27m/zope.component-4.6.2-py2.7.egg/zope/component/event.py", line 27, in dispatch
    component_subscribers(event, None)
  File "/home/jenkins/.buildout/eggs/cp27m/zope.component-4.6.2-py2.7.egg/zope/component/_api.py", line 134, in subscribers
    return sitemanager.subscribers(objects, interface)
  File "/home/jenkins/.buildout/eggs/cp27m/zope.interface-5.2.0-py2.7-linux-x86_64.egg/zope/interface/registry.py", line 448, in subscribers
    return self.adapters.subscribers(objects, provided)
  File "/home/jenkins/.buildout/eggs/cp27m/zope.interface-5.2.0-py2.7-linux-x86_64.egg/zope/interface/adapter.py", line 619, in subscribers
    subscription(*objects)
  File "/home/jenkins/.buildout/eggs/cp27m/zope.component-4.6.2-py2.7.egg/zope/component/event.py", line 36, in objectEventNotify
    component_subscribers((event.object, event), None)
  File "/home/jenkins/.buildout/eggs/cp27m/zope.component-4.6.2-py2.7.egg/zope/component/_api.py", line 134, in subscribers
    return sitemanager.subscribers(objects, interface)
  File "/home/jenkins/.buildout/eggs/cp27m/zope.interface-5.2.0-py2.7-linux-x86_64.egg/zope/interface/registry.py", line 448, in subscribers
    return self.adapters.subscribers(objects, provided)
  File "/home/jenkins/.buildout/eggs/cp27m/zope.interface-5.2.0-py2.7-linux-x86_64.egg/zope/interface/adapter.py", line 619, in subscribers
    subscription(*objects)
  File "/home/jenkins/workspace/plone-5.2-python-2.7/src/plone.app.contenttypes/plone/app/contenttypes/subscribers.py", line 14, in set_title_description
    datafield = obj.image
  File "/home/jenkins/workspace/plone-5.2-python-2.7/src/plone.dexterity/plone/dexterity/content.py", line 411, in __getattr__
    raise AttributeError(name)


FAILED:  plone.api.tests.test_content.TestPloneApiContent.test_delete_multiple_check_linkintegrity

Error Message:
image

Stack Trace:
image

  File "/srv/python2.7/lib/python2.7/unittest/case.py", line 320, in run
    self.setUp()
  File "/home/jenkins/workspace/plone-5.2-python-2.7/src/plone.api/src/plone/api/tests/test_content.py", line 113, in setUp
    id='image',
  File "<decorator-gen-9>", line 2, in create
  File "/home/jenkins/workspace/plone-5.2-python-2.7/src/plone.api/src/plone/api/validation.py", line 81, in wrapped
    return function(*args, **kwargs)
  File "<decorator-gen-8>", line 2, in create
  File "/home/jenkins/workspace/plone-5.2-python-2.7/src/plone.api/src/plone/api/validation.py", line 153, in wrapped
    return function(*args, **kwargs)
  File "/home/jenkins/workspace/plone-5.2-python-2.7/src/plone.api/src/plone/api/content.py", line 88, in create
    container.invokeFactory(type, content_id, **kwargs)
  File "/home/jenkins/.buildout/eggs/cp27m/Products.CMFCore-2.5.1-py2.7.egg/Products/CMFCore/PortalFolder.py", line 300, in invokeFactory
    *args, **kw)
  File "/home/jenkins/.buildout/eggs/cp27m/Products.CMFCore-2.5.1-py2.7.egg/Products/CMFCore/TypesTool.py", line 809, in constructContent
    ob = info.constructInstance(container, id, *args, **kw)
  File "/home/jenkins/.buildout/eggs/cp27m/Products.CMFCore-2.5.1-py2.7.egg/Products/CMFCore/TypesTool.py", line 308, in constructInstance
    return self._constructInstance(container, id, *args, **kw)
  File "/home/jenkins/.buildout/eggs/cp27m/Products.CMFCore-2.5.1-py2.7.egg/Products/CMFCore/TypesTool.py", line 569, in _constructInstance
    notify(ObjectCreatedEvent(obj))
  File "/home/jenkins/.buildout/eggs/cp27m/zope.event-4.5.0-py2.7.egg/zope/event/__init__.py", line 32, in notify
    subscriber(event)
  File "/home/jenkins/.buildout/eggs/cp27m/zope.component-4.6.2-py2.7.egg/zope/component/event.py", line 27, in dispatch
    component_subscribers(event, None)
  File "/home/jenkins/.buildout/eggs/cp27m/zope.component-4.6.2-py2.7.egg/zope/component/_api.py", line 134, in subscribers
    return sitemanager.subscribers(objects, interface)
  File "/home/jenkins/.buildout/eggs/cp27m/zope.interface-5.2.0-py2.7-linux-x86_64.egg/zope/interface/registry.py", line 448, in subscribers
    return self.adapters.subscribers(objects, provided)
  File "/home/jenkins/.buildout/eggs/cp27m/zope.interface-5.2.0-py2.7-linux-x86_64.egg/zope/interface/adapter.py", line 619, in subscribers
    subscription(*objects)
  File "/home/jenkins/.buildout/eggs/cp27m/zope.component-4.6.2-py2.7.egg/zope/component/event.py", line 36, in objectEventNotify
    component_subscribers((event.object, event), None)
  File "/home/jenkins/.buildout/eggs/cp27m/zope.component-4.6.2-py2.7.egg/zope/component/_api.py", line 134, in subscribers
    return sitemanager.subscribers(objects, interface)
  File "/home/jenkins/.buildout/eggs/cp27m/zope.interface-5.2.0-py2.7-linux-x86_64.egg/zope/interface/registry.py", line 448, in subscribers
    return self.adapters.subscribers(objects, provided)
  File "/home/jenkins/.buildout/eggs/cp27m/zope.interface-5.2.0-py2.7-linux-x86_64.egg/zope/interface/adapter.py", line 619, in subscribers
    subscription(*objects)
  File "/home/jenkins/workspace/plone-5.2-python-2.7/src/plone.app.contenttypes/plone/app/contenttypes/subscribers.py", line 14, in set_title_description
    datafield = obj.image
  File "/home/jenkins/workspace/plone-5.2-python-2.7/src/plone.dexterity/plone/dexterity/content.py", line 411, in __getattr__
    raise AttributeError(name)


FAILED:  plone.api.tests.test_content.TestPloneApiContent.test_delete_multiple_ignore_linkintegrity

Error Message:
image

Stack Trace:
image

  File "/srv/python2.7/lib/python2.7/unittest/case.py", line 320, in run
    self.setUp()
  File "/home/jenkins/workspace/plone-5.2-python-2.7/src/plone.api/src/plone/api/tests/test_content.py", line 113, in setUp
    id='image',
  File "<decorator-gen-9>", line 2, in create
  File "/home/jenkins/workspace/plone-5.2-python-2.7/src/plone.api/src/plone/api/validation.py", line 81, in wrapped
    return function(*args, **kwargs)
  File "<decorator-gen-8>", line 2, in create
  File "/home/jenkins/workspace/plone-5.2-python-2.7/src/plone.api/src/plone/api/validation.py", line 153, in wrapped
    return function(*args, **kwargs)
  File "/home/jenkins/workspace/plone-5.2-python-2.7/src/plone.api/src/plone/api/content.py", line 88, in create
    container.invokeFactory(type, content_id, **kwargs)
  File "/home/jenkins/.buildout/eggs/cp27m/Products.CMFCore-2.5.1-py2.7.egg/Products/CMFCore/PortalFolder.py", line 300, in invokeFactory
    *args, **kw)
  File "/home/jenkins/.buildout/eggs/cp27m/Products.CMFCore-2.5.1-py2.7.egg/Products/CMFCore/TypesTool.py", line 809, in constructContent
    ob = info.constructInstance(container, id, *args, **kw)
  File "/home/jenkins/.buildout/eggs/cp27m/Products.CMFCore-2.5.1-py2.7.egg/Products/CMFCore/TypesTool.py", line 308, in constructInstance
    return self._constructInstance(container, id, *args, **kw)
  File "/home/jenkins/.buildout/eggs/cp27m/Products.CMFCore-2.5.1-py2.7.egg/Products/CMFCore/TypesTool.py", line 569, in _constructInstance
    notify(ObjectCreatedEvent(obj))
  File "/home/jenkins/.buildout/eggs/cp27m/zope.event-4.5.0-py2.7.egg/zope/event/__init__.py", line 32, in notify
    subscriber(event)
  File "/home/jenkins/.buildout/eggs/cp27m/zope.component-4.6.2-py2.7.egg/zope/component/event.py", line 27, in dispatch
    component_subscribers(event, None)
  File "/home/jenkins/.buildout/eggs/cp27m/zope.component-4.6.2-py2.7.egg/zope/component/_api.py", line 134, in subscribers
    return sitemanager.subscribers(objects, interface)
  File "/home/jenkins/.buildout/eggs/cp27m/zope.interface-5.2.0-py2.7-linux-x86_64.egg/zope/interface/registry.py", line 448, in subscribers
    return self.adapters.subscribers(objects, provided)
  File "/home/jenkins/.buildout/eggs/cp27m/zope.interface-5.2.0-py2.7-linux-x86_64.egg/zope/interface/adapter.py", line 619, in subscribers
    subscription(*objects)
  File "/home/jenkins/.buildout/eggs/cp27m/zope.component-4.6.2-py2.7.egg/zope/component/event.py", line 36, in objectEventNotify
    component_subscribers((event.object, event), None)
  File "/home/jenkins/.buildout/eggs/cp27m/zope.component-4.6.2-py2.7.egg/zope/component/_api.py", line 134, in subscribers
    return sitemanager.subscribers(objects, interface)
  File "/home/jenkins/.buildout/eggs/cp27m/zope.interface-5.2.0-py2.7-linux-x86_64.egg/zope/interface/registry.py", line 448, in subscribers
    return self.adapters.subscribers(objects, provided)
  File "/home/jenkins/.buildout/eggs/cp27m/zope.interface-5.2.0-py2.7-linux-x86_64.egg/zope/interface/adapter.py", line 619, in subscribers
    subscription(*objects)
  File "/home/jenkins/workspace/plone-5.2-python-2.7/src/plone.app.contenttypes/plone/app/contenttypes/subscribers.py", line 14, in set_title_description
    datafield = obj.image
  File "/home/jenkins/workspace/plone-5.2-python-2.7/src/plone.dexterity/plone/dexterity/content.py", line 411, in __getattr__
    raise AttributeError(name)


FAILED:  plone.api.tests.test_content.TestPloneApiContent.test_delete_no_objs

Error Message:
image

Stack Trace:
image

  File "/srv/python2.7/lib/python2.7/unittest/case.py", line 320, in run
    self.setUp()
  File "/home/jenkins/workspace/plone-5.2-python-2.7/src/plone.api/src/plone/api/tests/test_content.py", line 113, in setUp
    id='image',
  File "<decorator-gen-9>", line 2, in create
  File "/home/jenkins/workspace/plone-5.2-python-2.7/src/plone.api/src/plone/api/validation.py", line 81, in wrapped
    return function(*args, **kwargs)
  File "<decorator-gen-8>", line 2, in create
  File "/home/jenkins/workspace/plone-5.2-python-2.7/src/plone.api/src/plone/api/validation.py", line 153, in wrapped
    return function(*args, **kwargs)
  File "/home/jenkins/workspace/plone-5.2-python-2.7/src/plone.api/src/plone/api/content.py", line 88, in create
    container.invokeFactory(type, content_id, **kwargs)
  File "/home/jenkins/.buildout/eggs/cp27m/Products.CMFCore-2.5.1-py2.7.egg/Products/CMFCore/PortalFolder.py", line 300, in invokeFactory
    *args, **kw)
  File "/home/jenkins/.buildout/eggs/cp27m/Products.CMFCore-2.5.1-py2.7.egg/Products/CMFCore/TypesTool.py", line 809, in constructContent
    ob = info.constructInstance(container, id, *args, **kw)
  File "/home/jenkins/.buildout/eggs/cp27m/Products.CMFCore-2.5.1-py2.7.egg/Products/CMFCore/TypesTool.py", line 308, in constructInstance
    return self._constructInstance(container, id, *args, **kw)
  File "/home/jenkins/.buildout/eggs/cp27m/Products.CMFCore-2.5.1-py2.7.egg/Products/CMFCore/TypesTool.py", line 569, in _constructInstance
    notify(ObjectCreatedEvent(obj))
  File "/home/jenkins/.buildout/eggs/cp27m/zope.event-4.5.0-py2.7.egg/zope/event/__init__.py", line 32, in notify
    subscriber(event)
  File "/home/jenkins/.buildout/eggs/cp27m/zope.component-4.6.2-py2.7.egg/zope/component/event.py", line 27, in dispatch
    component_subscribers(event, None)
  File "/home/jenkins/.buildout/eggs/cp27m/zope.component-4.6.2-py2.7.egg/zope/component/_api.py", line 134, in subscribers
    return sitemanager.subscribers(objects, interface)
  File "/home/jenkins/.buildout/eggs/cp27m/zope.interface-5.2.0-py2.7-linux-x86_64.egg/zope/interface/registry.py", line 448, in subscribers
    return self.adapters.subscribers(objects, provided)
  File "/home/jenkins/.buildout/eggs/cp27m/zope.interface-5.2.0-py2.7-linux-x86_64.egg/zope/interface/adapter.py", line 619, in subscribers
    subscription(*objects)
  File "/home/jenkins/.buildout/eggs/cp27m/zope.component-4.6.2-py2.7.egg/zope/component/event.py", line 36, in objectEventNotify
    component_subscribers((event.object, event), None)
  File "/home/jenkins/.buildout/eggs/cp27m/zope.component-4.6.2-py2.7.egg/zope/component/_api.py", line 134, in subscribers
    return sitemanager.subscribers(objects, interface)
  File "/home/jenkins/.buildout/eggs/cp27m/zope.interface-5.2.0-py2.7-linux-x86_64.egg/zope/interface/registry.py", line 448, in subscribers
    return self.adapters.subscribers(objects, provided)
  File "/home/jenkins/.buildout/eggs/cp27m/zope.interface-5.2.0-py2.7-linux-x86_64.egg/zope/interface/adapter.py", line 619, in subscribers
    subscription(*objects)
  File "/home/jenkins/workspace/plone-5.2-python-2.7/src/plone.app.contenttypes/plone/app/contenttypes/subscribers.py", line 14, in set_title_description
    datafield = obj.image
  File "/home/jenkins/workspace/plone-5.2-python-2.7/src/plone.dexterity/plone/dexterity/content.py", line 411, in __getattr__
    raise AttributeError(name)


FAILED:  plone.api.tests.test_content.TestPloneApiContent.test_delete_with_internal_breaches

Error Message:
image

Stack Trace:
image

  File "/srv/python2.7/lib/python2.7/unittest/case.py", line 320, in run
    self.setUp()
  File "/home/jenkins/workspace/plone-5.2-python-2.7/src/plone.api/src/plone/api/tests/test_content.py", line 113, in setUp
    id='image',
  File "<decorator-gen-9>", line 2, in create
  File "/home/jenkins/workspace/plone-5.2-python-2.7/src/plone.api/src/plone/api/validation.py", line 81, in wrapped
    return function(*args, **kwargs)
  File "<decorator-gen-8>", line 2, in create
  File "/home/jenkins/workspace/plone-5.2-python-2.7/src/plone.api/src/plone/api/validation.py", line 153, in wrapped
    return function(*args, **kwargs)
  File "/home/jenkins/workspace/plone-5.2-python-2.7/src/plone.api/src/plone/api/content.py", line 88, in create
    container.invokeFactory(type, content_id, **kwargs)
  File "/home/jenkins/.buildout/eggs/cp27m/Products.CMFCore-2.5.1-py2.7.egg/Products/CMFCore/PortalFolder.py", line 300, in invokeFactory
    *args, **kw)
  File "/home/jenkins/.buildout/eggs/cp27m/Products.CMFCore-2.5.1-py2.7.egg/Products/CMFCore/TypesTool.py", line 809, in constructContent
    ob = info.constructInstance(container, id, *args, **kw)
  File "/home/jenkins/.buildout/eggs/cp27m/Products.CMFCore-2.5.1-py2.7.egg/Products/CMFCore/TypesTool.py", line 308, in constructInstance
    return self._constructInstance(container, id, *args, **kw)
  File "/home/jenkins/.buildout/eggs/cp27m/Products.CMFCore-2.5.1-py2.7.egg/Products/CMFCore/TypesTool.py", line 569, in _constructInstance
    notify(ObjectCreatedEvent(obj))
  File "/home/jenkins/.buildout/eggs/cp27m/zope.event-4.5.0-py2.7.egg/zope/event/__init__.py", line 32, in notify
    subscriber(event)
  File "/home/jenkins/.buildout/eggs/cp27m/zope.component-4.6.2-py2.7.egg/zope/component/event.py", line 27, in dispatch
    component_subscribers(event, None)
  File "/home/jenkins/.buildout/eggs/cp27m/zope.component-4.6.2-py2.7.egg/zope/component/_api.py", line 134, in subscribers
    return sitemanager.subscribers(objects, interface)
  File "/home/jenkins/.buildout/eggs/cp27m/zope.interface-5.2.0-py2.7-linux-x86_64.egg/zope/interface/registry.py", line 448, in subscribers
    return self.adapters.subscribers(objects, provided)
  File "/home/jenkins/.buildout/eggs/cp27m/zope.interface-5.2.0-py2.7-linux-x86_64.egg/zope/interface/adapter.py", line 619, in subscribers
    subscription(*objects)
  File "/home/jenkins/.buildout/eggs/cp27m/zope.component-4.6.2-py2.7.egg/zope/component/event.py", line 36, in objectEventNotify
    component_subscribers((event.object, event), None)
  File "/home/jenkins/.buildout/eggs/cp27m/zope.component-4.6.2-py2.7.egg/zope/component/_api.py", line 134, in subscribers
    return sitemanager.subscribers(objects, interface)
  File "/home/jenkins/.buildout/eggs/cp27m/zope.interface-5.2.0-py2.7-linux-x86_64.egg/zope/interface/registry.py", line 448, in subscribers
    return self.adapters.subscribers(objects, provided)
  File "/home/jenkins/.buildout/eggs/cp27m/zope.interface-5.2.0-py2.7-linux-x86_64.egg/zope/interface/adapter.py", line 619, in subscribers
    subscription(*objects)
  File "/home/jenkins/workspace/plone-5.2-python-2.7/src/plone.app.contenttypes/plone/app/contenttypes/subscribers.py", line 14, in set_title_description
    datafield = obj.image
  File "/home/jenkins/workspace/plone-5.2-python-2.7/src/plone.dexterity/plone/dexterity/content.py", line 411, in __getattr__
    raise AttributeError(name)


FAILED:  plone.api.tests.test_content.TestPloneApiContent.test_delete_with_resolved_internal_breaches

Error Message:
image

Stack Trace:
image

  File "/srv/python2.7/lib/python2.7/unittest/case.py", line 320, in run
    self.setUp()
  File "/home/jenkins/workspace/plone-5.2-python-2.7/src/plone.api/src/plone/api/tests/test_content.py", line 113, in setUp
    id='image',
  File "<decorator-gen-9>", line 2, in create
  File "/home/jenkins/workspace/plone-5.2-python-2.7/src/plone.api/src/plone/api/validation.py", line 81, in wrapped
    return function(*args, **kwargs)
  File "<decorator-gen-8>", line 2, in create
  File "/home/jenkins/workspace/plone-5.2-python-2.7/src/plone.api/src/plone/api/validation.py", line 153, in wrapped
    return function(*args, **kwargs)
  File "/home/jenkins/workspace/plone-5.2-python-2.7/src/plone.api/src/plone/api/content.py", line 88, in create
    container.invokeFactory(type, content_id, **kwargs)
  File "/home/jenkins/.buildout/eggs/cp27m/Products.CMFCore-2.5.1-py2.7.egg/Products/CMFCore/PortalFolder.py", line 300, in invokeFactory
    *args, **kw)
  File "/home/jenkins/.buildout/eggs/cp27m/Products.CMFCore-2.5.1-py2.7.egg/Products/CMFCore/TypesTool.py", line 809, in constructContent
    ob = info.constructInstance(container, id, *args, **kw)
  File "/home/jenkins/.buildout/eggs/cp27m/Products.CMFCore-2.5.1-py2.7.egg/Products/CMFCore/TypesTool.py", line 308, in constructInstance
    return self._constructInstance(container, id, *args, **kw)
  File "/home/jenkins/.buildout/eggs/cp27m/Products.CMFCore-2.5.1-py2.7.egg/Products/CMFCore/TypesTool.py", line 569, in _constructInstance
    notify(ObjectCreatedEvent(obj))
  File "/home/jenkins/.buildout/eggs/cp27m/zope.event-4.5.0-py2.7.egg/zope/event/__init__.py", line 32, in notify
    subscriber(event)
  File "/home/jenkins/.buildout/eggs/cp27m/zope.component-4.6.2-py2.7.egg/zope/component/event.py", line 27, in dispatch
    component_subscribers(event, None)
  File "/home/jenkins/.buildout/eggs/cp27m/zope.component-4.6.2-py2.7.egg/zope/component/_api.py", line 134, in subscribers
    return sitemanager.subscribers(objects, interface)
  File "/home/jenkins/.buildout/eggs/cp27m/zope.interface-5.2.0-py2.7-linux-x86_64.egg/zope/interface/registry.py", line 448, in subscribers
    return self.adapters.subscribers(objects, provided)
  File "/home/jenkins/.buildout/eggs/cp27m/zope.interface-5.2.0-py2.7-linux-x86_64.egg/zope/interface/adapter.py", line 619, in subscribers
    subscription(*objects)
  File "/home/jenkins/.buildout/eggs/cp27m/zope.component-4.6.2-py2.7.egg/zope/component/event.py", line 36, in objectEventNotify
    component_subscribers((event.object, event), None)
  File "/home/jenkins/.buildout/eggs/cp27m/zope.component-4.6.2-py2.7.egg/zope/component/_api.py", line 134, in subscribers
    return sitemanager.subscribers(objects, interface)
  File "/home/jenkins/.buildout/eggs/cp27m/zope.interface-5.2.0-py2.7-linux-x86_64.egg/zope/interface/registry.py", line 448, in subscribers
    return self.adapters.subscribers(objects, provided)
  File "/home/jenkins/.buildout/eggs/cp27m/zope.interface-5.2.0-py2.7-linux-x86_64.egg/zope/interface/adapter.py", line 619, in subscribers
    subscription(*objects)
  File "/home/jenkins/workspace/plone-5.2-python-2.7/src/plone.app.contenttypes/plone/app/contenttypes/subscribers.py", line 14, in set_title_description
    datafield = obj.image
  File "/home/jenkins/workspace/plone-5.2-python-2.7/src/plone.dexterity/plone/dexterity/content.py", line 411, in __getattr__
    raise AttributeError(name)


FAILED:  plone.api.tests.test_content.TestPloneApiContent.test_diable_roles_acquisition

Error Message:
image

Stack Trace:
image

  File "/srv/python2.7/lib/python2.7/unittest/case.py", line 320, in run
    self.setUp()
  File "/home/jenkins/workspace/plone-5.2-python-2.7/src/plone.api/src/plone/api/tests/test_content.py", line 113, in setUp
    id='image',
  File "<decorator-gen-9>", line 2, in create
  File "/home/jenkins/workspace/plone-5.2-python-2.7/src/plone.api/src/plone/api/validation.py", line 81, in wrapped
    return function(*args, **kwargs)
  File "<decorator-gen-8>", line 2, in create
  File "/home/jenkins/workspace/plone-5.2-python-2.7/src/plone.api/src/plone/api/validation.py", line 153, in wrapped
    return function(*args, **kwargs)
  File "/home/jenkins/workspace/plone-5.2-python-2.7/src/plone.api/src/plone/api/content.py", line 88, in create
    container.invokeFactory(type, content_id, **kwargs)
  File "/home/jenkins/.buildout/eggs/cp27m/Products.CMFCore-2.5.1-py2.7.egg/Products/CMFCore/PortalFolder.py", line 300, in invokeFactory
    *args, **kw)
  File "/home/jenkins/.buildout/eggs/cp27m/Products.CMFCore-2.5.1-py2.7.egg/Products/CMFCore/TypesTool.py", line 809, in constructContent
    ob = info.constructInstance(container, id, *args, **kw)
  File "/home/jenkins/.buildout/eggs/cp27m/Products.CMFCore-2.5.1-py2.7.egg/Products/CMFCore/TypesTool.py", line 308, in constructInstance
    return self._constructInstance(container, id, *args, **kw)
  File "/home/jenkins/.buildout/eggs/cp27m/Products.CMFCore-2.5.1-py2.7.egg/Products/CMFCore/TypesTool.py", line 569, in _constructInstance
    notify(ObjectCreatedEvent(obj))
  File "/home/jenkins/.buildout/eggs/cp27m/zope.event-4.5.0-py2.7.egg/zope/event/__init__.py", line 32, in notify
    subscriber(event)
  File "/home/jenkins/.buildout/eggs/cp27m/zope.component-4.6.2-py2.7.egg/zope/component/event.py", line 27, in dispatch
    component_subscribers(event, None)
  File "/home/jenkins/.buildout/eggs/cp27m/zope.component-4.6.2-py2.7.egg/zope/component/_api.py", line 134, in subscribers
    return sitemanager.subscribers(objects, interface)
  File "/home/jenkins/.buildout/eggs/cp27m/zope.interface-5.2.0-py2.7-linux-x86_64.egg/zope/interface/registry.py", line 448, in subscribers
    return self.adapters.subscribers(objects, provided)
  File "/home/jenkins/.buildout/eggs/cp27m/zope.interface-5.2.0-py2.7-linux-x86_64.egg/zope/interface/adapter.py", line 619, in subscribers
    subscription(*objects)
  File "/home/jenkins/.buildout/eggs/cp27m/zope.component-4.6.2-py2.7.egg/zope/component/event.py", line 36, in objectEventNotify
    component_subscribers((event.object, event), None)
  File "/home/jenkins/.buildout/eggs/cp27m/zope.component-4.6.2-py2.7.egg/zope/component/_api.py", line 134, in subscribers
    return sitemanager.subscribers(objects, interface)
  File "/home/jenkins/.buildout/eggs/cp27m/zope.interface-5.2.0-py2.7-linux-x86_64.egg/zope/interface/registry.py", line 448, in subscribers
    return self.adapters.subscribers(objects, provided)
  File "/home/jenkins/.buildout/eggs/cp27m/zope.interface-5.2.0-py2.7-linux-x86_64.egg/zope/interface/adapter.py", line 619, in subscribers
    subscription(*objects)
  File "/home/jenkins/workspace/plone-5.2-python-2.7/src/plone.app.contenttypes/plone/app/contenttypes/subscribers.py", line 14, in set_title_description
    datafield = obj.image
  File "/home/jenkins/workspace/plone-5.2-python-2.7/src/plone.dexterity/plone/dexterity/content.py", line 411, in __getattr__
    raise AttributeError(name)


FAILED:  plone.api.tests.test_content.TestPloneApiContent.test_enable_roles_acquisition

Error Message:
image

Stack Trace:
image

  File "/srv/python2.7/lib/python2.7/unittest/case.py", line 320, in run
    self.setUp()
  File "/home/jenkins/workspace/plone-5.2-python-2.7/src/plone.api/src/plone/api/tests/test_content.py", line 113, in setUp
    id='image',
  File "<decorator-gen-9>", line 2, in create
  File "/home/jenkins/workspace/plone-5.2-python-2.7/src/plone.api/src/plone/api/validation.py", line 81, in wrapped
    return function(*args, **kwargs)
  File "<decorator-gen-8>", line 2, in create
  File "/home/jenkins/workspace/plone-5.2-python-2.7/src/plone.api/src/plone/api/validation.py", line 153, in wrapped
    return function(*args, **kwargs)
  File "/home/jenkins/workspace/plone-5.2-python-2.7/src/plone.api/src/plone/api/content.py", line 88, in create
    container.invokeFactory(type, content_id, **kwargs)
  File "/home/jenkins/.buildout/eggs/cp27m/Products.CMFCore-2.5.1-py2.7.egg/Products/CMFCore/PortalFolder.py", line 300, in invokeFactory
    *args, **kw)
  File "/home/jenkins/.buildout/eggs/cp27m/Products.CMFCore-2.5.1-py2.7.egg/Products/CMFCore/TypesTool.py", line 809, in constructContent
    ob = info.constructInstance(container, id, *args, **kw)
  File "/home/jenkins/.buildout/eggs/cp27m/Products.CMFCore-2.5.1-py2.7.egg/Products/CMFCore/TypesTool.py", line 308, in constructInstance
    return self._constructInstance(container, id, *args, **kw)
  File "/home/jenkins/.buildout/eggs/cp27m/Products.CMFCore-2.5.1-py2.7.egg/Products/CMFCore/TypesTool.py", line 569, in _constructInstance
    notify(ObjectCreatedEvent(obj))
  File "/home/jenkins/.buildout/eggs/cp27m/zope.event-4.5.0-py2.7.egg/zope/event/__init__.py", line 32, in notify
    subscriber(event)
  File "/home/jenkins/.buildout/eggs/cp27m/zope.component-4.6.2-py2.7.egg/zope/component/event.py", line 27, in dispatch
    component_subscribers(event, None)
  File "/home/jenkins/.buildout/eggs/cp27m/zope.component-4.6.2-py2.7.egg/zope/component/_api.py", line 134, in subscribers
    return sitemanager.subscribers(objects, interface)
  File "/home/jenkins/.buildout/eggs/cp27m/zope.interface-5.2.0-py2.7-linux-x86_64.egg/zope/interface/registry.py", line 448, in subscribers
    return self.adapters.subscribers(objects, provided)
  File "/home/jenkins/.buildout/eggs/cp27m/zope.interface-5.2.0-py2.7-linux-x86_64.egg/zope/interface/adapter.py", line 619, in subscribers
    subscription(*objects)
  File "/home/jenkins/.buildout/eggs/cp27m/zope.component-4.6.2-py2.7.egg/zope/component/event.py", line 36, in objectEventNotify
    component_subscribers((event.object, event), None)
  File "/home/jenkins/.buildout/eggs/cp27m/zope.component-4.6.2-py2.7.egg/zope/component/_api.py", line 134, in subscribers
    return sitemanager.subscribers(objects, interface)
  File "/home/jenkins/.buildout/eggs/cp27m/zope.interface-5.2.0-py2.7-linux-x86_64.egg/zope/interface/registry.py", line 448, in subscribers
    return self.adapters.subscribers(objects, provided)
  File "/home/jenkins/.buildout/eggs/cp27m/zope.interface-5.2.0-py2.7-linux-x86_64.egg/zope/interface/adapter.py", line 619, in subscribers
    subscription(*objects)
  File "/home/jenkins/workspace/plone-5.2-python-2.7/src/plone.app.contenttypes/plone/app/contenttypes/subscribers.py", line 14, in set_title_description
    datafield = obj.image
  File "/home/jenkins/workspace/plone-5.2-python-2.7/src/plone.dexterity/plone/dexterity/content.py", line 411, in __getattr__
    raise AttributeError(name)


FAILED:  plone.api.tests.test_content.TestPloneApiContent.test_find

Error Message:
image

Stack Trace:
image

  File "/srv/python2.7/lib/python2.7/unittest/case.py", line 320, in run
    self.setUp()
  File "/home/jenkins/workspace/plone-5.2-python-2.7/src/plone.api/src/plone/api/tests/test_content.py", line 113, in setUp
    id='image',
  File "<decorator-gen-9>", line 2, in create
  File "/home/jenkins/workspace/plone-5.2-python-2.7/src/plone.api/src/plone/api/validation.py", line 81, in wrapped
    return function(*args, **kwargs)
  File "<decorator-gen-8>", line 2, in create
  File "/home/jenkins/workspace/plone-5.2-python-2.7/src/plone.api/src/plone/api/validation.py", line 153, in wrapped
    return function(*args, **kwargs)
  File "/home/jenkins/workspace/plone-5.2-python-2.7/src/plone.api/src/plone/api/content.py", line 88, in create
    container.invokeFactory(type, content_id, **kwargs)
  File "/home/jenkins/.buildout/eggs/cp27m/Products.CMFCore-2.5.1-py2.7.egg/Products/CMFCore/PortalFolder.py", line 300, in invokeFactory
    *args, **kw)
  File "/home/jenkins/.buildout/eggs/cp27m/Products.CMFCore-2.5.1-py2.7.egg/Products/CMFCore/TypesTool.py", line 809, in constructContent
    ob = info.constructInstance(container, id, *args, **kw)
  File "/home/jenkins/.buildout/eggs/cp27m/Products.CMFCore-2.5.1-py2.7.egg/Products/CMFCore/TypesTool.py", line 308, in constructInstance
    return self._constructInstance(container, id, *args, **kw)
  File "/home/jenkins/.buildout/eggs/cp27m/Products.CMFCore-2.5.1-py2.7.egg/Products/CMFCore/TypesTool.py", line 569, in _constructInstance
    notify(ObjectCreatedEvent(obj))
  File "/home/jenkins/.buildout/eggs/cp27m/zope.event-4.5.0-py2.7.egg/zope/event/__init__.py", line 32, in notify
    subscriber(event)
  File "/home/jenkins/.buildout/eggs/cp27m/zope.component-4.6.2-py2.7.egg/zope/component/event.py", line 27, in dispatch
    component_subscribers(event, None)
  File "/home/jenkins/.buildout/eggs/cp27m/zope.component-4.6.2-py2.7.egg/zope/component/_api.py", line 134, in subscribers
    return sitemanager.subscribers(objects, interface)
  File "/home/jenkins/.buildout/eggs/cp27m/zope.interface-5.2.0-py2.7-linux-x86_64.egg/zope/interface/registry.py", line 448, in subscribers
    return self.adapters.subscribers(objects, provided)
  File "/home/jenkins/.buildout/eggs/cp27m/zope.interface-5.2.0-py2.7-linux-x86_64.egg/zope/interface/adapter.py", line 619, in subscribers
    subscription(*objects)
  File "/home/jenkins/.buildout/eggs/cp27m/zope.component-4.6.2-py2.7.egg/zope/component/event.py", line 36, in objectEventNotify
    component_subscribers((event.object, event), None)
  File "/home/jenkins/.buildout/eggs/cp27m/zope.component-4.6.2-py2.7.egg/zope/component/_api.py", line 134, in subscribers
    return sitemanager.subscribers(objects, interface)
  File "/home/jenkins/.buildout/eggs/cp27m/zope.interface-5.2.0-py2.7-linux-x86_64.egg/zope/interface/registry.py", line 448, in subscribers
    return self.adapters.subscribers(objects, provided)
  File "/home/jenkins/.buildout/eggs/cp27m/zope.interface-5.2.0-py2.7-linux-x86_64.egg/zope/interface/adapter.py", line 619, in subscribers
    subscription(*objects)
  File "/home/jenkins/workspace/plone-5.2-python-2.7/src/plone.app.contenttypes/plone/app/contenttypes/subscribers.py", line 14, in set_title_description
    datafield = obj.image
  File "/home/jenkins/workspace/plone-5.2-python-2.7/src/plone.dexterity/plone/dexterity/content.py", line 411, in __getattr__
    raise AttributeError(name)


FAILED:  plone.api.tests.test_content.TestPloneApiContent.test_find_context

Error Message:
image

Stack Trace:
image

  File "/srv/python2.7/lib/python2.7/unittest/case.py", line 320, in run
    self.setUp()
  File "/home/jenkins/workspace/plone-5.2-python-2.7/src/plone.api/src/plone/api/tests/test_content.py", line 113, in setUp
    id='image',
  File "<decorator-gen-9>", line 2, in create
  File "/home/jenkins/workspace/plone-5.2-python-2.7/src/plone.api/src/plone/api/validation.py", line 81, in wrapped
    return function(*args, **kwargs)
  File "<decorator-gen-8>", line 2, in create
  File "/home/jenkins/workspace/plone-5.2-python-2.7/src/plone.api/src/plone/api/validation.py", line 153, in wrapped
    return function(*args, **kwargs)
  File "/home/jenkins/workspace/plone-5.2-python-2.7/src/plone.api/src/plone/api/content.py", line 88, in create
    container.invokeFactory(type, content_id, **kwargs)
  File "/home/jenkins/.buildout/eggs/cp27m/Products.CMFCore-2.5.1-py2.7.egg/Products/CMFCore/PortalFolder.py", line 300, in invokeFactory
    *args, **kw)
  File "/home/jenkins/.buildout/eggs/cp27m/Products.CMFCore-2.5.1-py2.7.egg/Products/CMFCore/TypesTool.py", line 809, in constructContent
    ob = info.constructInstance(container, id, *args, **kw)
  File "/home/jenkins/.buildout/eggs/cp27m/Products.CMFCore-2.5.1-py2.7.egg/Products/CMFCore/TypesTool.py", line 308, in constructInstance
    return self._constructInstance(container, id, *args, **kw)
  File "/home/jenkins/.buildout/eggs/cp27m/Products.CMFCore-2.5.1-py2.7.egg/Products/CMFCore/TypesTool.py", line 569, in _constructInstance
    notify(ObjectCreatedEvent(obj))
  File "/home/jenkins/.buildout/eggs/cp27m/zope.event-4.5.0-py2.7.egg/zope/event/__init__.py", line 32, in notify
    subscriber(event)
  File "/home/jenkins/.buildout/eggs/cp27m/zope.component-4.6.2-py2.7.egg/zope/component/event.py", line 27, in dispatch
    component_subscribers(event, None)
  File "/home/jenkins/.buildout/eggs/cp27m/zope.component-4.6.2-py2.7.egg/zope/component/_api.py", line 134, in subscribers
    return sitemanager.subscribers(objects, interface)
  File "/home/jenkins/.buildout/eggs/cp27m/zope.interface-5.2.0-py2.7-linux-x86_64.egg/zope/interface/registry.py", line 448, in subscribers
    return self.adapters.subscribers(objects, provided)
  File "/home/jenkins/.buildout/eggs/cp27m/zope.interface-5.2.0-py2.7-linux-x86_64.egg/zope/interface/adapter.py", line 619, in subscribers
    subscription(*objects)
  File "/home/jenkins/.buildout/eggs/cp27m/zope.component-4.6.2-py2.7.egg/zope/component/event.py", line 36, in objectEventNotify
    component_subscribers((event.object, event), None)
  File "/home/jenkins/.buildout/eggs/cp27m/zope.component-4.6.2-py2.7.egg/zope/component/_api.py", line 134, in subscribers
    return sitemanager.subscribers(objects, interface)
  File "/home/jenkins/.buildout/eggs/cp27m/zope.interface-5.2.0-py2.7-linux-x86_64.egg/zope/interface/registry.py", line 448, in subscribers
    return self.adapters.subscribers(objects, provided)
  File "/home/jenkins/.buildout/eggs/cp27m/zope.interface-5.2.0-py2.7-linux-x86_64.egg/zope/interface/adapter.py", line 619, in subscribers
    subscription(*objects)
  File "/home/jenkins/workspace/plone-5.2-python-2.7/src/plone.app.contenttypes/plone/app/contenttypes/subscribers.py", line 14, in set_title_description
    datafield = obj.image
  File "/home/jenkins/workspace/plone-5.2-python-2.7/src/plone.dexterity/plone/dexterity/content.py", line 411, in __getattr__
    raise AttributeError(name)


FAILED:  plone.api.tests.test_content.TestPloneApiContent.test_find_depth

Error Message:
image

Stack Trace:
image

  File "/srv/python2.7/lib/python2.7/unittest/case.py", line 320, in run
    self.setUp()
  File "/home/jenkins/workspace/plone-5.2-python-2.7/src/plone.api/src/plone/api/tests/test_content.py", line 113, in setUp
    id='image',
  File "<decorator-gen-9>", line 2, in create
  File "/home/jenkins/workspace/plone-5.2-python-2.7/src/plone.api/src/plone/api/validation.py", line 81, in wrapped
    return function(*args, **kwargs)
  File "<decorator-gen-8>", line 2, in create
  File "/home/jenkins/workspace/plone-5.2-python-2.7/src/plone.api/src/plone/api/validation.py", line 153, in wrapped
    return function(*args, **kwargs)
  File "/home/jenkins/workspace/plone-5.2-python-2.7/src/plone.api/src/plone/api/content.py", line 88, in create
    container.invokeFactory(type, content_id, **kwargs)
  File "/home/jenkins/.buildout/eggs/cp27m/Products.CMFCore-2.5.1-py2.7.egg/Products/CMFCore/PortalFolder.py", line 300, in invokeFactory
    *args, **kw)
  File "/home/jenkins/.buildout/eggs/cp27m/Products.CMFCore-2.5.1-py2.7.egg/Products/CMFCore/TypesTool.py", line 809, in constructContent
    ob = info.constructInstance(container, id, *args, **kw)
  File "/home/jenkins/.buildout/eggs/cp27m/Products.CMFCore-2.5.1-py2.7.egg/Products/CMFCore/TypesTool.py", line 308, in constructInstance
    return self._constructInstance(container, id, *args, **kw)
  File "/home/jenkins/.buildout/eggs/cp27m/Products.CMFCore-2.5.1-py2.7.egg/Products/CMFCore/TypesTool.py", line 569, in _constructInstance
    notify(ObjectCreatedEvent(obj))
  File "/home/jenkins/.buildout/eggs/cp27m/zope.event-4.5.0-py2.7.egg/zope/event/__init__.py", line 32, in notify
    subscriber(event)
  File "/home/jenkins/.buildout/eggs/cp27m/zope.component-4.6.2-py2.7.egg/zope/component/event.py", line 27, in dispatch
    component_subscribers(event, None)
  File "/home/jenkins/.buildout/eggs/cp27m/zope.component-4.6.2-py2.7.egg/zope/component/_api.py", line 134, in subscribers
    return sitemanager.subscribers(objects, interface)
  File "/home/jenkins/.buildout/eggs/cp27m/zope.interface-5.2.0-py2.7-linux-x86_64.egg/zope/interface/registry.py", line 448, in subscribers
    return self.adapters.subscribers(objects, provided)
  File "/home/jenkins/.buildout/eggs/cp27m/zope.interface-5.2.0-py2.7-linux-x86_64.egg/zope/interface/adapter.py", line 619, in subscribers
    subscription(*objects)
  File "/home/jenkins/.buildout/eggs/cp27m/zope.component-4.6.2-py2.7.egg/zope/component/event.py", line 36, in objectEventNotify
    component_subscribers((event.object, event), None)
  File "/home/jenkins/.buildout/eggs/cp27m/zope.component-4.6.2-py2.7.egg/zope/component/_api.py", line 134, in subscribers
    return sitemanager.subscribers(objects, interface)
  File "/home/jenkins/.buildout/eggs/cp27m/zope.interface-5.2.0-py2.7-linux-x86_64.egg/zope/interface/registry.py", line 448, in subscribers
    return self.adapters.subscribers(objects, provided)
  File "/home/jenkins/.buildout/eggs/cp27m/zope.interface-5.2.0-py2.7-linux-x86_64.egg/zope/interface/adapter.py", line 619, in subscribers
    subscription(*objects)
  File "/home/jenkins/workspace/plone-5.2-python-2.7/src/plone.app.contenttypes/plone/app/contenttypes/subscribers.py", line 14, in set_title_description
    datafield = obj.image
  File "/home/jenkins/workspace/plone-5.2-python-2.7/src/plone.dexterity/plone/dexterity/content.py", line 411, in __getattr__
    raise AttributeError(name)


FAILED:  plone.api.tests.test_content.TestPloneApiContent.test_find_dict

Error Message:
image

Stack Trace:
image

  File "/srv/python2.7/lib/python2.7/unittest/case.py", line 320, in run
    self.setUp()
  File "/home/jenkins/workspace/plone-5.2-python-2.7/src/plone.api/src/plone/api/tests/test_content.py", line 113, in setUp
    id='image',
  File "<decorator-gen-9>", line 2, in create
  File "/home/jenkins/workspace/plone-5.2-python-2.7/src/plone.api/src/plone/api/validation.py", line 81, in wrapped
    return function(*args, **kwargs)
  File "<decorator-gen-8>", line 2, in create
  File "/home/jenkins/workspace/plone-5.2-python-2.7/src/plone.api/src/plone/api/validation.py", line 153, in wrapped
    return function(*args, **kwargs)
  File "/home/jenkins/workspace/plone-5.2-python-2.7/src/plone.api/src/plone/api/content.py", line 88, in create
    container.invokeFactory(type, content_id, **kwargs)
  File "/home/jenkins/.buildout/eggs/cp27m/Products.CMFCore-2.5.1-py2.7.egg/Products/CMFCore/PortalFolder.py", line 300, in invokeFactory
    *args, **kw)
  File "/home/jenkins/.buildout/eggs/cp27m/Products.CMFCore-2.5.1-py2.7.egg/Products/CMFCore/TypesTool.py", line 809, in constructContent
    ob = info.constructInstance(container, id, *args, **kw)
  File "/home/jenkins/.buildout/eggs/cp27m/Products.CMFCore-2.5.1-py2.7.egg/Products/CMFCore/TypesTool.py", line 308, in constructInstance
    return self._constructInstance(container, id, *args, **kw)
  File "/home/jenkins/.buildout/eggs/cp27m/Products.CMFCore-2.5.1-py2.7.egg/Products/CMFCore/TypesTool.py", line 569, in _constructInstance
    notify(ObjectCreatedEvent(obj))
  File "/home/jenkins/.buildout/eggs/cp27m/zope.event-4.5.0-py2.7.egg/zope/event/__init__.py", line 32, in notify
    subscriber(event)
  File "/home/jenkins/.buildout/eggs/cp27m/zope.component-4.6.2-py2.7.egg/zope/component/event.py", line 27, in dispatch
    component_subscribers(event, None)
  File "/home/jenkins/.buildout/eggs/cp27m/zope.component-4.6.2-py2.7.egg/zope/component/_api.py", line 134, in subscribers
    return sitemanager.subscribers(objects, interface)
  File "/home/jenkins/.buildout/eggs/cp27m/zope.interface-5.2.0-py2.7-linux-x86_64.egg/zope/interface/registry.py", line 448, in subscribers
    return self.adapters.subscribers(objects, provided)
  File "/home/jenkins/.buildout/eggs/cp27m/zope.interface-5.2.0-py2.7-linux-x86_64.egg/zope/interface/adapter.py", line 619, in subscribers
    subscription(*objects)
  File "/home/jenkins/.buildout/eggs/cp27m/zope.component-4.6.2-py2.7.egg/zope/component/event.py", line 36, in objectEventNotify
    component_subscribers((event.object, event), None)
  File "/home/jenkins/.buildout/eggs/cp27m/zope.component-4.6.2-py2.7.egg/zope/component/_api.py", line 134, in subscribers
    return sitemanager.subscribers(objects, interface)
  File "/home/jenkins/.buildout/eggs/cp27m/zope.interface-5.2.0-py2.7-linux-x86_64.egg/zope/interface/registry.py", line 448, in subscribers
    return self.adapters.subscribers(objects, provided)
  File "/home/jenkins/.buildout/eggs/cp27m/zope.interface-5.2.0-py2.7-linux-x86_64.egg/zope/interface/adapter.py", line 619, in subscribers
    subscription(*objects)
  File "/home/jenkins/workspace/plone-5.2-python-2.7/src/plone.app.contenttypes/plone/app/contenttypes/subscribers.py", line 14, in set_title_description
    datafield = obj.image
  File "/home/jenkins/workspace/plone-5.2-python-2.7/src/plone.dexterity/plone/dexterity/content.py", line 411, in __getattr__
    raise AttributeError(name)


FAILED:  plone.api.tests.test_content.TestPloneApiContent.test_find_empty_query

Error Message:
image

Stack Trace:
image

  File "/srv/python2.7/lib/python2.7/unittest/case.py", line 320, in run
    self.setUp()
  File "/home/jenkins/workspace/plone-5.2-python-2.7/src/plone.api/src/plone/api/tests/test_content.py", line 113, in setUp
    id='image',
  File "<decorator-gen-9>", line 2, in create
  File "/home/jenkins/workspace/plone-5.2-python-2.7/src/plone.api/src/plone/api/validation.py", line 81, in wrapped
    return function(*args, **kwargs)
  File "<decorator-gen-8>", line 2, in create
  File "/home/jenkins/workspace/plone-5.2-python-2.7/src/plone.api/src/plone/api/validation.py", line 153, in wrapped
    return function(*args, **kwargs)
  File "/home/jenkins/workspace/plone-5.2-python-2.7/src/plone.api/src/plone/api/content.py", line 88, in create
    container.invokeFactory(type, content_id, **kwargs)
  File "/home/jenkins/.buildout/eggs/cp27m/Products.CMFCore-2.5.1-py2.7.egg/Products/CMFCore/PortalFolder.py", line 300, in invokeFactory
    *args, **kw)
  File "/home/jenkins/.buildout/eggs/cp27m/Products.CMFCore-2.5.1-py2.7.egg/Products/CMFCore/TypesTool.py", line 809, in constructContent
    ob = info.constructInstance(container, id, *args, **kw)
  File "/home/jenkins/.buildout/eggs/cp27m/Products.CMFCore-2.5.1-py2.7.egg/Products/CMFCore/TypesTool.py", line 308, in constructInstance
    return self._constructInstance(container, id, *args, **kw)
  File "/home/jenkins/.buildout/eggs/cp27m/Products.CMFCore-2.5.1-py2.7.egg/Products/CMFCore/TypesTool.py", line 569, in _constructInstance
    notify(ObjectCreatedEvent(obj))
  File "/home/jenkins/.buildout/eggs/cp27m/zope.event-4.5.0-py2.7.egg/zope/event/__init__.py", line 32, in notify
    subscriber(event)
  File "/home/jenkins/.buildout/eggs/cp27m/zope.component-4.6.2-py2.7.egg/zope/component/event.py", line 27, in dispatch
    component_subscribers(event, None)
  File "/home/jenkins/.buildout/eggs/cp27m/zope.component-4.6.2-py2.7.egg/zope/component/_api.py", line 134, in subscribers
    return sitemanager.subscribers(objects, interface)
  File "/home/jenkins/.buildout/eggs/cp27m/zope.interface-5.2.0-py2.7-linux-x86_64.egg/zope/interface/registry.py", line 448, in subscribers
    return self.adapters.subscribers(objects, provided)
  File "/home/jenkins/.buildout/eggs/cp27m/zope.interface-5.2.0-py2.7-linux-x86_64.egg/zope/interface/adapter.py", line 619, in subscribers
    subscription(*objects)
  File "/home/jenkins/.buildout/eggs/cp27m/zope.component-4.6.2-py2.7.egg/zope/component/event.py", line 36, in objectEventNotify
    component_subscribers((event.object, event), None)
  File "/home/jenkins/.buildout/eggs/cp27m/zope.component-4.6.2-py2.7.egg/zope/component/_api.py", line 134, in subscribers
    return sitemanager.subscribers(objects, interface)
  File "/home/jenkins/.buildout/eggs/cp27m/zope.interface-5.2.0-py2.7-linux-x86_64.egg/zope/interface/registry.py", line 448, in subscribers
    return self.adapters.subscribers(objects, provided)
  File "/home/jenkins/.buildout/eggs/cp27m/zope.interface-5.2.0-py2.7-linux-x86_64.egg/zope/interface/adapter.py", line 619, in subscribers
    subscription(*objects)
  File "/home/jenkins/workspace/plone-5.2-python-2.7/src/plone.app.contenttypes/plone/app/contenttypes/subscribers.py", line 14, in set_title_description
    datafield = obj.image
  File "/home/jenkins/workspace/plone-5.2-python-2.7/src/plone.dexterity/plone/dexterity/content.py", line 411, in __getattr__
    raise AttributeError(name)


FAILED:  plone.api.tests.test_content.TestPloneApiContent.test_find_interface

Error Message:
image

Stack Trace:
image

  File "/srv/python2.7/lib/python2.7/unittest/case.py", line 320, in run
    self.setUp()
  File "/home/jenkins/workspace/plone-5.2-python-2.7/src/plone.api/src/plone/api/tests/test_content.py", line 113, in setUp
    id='image',
  File "<decorator-gen-9>", line 2, in create
  File "/home/jenkins/workspace/plone-5.2-python-2.7/src/plone.api/src/plone/api/validation.py", line 81, in wrapped
    return function(*args, **kwargs)
  File "<decorator-gen-8>", line 2, in create
  File "/home/jenkins/workspace/plone-5.2-python-2.7/src/plone.api/src/plone/api/validation.py", line 153, in wrapped
    return function(*args, **kwargs)
  File "/home/jenkins/workspace/plone-5.2-python-2.7/src/plone.api/src/plone/api/content.py", line 88, in create
    container.invokeFactory(type, content_id, **kwargs)
  File "/home/jenkins/.buildout/eggs/cp27m/Products.CMFCore-2.5.1-py2.7.egg/Products/CMFCore/PortalFolder.py", line 300, in invokeFactory
    *args, **kw)
  File "/home/jenkins/.buildout/eggs/cp27m/Products.CMFCore-2.5.1-py2.7.egg/Products/CMFCore/TypesTool.py", line 809, in constructContent
    ob = info.constructInstance(container, id, *args, **kw)
  File "/home/jenkins/.buildout/eggs/cp27m/Products.CMFCore-2.5.1-py2.7.egg/Products/CMFCore/TypesTool.py", line 308, in constructInstance
    return self._constructInstance(container, id, *args, **kw)
  File "/home/jenkins/.buildout/eggs/cp27m/Products.CMFCore-2.5.1-py2.7.egg/Products/CMFCore/TypesTool.py", line 569, in _constructInstance
    notify(ObjectCreatedEvent(obj))
  File "/home/jenkins/.buildout/eggs/cp27m/zope.event-4.5.0-py2.7.egg/zope/event/__init__.py", line 32, in notify
    subscriber(event)
  File "/home/jenkins/.buildout/eggs/cp27m/zope.component-4.6.2-py2.7.egg/zope/component/event.py", line 27, in dispatch
    component_subscribers(event, None)
  File "/home/jenkins/.buildout/eggs/cp27m/zope.component-4.6.2-py2.7.egg/zope/component/_api.py", line 134, in subscribers
    return sitemanager.subscribers(objects, interface)
  File "/home/jenkins/.buildout/eggs/cp27m/zope.interface-5.2.0-py2.7-linux-x86_64.egg/zope/interface/registry.py", line 448, in subscribers
    return self.adapters.subscribers(objects, provided)
  File "/home/jenkins/.buildout/eggs/cp27m/zope.interface-5.2.0-py2.7-linux-x86_64.egg/zope/interface/adapter.py", line 619, in subscribers
    subscription(*objects)
  File "/home/jenkins/.buildout/eggs/cp27m/zope.component-4.6.2-py2.7.egg/zope/component/event.py", line 36, in objectEventNotify
    component_subscribers((event.object, event), None)
  File "/home/jenkins/.buildout/eggs/cp27m/zope.component-4.6.2-py2.7.egg/zope/component/_api.py", line 134, in subscribers
    return sitemanager.subscribers(objects, interface)
  File "/home/jenkins/.buildout/eggs/cp27m/zope.interface-5.2.0-py2.7-linux-x86_64.egg/zope/interface/registry.py", line 448, in subscribers
    return self.adapters.subscribers(objects, provided)
  File "/home/jenkins/.buildout/eggs/cp27m/zope.interface-5.2.0-py2.7-linux-x86_64.egg/zope/interface/adapter.py", line 619, in subscribers
    subscription(*objects)
  File "/home/jenkins/workspace/plone-5.2-python-2.7/src/plone.app.contenttypes/plone/app/contenttypes/subscribers.py", line 14, in set_title_description
    datafield = obj.image
  File "/home/jenkins/workspace/plone-5.2-python-2.7/src/plone.dexterity/plone/dexterity/content.py", line 411, in __getattr__
    raise AttributeError(name)


FAILED:  plone.api.tests.test_content.TestPloneApiContent.test_find_interface_dict

Error Message:
image

Stack Trace:
image

  File "/srv/python2.7/lib/python2.7/unittest/case.py", line 320, in run
    self.setUp()
  File "/home/jenkins/workspace/plone-5.2-python-2.7/src/plone.api/src/plone/api/tests/test_content.py", line 113, in setUp
    id='image',
  File "<decorator-gen-9>", line 2, in create
  File "/home/jenkins/workspace/plone-5.2-python-2.7/src/plone.api/src/plone/api/validation.py", line 81, in wrapped
    return function(*args, **kwargs)
  File "<decorator-gen-8>", line 2, in create
  File "/home/jenkins/workspace/plone-5.2-python-2.7/src/plone.api/src/plone/api/validation.py", line 153, in wrapped
    return function(*args, **kwargs)
  File "/home/jenkins/workspace/plone-5.2-python-2.7/src/plone.api/src/plone/api/content.py", line 88, in create
    container.invokeFactory(type, content_id, **kwargs)
  File "/home/jenkins/.buildout/eggs/cp27m/Products.CMFCore-2.5.1-py2.7.egg/Products/CMFCore/PortalFolder.py", line 300, in invokeFactory
    *args, **kw)
  File "/home/jenkins/.buildout/eggs/cp27m/Products.CMFCore-2.5.1-py2.7.egg/Products/CMFCore/TypesTool.py", line 809, in constructContent
    ob = info.constructInstance(container, id, *args, **kw)
  File "/home/jenkins/.buildout/eggs/cp27m/Products.CMFCore-2.5.1-py2.7.egg/Products/CMFCore/TypesTool.py", line 308, in constructInstance
    return self._constructInstance(container, id, *args, **kw)
  File "/home/jenkins/.buildout/eggs/cp27m/Products.CMFCore-2.5.1-py2.7.egg/Products/CMFCore/TypesTool.py", line 569, in _constructInstance
    notify(ObjectCreatedEvent(obj))
  File "/home/jenkins/.buildout/eggs/cp27m/zope.event-4.5.0-py2.7.egg/zope/event/__init__.py", line 32, in notify
    subscriber(event)
  File "/home/jenkins/.buildout/eggs/cp27m/zope.component-4.6.2-py2.7.egg/zope/component/event.py", line 27, in dispatch
    component_subscribers(event, None)
  File "/home/jenkins/.buildout/eggs/cp27m/zope.component-4.6.2-py2.7.egg/zope/component/_api.py", line 134, in subscribers
    return sitemanager.subscribers(objects, interface)
  File "/home/jenkins/.buildout/eggs/cp27m/zope.interface-5.2.0-py2.7-linux-x86_64.egg/zope/interface/registry.py", line 448, in subscribers
    return self.adapters.subscribers(objects, provided)
  File "/home/jenkins/.buildout/eggs/cp27m/zope.interface-5.2.0-py2.7-linux-x86_64.egg/zope/interface/adapter.py", line 619, in subscribers
    subscription(*objects)
  File "/home/jenkins/.buildout/eggs/cp27m/zope.component-4.6.2-py2.7.egg/zope/component/event.py", line 36, in objectEventNotify
    component_subscribers((event.object, event), None)
  File "/home/jenkins/.buildout/eggs/cp27m/zope.component-4.6.2-py2.7.egg/zope/component/_api.py", line 134, in subscribers
    return sitemanager.subscribers(objects, interface)
  File "/home/jenkins/.buildout/eggs/cp27m/zope.interface-5.2.0-py2.7-linux-x86_64.egg/zope/interface/registry.py", line 448, in subscribers
    return self.adapters.subscribers(objects, provided)
  File "/home/jenkins/.buildout/eggs/cp27m/zope.interface-5.2.0-py2.7-linux-x86_64.egg/zope/interface/adapter.py", line 619, in subscribers
    subscription(*objects)
  File "/home/jenkins/workspace/plone-5.2-python-2.7/src/plone.app.contenttypes/plone/app/contenttypes/subscribers.py", line 14, in set_title_description
    datafield = obj.image
  File "/home/jenkins/workspace/plone-5.2-python-2.7/src/plone.dexterity/plone/dexterity/content.py", line 411, in __getattr__
    raise AttributeError(name)


FAILED:  plone.api.tests.test_content.TestPloneApiContent.test_find_interface_dict__all_options

Error Message:
image

Stack Trace:
image

  File "/srv/python2.7/lib/python2.7/unittest/case.py", line 320, in run
    self.setUp()
  File "/home/jenkins/workspace/plone-5.2-python-2.7/src/plone.api/src/plone/api/tests/test_content.py", line 113, in setUp
    id='image',
  File "<decorator-gen-9>", line 2, in create
  File "/home/jenkins/workspace/plone-5.2-python-2.7/src/plone.api/src/plone/api/validation.py", line 81, in wrapped
    return function(*args, **kwargs)
  File "<decorator-gen-8>", line 2, in create
  File "/home/jenkins/workspace/plone-5.2-python-2.7/src/plone.api/src/plone/api/validation.py", line 153, in wrapped
    return function(*args, **kwargs)
  File "/home/jenkins/workspace/plone-5.2-python-2.7/src/plone.api/src/plone/api/content.py", line 88, in create
    container.invokeFactory(type, content_id, **kwargs)
  File "/home/jenkins/.buildout/eggs/cp27m/Products.CMFCore-2.5.1-py2.7.egg/Products/CMFCore/PortalFolder.py", line 300, in invokeFactory
    *args, **kw)
  File "/home/jenkins/.buildout/eggs/cp27m/Products.CMFCore-2.5.1-py2.7.egg/Products/CMFCore/TypesTool.py", line 809, in constructContent
    ob = info.constructInstance(container, id, *args, **kw)
  File "/home/jenkins/.buildout/eggs/cp27m/Products.CMFCore-2.5.1-py2.7.egg/Products/CMFCore/TypesTool.py", line 308, in constructInstance
    return self._constructInstance(container, id, *args, **kw)
  File "/home/jenkins/.buildout/eggs/cp27m/Products.CMFCore-2.5.1-py2.7.egg/Products/CMFCore/TypesTool.py", line 569, in _constructInstance
    notify(ObjectCreatedEvent(obj))
  File "/home/jenkins/.buildout/eggs/cp27m/zope.event-4.5.0-py2.7.egg/zope/event/__init__.py", line 32, in notify
    subscriber(event)
  File "/home/jenkins/.buildout/eggs/cp27m/zope.component-4.6.2-py2.7.egg/zope/component/event.py", line 27, in dispatch
    component_subscribers(event, None)
  File "/home/jenkins/.buildout/eggs/cp27m/zope.component-4.6.2-py2.7.egg/zope/component/_api.py", line 134, in subscribers
    return sitemanager.subscribers(objects, interface)
  File "/home/jenkins/.buildout/eggs/cp27m/zope.interface-5.2.0-py2.7-linux-x86_64.egg/zope/interface/registry.py", line 448, in subscribers
    return self.adapters.subscribers(objects, provided)
  File "/home/jenkins/.buildout/eggs/cp27m/zope.interface-5.2.0-py2.7-linux-x86_64.egg/zope/interface/adapter.py", line 619, in subscribers
    subscription(*objects)
  File "/home/jenkins/.buildout/eggs/cp27m/zope.component-4.6.2-py2.7.egg/zope/component/event.py", line 36, in objectEventNotify
    component_subscribers((event.object, event), None)
  File "/home/jenkins/.buildout/eggs/cp27m/zope.component-4.6.2-py2.7.egg/zope/component/_api.py", line 134, in subscribers
    return sitemanager.subscribers(objects, interface)
  File "/home/jenkins/.buildout/eggs/cp27m/zope.interface-5.2.0-py2.7-linux-x86_64.egg/zope/interface/registry.py", line 448, in subscribers
    return self.adapters.subscribers(objects, provided)
  File "/home/jenkins/.buildout/eggs/cp27m/zope.interface-5.2.0-py2.7-linux-x86_64.egg/zope/interface/adapter.py", line 619, in subscribers
    subscription(*objects)
  File "/home/jenkins/workspace/plone-5.2-python-2.7/src/plone.app.contenttypes/plone/app/contenttypes/subscribers.py", line 14, in set_title_description
    datafield = obj.image
  File "/home/jenkins/workspace/plone-5.2-python-2.7/src/plone.dexterity/plone/dexterity/content.py", line 411, in __getattr__
    raise AttributeError(name)


FAILED:  plone.api.tests.test_content.TestPloneApiContent.test_find_interface_dict__include_not_query

Error Message:
image

Stack Trace:
image

  File "/srv/python2.7/lib/python2.7/unittest/case.py", line 320, in run
    self.setUp()
  File "/home/jenkins/workspace/plone-5.2-python-2.7/src/plone.api/src/plone/api/tests/test_content.py", line 113, in setUp
    id='image',
  File "<decorator-gen-9>", line 2, in create
  File "/home/jenkins/workspace/plone-5.2-python-2.7/src/plone.api/src/plone/api/validation.py", line 81, in wrapped
    return function(*args, **kwargs)
  File "<decorator-gen-8>", line 2, in create
  File "/home/jenkins/workspace/plone-5.2-python-2.7/src/plone.api/src/plone/api/validation.py", line 153, in wrapped
    return function(*args, **kwargs)
  File "/home/jenkins/workspace/plone-5.2-python-2.7/src/plone.api/src/plone/api/content.py", line 88, in create
    container.invokeFactory(type, content_id, **kwargs)
  File "/home/jenkins/.buildout/eggs/cp27m/Products.CMFCore-2.5.1-py2.7.egg/Products/CMFCore/PortalFolder.py", line 300, in invokeFactory
    *args, **kw)
  File "/home/jenkins/.buildout/eggs/cp27m/Products.CMFCore-2.5.1-py2.7.egg/Products/CMFCore/TypesTool.py", line 809, in constructContent
    ob = info.constructInstance(container, id, *args, **kw)
  File "/home/jenkins/.buildout/eggs/cp27m/Products.CMFCore-2.5.1-py2.7.egg/Products/CMFCore/TypesTool.py", line 308, in constructInstance
    return self._constructInstance(container, id, *args, **kw)
  File "/home/jenkins/.buildout/eggs/cp27m/Products.CMFCore-2.5.1-py2.7.egg/Products/CMFCore/TypesTool.py", line 569, in _constructInstance
    notify(ObjectCreatedEvent(obj))
  File "/home/jenkins/.buildout/eggs/cp27m/zope.event-4.5.0-py2.7.egg/zope/event/__init__.py", line 32, in notify
    subscriber(event)
  File "/home/jenkins/.buildout/eggs/cp27m/zope.component-4.6.2-py2.7.egg/zope/component/event.py", line 27, in dispatch
    component_subscribers(event, None)
  File "/home/jenkins/.buildout/eggs/cp27m/zope.component-4.6.2-py2.7.egg/zope/component/_api.py", line 134, in subscribers
    return sitemanager.subscribers(objects, interface)
  File "/home/jenkins/.buildout/eggs/cp27m/zope.interface-5.2.0-py2.7-linux-x86_64.egg/zope/interface/registry.py", line 448, in subscribers
    return self.adapters.subscribers(objects, provided)
  File "/home/jenkins/.buildout/eggs/cp27m/zope.interface-5.2.0-py2.7-linux-x86_64.egg/zope/interface/adapter.py", line 619, in subscribers
    subscription(*objects)
  File "/home/jenkins/.buildout/eggs/cp27m/zope.component-4.6.2-py2.7.egg/zope/component/event.py", line 36, in objectEventNotify
    component_subscribers((event.object, event), None)
  File "/home/jenkins/.buildout/eggs/cp27m/zope.component-4.6.2-py2.7.egg/zope/component/_api.py", line 134, in subscribers
    return sitemanager.subscribers(objects, interface)
  File "/home/jenkins/.buildout/eggs/cp27m/zope.interface-5.2.0-py2.7-linux-x86_64.egg/zope/interface/registry.py", line 448, in subscribers
    return self.adapters.subscribers(objects, provided)
  File "/home/jenkins/.buildout/eggs/cp27m/zope.interface-5.2.0-py2.7-linux-x86_64.egg/zope/interface/adapter.py", line 619, in subscribers
    subscription(*objects)
  File "/home/jenkins/workspace/plone-5.2-python-2.7/src/plone.app.contenttypes/plone/app/contenttypes/subscribers.py", line 14, in set_title_description
    datafield = obj.image
  File "/home/jenkins/workspace/plone-5.2-python-2.7/src/plone.dexterity/plone/dexterity/content.py", line 411, in __getattr__
    raise AttributeError(name)


FAILED:  plone.api.tests.test_content.TestPloneApiContent.test_find_invalid_indexes

Error Message:
image

Stack Trace:
image

  File "/srv/python2.7/lib/python2.7/unittest/case.py", line 320, in run
    self.setUp()
  File "/home/jenkins/workspace/plone-5.2-python-2.7/src/plone.api/src/plone/api/tests/test_content.py", line 113, in setUp
    id='image',
  File "<decorator-gen-9>", line 2, in create
  File "/home/jenkins/workspace/plone-5.2-python-2.7/src/plone.api/src/plone/api/validation.py", line 81, in wrapped
    return function(*args, **kwargs)
  File "<decorator-gen-8>", line 2, in create
  File "/home/jenkins/workspace/plone-5.2-python-2.7/src/plone.api/src/plone/api/validation.py", line 153, in wrapped
    return function(*args, **kwargs)
  File "/home/jenkins/workspace/plone-5.2-python-2.7/src/plone.api/src/plone/api/content.py", line 88, in create
    container.invokeFactory(type, content_id, **kwargs)
  File "/home/jenkins/.buildout/eggs/cp27m/Products.CMFCore-2.5.1-py2.7.egg/Products/CMFCore/PortalFolder.py", line 300, in invokeFactory
    *args, **kw)
  File "/home/jenkins/.buildout/eggs/cp27m/Products.CMFCore-2.5.1-py2.7.egg/Products/CMFCore/TypesTool.py", line 809, in constructContent
    ob = info.constructInstance(container, id, *args, **kw)
  File "/home/jenkins/.buildout/eggs/cp27m/Products.CMFCore-2.5.1-py2.7.egg/Products/CMFCore/TypesTool.py", line 308, in constructInstance
    return self._constructInstance(container, id, *args, **kw)
  File "/home/jenkins/.buildout/eggs/cp27m/Products.CMFCore-2.5.1-py2.7.egg/Products/CMFCore/TypesTool.py", line 569, in _constructInstance
    notify(ObjectCreatedEvent(obj))
  File "/home/jenkins/.buildout/eggs/cp27m/zope.event-4.5.0-py2.7.egg/zope/event/__init__.py", line 32, in notify
    subscriber(event)
  File "/home/jenkins/.buildout/eggs/cp27m/zope.component-4.6.2-py2.7.egg/zope/component/event.py", line 27, in dispatch
    component_subscribers(event, None)
  File "/home/jenkins/.buildout/eggs/cp27m/zope.component-4.6.2-py2.7.egg/zope/component/_api.py", line 134, in subscribers
    return sitemanager.subscribers(objects, interface)
  File "/home/jenkins/.buildout/eggs/cp27m/zope.interface-5.2.0-py2.7-linux-x86_64.egg/zope/interface/registry.py", line 448, in subscribers
    return self.adapters.subscribers(objects, provided)
  File "/home/jenkins/.buildout/eggs/cp27m/zope.interface-5.2.0-py2.7-linux-x86_64.egg/zope/interface/adapter.py", line 619, in subscribers
    subscription(*objects)
  File "/home/jenkins/.buildout/eggs/cp27m/zope.component-4.6.2-py2.7.egg/zope/component/event.py", line 36, in objectEventNotify
    component_subscribers((event.object, event), None)
  File "/home/jenkins/.buildout/eggs/cp27m/zope.component-4.6.2-py2.7.egg/zope/component/_api.py", line 134, in subscribers
    return sitemanager.subscribers(objects, interface)
  File "/home/jenkins/.buildout/eggs/cp27m/zope.interface-5.2.0-py2.7-linux-x86_64.egg/zope/interface/registry.py", line 448, in subscribers
    return self.adapters.subscribers(objects, provided)
  File "/home/jenkins/.buildout/eggs/cp27m/zope.interface-5.2.0-py2.7-linux-x86_64.egg/zope/interface/adapter.py", line 619, in subscribers
    subscription(*objects)
  File "/home/jenkins/workspace/plone-5.2-python-2.7/src/plone.app.contenttypes/plone/app/contenttypes/subscribers.py", line 14, in set_title_description
    datafield = obj.image
  File "/home/jenkins/workspace/plone-5.2-python-2.7/src/plone.dexterity/plone/dexterity/content.py", line 411, in __getattr__
    raise AttributeError(name)


FAILED:  plone.api.tests.test_content.TestPloneApiContent.test_find_parse_object_provides_query

Error Message:
image

Stack Trace:
image

  File "/srv/python2.7/lib/python2.7/unittest/case.py", line 320, in run
    self.setUp()
  File "/home/jenkins/workspace/plone-5.2-python-2.7/src/plone.api/src/plone/api/tests/test_content.py", line 113, in setUp
    id='image',
  File "<decorator-gen-9>", line 2, in create
  File "/home/jenkins/workspace/plone-5.2-python-2.7/src/plone.api/src/plone/api/validation.py", line 81, in wrapped
    return function(*args, **kwargs)
  File "<decorator-gen-8>", line 2, in create
  File "/home/jenkins/workspace/plone-5.2-python-2.7/src/plone.api/src/plone/api/validation.py", line 153, in wrapped
    return function(*args, **kwargs)
  File "/home/jenkins/workspace/plone-5.2-python-2.7/src/plone.api/src/plone/api/content.py", line 88, in create
    container.invokeFactory(type, content_id, **kwargs)
  File "/home/jenkins/.buildout/eggs/cp27m/Products.CMFCore-2.5.1-py2.7.egg/Products/CMFCore/PortalFolder.py", line 300, in invokeFactory
    *args, **kw)
  File "/home/jenkins/.buildout/eggs/cp27m/Products.CMFCore-2.5.1-py2.7.egg/Products/CMFCore/TypesTool.py", line 809, in constructContent
    ob = info.constructInstance(container, id, *args, **kw)
  File "/home/jenkins/.buildout/eggs/cp27m/Products.CMFCore-2.5.1-py2.7.egg/Products/CMFCore/TypesTool.py", line 308, in constructInstance
    return self._constructInstance(container, id, *args, **kw)
  File "/home/jenkins/.buildout/eggs/cp27m/Products.CMFCore-2.5.1-py2.7.egg/Products/CMFCore/TypesTool.py", line 569, in _constructInstance
    notify(ObjectCreatedEvent(obj))
  File "/home/jenkins/.buildout/eggs/cp27m/zope.event-4.5.0-py2.7.egg/zope/event/__init__.py", line 32, in notify
    subscriber(event)
  File "/home/jenkins/.buildout/eggs/cp27m/zope.component-4.6.2-py2.7.egg/zope/component/event.py", line 27, in dispatch
    component_subscribers(event, None)
  File "/home/jenkins/.buildout/eggs/cp27m/zope.component-4.6.2-py2.7.egg/zope/component/_api.py", line 134, in subscribers
    return sitemanager.subscribers(objects, interface)
  File "/home/jenkins/.buildout/eggs/cp27m/zope.interface-5.2.0-py2.7-linux-x86_64.egg/zope/interface/registry.py", line 448, in subscribers
    return self.adapters.subscribers(objects, provided)
  File "/home/jenkins/.buildout/eggs/cp27m/zope.interface-5.2.0-py2.7-linux-x86_64.egg/zope/interface/adapter.py", line 619, in subscribers
    subscription(*objects)
  File "/home/jenkins/.buildout/eggs/cp27m/zope.component-4.6.2-py2.7.egg/zope/component/event.py", line 36, in objectEventNotify
    component_subscribers((event.object, event), None)
  File "/home/jenkins/.buildout/eggs/cp27m/zope.component-4.6.2-py2.7.egg/zope/component/_api.py", line 134, in subscribers
    return sitemanager.subscribers(objects, interface)
  File "/home/jenkins/.buildout/eggs/cp27m/zope.interface-5.2.0-py2.7-linux-x86_64.egg/zope/interface/registry.py", line 448, in subscribers
    return self.adapters.subscribers(objects, provided)
  File "/home/jenkins/.buildout/eggs/cp27m/zope.interface-5.2.0-py2.7-linux-x86_64.egg/zope/interface/adapter.py", line 619, in subscribers
    subscription(*objects)
  File "/home/jenkins/workspace/plone-5.2-python-2.7/src/plone.app.contenttypes/plone/app/contenttypes/subscribers.py", line 14, in set_title_description
    datafield = obj.image
  File "/home/jenkins/workspace/plone-5.2-python-2.7/src/plone.dexterity/plone/dexterity/content.py", line 411, in __getattr__
    raise AttributeError(name)


FAILED:  plone.api.tests.test_content.TestPloneApiContent.test_get

Error Message:
image

Stack Trace:
image

  File "/srv/python2.7/lib/python2.7/unittest/case.py", line 320, in run
    self.setUp()
  File "/home/jenkins/workspace/plone-5.2-python-2.7/src/plone.api/src/plone/api/tests/test_content.py", line 113, in setUp
    id='image',
  File "<decorator-gen-9>", line 2, in create
  File "/home/jenkins/workspace/plone-5.2-python-2.7/src/plone.api/src/plone/api/validation.py", line 81, in wrapped
    return function(*args, **kwargs)
  File "<decorator-gen-8>", line 2, in create
  File "/home/jenkins/workspace/plone-5.2-python-2.7/src/plone.api/src/plone/api/validation.py", line 153, in wrapped
    return function(*args, **kwargs)
  File "/home/jenkins/workspace/plone-5.2-python-2.7/src/plone.api/src/plone/api/content.py", line 88, in create
    container.invokeFactory(type, content_id, **kwargs)
  File "/home/jenkins/.buildout/eggs/cp27m/Products.CMFCore-2.5.1-py2.7.egg/Products/CMFCore/PortalFolder.py", line 300, in invokeFactory
    *args, **kw)
  File "/home/jenkins/.buildout/eggs/cp27m/Products.CMFCore-2.5.1-py2.7.egg/Products/CMFCore/TypesTool.py", line 809, in constructContent
    ob = info.constructInstance(container, id, *args, **kw)
  File "/home/jenkins/.buildout/eggs/cp27m/Products.CMFCore-2.5.1-py2.7.egg/Products/CMFCore/TypesTool.py", line 308, in constructInstance
    return self._constructInstance(container, id, *args, **kw)
  File "/home/jenkins/.buildout/eggs/cp27m/Products.CMFCore-2.5.1-py2.7.egg/Products/CMFCore/TypesTool.py", line 569, in _constructInstance
    notify(ObjectCreatedEvent(obj))
  File "/home/jenkins/.buildout/eggs/cp27m/zope.event-4.5.0-py2.7.egg/zope/event/__init__.py", line 32, in notify
    subscriber(event)
  File "/home/jenkins/.buildout/eggs/cp27m/zope.component-4.6.2-py2.7.egg/zope/component/event.py", line 27, in dispatch
    component_subscribers(event, None)
  File "/home/jenkins/.buildout/eggs/cp27m/zope.component-4.6.2-py2.7.egg/zope/component/_api.py", line 134, in subscribers
    return sitemanager.subscribers(objects, interface)
  File "/home/jenkins/.buildout/eggs/cp27m/zope.interface-5.2.0-py2.7-linux-x86_64.egg/zope/interface/registry.py", line 448, in subscribers
    return self.adapters.subscribers(objects, provided)
  File "/home/jenkins/.buildout/eggs/cp27m/zope.interface-5.2.0-py2.7-linux-x86_64.egg/zope/interface/adapter.py", line 619, in subscribers
    subscription(*objects)
  File "/home/jenkins/.buildout/eggs/cp27m/zope.component-4.6.2-py2.7.egg/zope/component/event.py", line 36, in objectEventNotify
    component_subscribers((event.object, event), None)
  File "/home/jenkins/.buildout/eggs/cp27m/zope.component-4.6.2-py2.7.egg/zope/component/_api.py", line 134, in subscribers
    return sitemanager.subscribers(objects, interface)
  File "/home/jenkins/.buildout/eggs/cp27m/zope.interface-5.2.0-py2.7-linux-x86_64.egg/zope/interface/registry.py", line 448, in subscribers
    return self.adapters.subscribers(objects, provided)
  File "/home/jenkins/.buildout/eggs/cp27m/zope.interface-5.2.0-py2.7-linux-x86_64.egg/zope/interface/adapter.py", line 619, in subscribers
    subscription(*objects)
  File "/home/jenkins/workspace/plone-5.2-python-2.7/src/plone.app.contenttypes/plone/app/contenttypes/subscribers.py", line 14, in set_title_description
    datafield = obj.image
  File "/home/jenkins/workspace/plone-5.2-python-2.7/src/plone.dexterity/plone/dexterity/content.py", line 411, in __getattr__
    raise AttributeError(name)


FAILED:  plone.api.tests.test_content.TestPloneApiContent.test_get_constraints

Error Message:
image

Stack Trace:
image

  File "/srv/python2.7/lib/python2.7/unittest/case.py", line 320, in run
    self.setUp()
  File "/home/jenkins/workspace/plone-5.2-python-2.7/src/plone.api/src/plone/api/tests/test_content.py", line 113, in setUp
    id='image',
  File "<decorator-gen-9>", line 2, in create
  File "/home/jenkins/workspace/plone-5.2-python-2.7/src/plone.api/src/plone/api/validation.py", line 81, in wrapped
    return function(*args, **kwargs)
  File "<decorator-gen-8>", line 2, in create
  File "/home/jenkins/workspace/plone-5.2-python-2.7/src/plone.api/src/plone/api/validation.py", line 153, in wrapped
    return function(*args, **kwargs)
  File "/home/jenkins/workspace/plone-5.2-python-2.7/src/plone.api/src/plone/api/content.py", line 88, in create
    container.invokeFactory(type, content_id, **kwargs)
  File "/home/jenkins/.buildout/eggs/cp27m/Products.CMFCore-2.5.1-py2.7.egg/Products/CMFCore/PortalFolder.py", line 300, in invokeFactory
    *args, **kw)
  File "/home/jenkins/.buildout/eggs/cp27m/Products.CMFCore-2.5.1-py2.7.egg/Products/CMFCore/TypesTool.py", line 809, in constructContent
    ob = info.constructInstance(container, id, *args, **kw)
  File "/home/jenkins/.buildout/eggs/cp27m/Products.CMFCore-2.5.1-py2.7.egg/Products/CMFCore/TypesTool.py", line 308, in constructInstance
    return self._constructInstance(container, id, *args, **kw)
  File "/home/jenkins/.buildout/eggs/cp27m/Products.CMFCore-2.5.1-py2.7.egg/Products/CMFCore/TypesTool.py", line 569, in _constructInstance
    notify(ObjectCreatedEvent(obj))
  File "/home/jenkins/.buildout/eggs/cp27m/zope.event-4.5.0-py2.7.egg/zope/event/__init__.py", line 32, in notify
    subscriber(event)
  File "/home/jenkins/.buildout/eggs/cp27m/zope.component-4.6.2-py2.7.egg/zope/component/event.py", line 27, in dispatch
    component_subscribers(event, None)
  File "/home/jenkins/.buildout/eggs/cp27m/zope.component-4.6.2-py2.7.egg/zope/component/_api.py", line 134, in subscribers
    return sitemanager.subscribers(objects, interface)
  File "/home/jenkins/.buildout/eggs/cp27m/zope.interface-5.2.0-py2.7-linux-x86_64.egg/zope/interface/registry.py", line 448, in subscribers
    return self.adapters.subscribers(objects, provided)
  File "/home/jenkins/.buildout/eggs/cp27m/zope.interface-5.2.0-py2.7-linux-x86_64.egg/zope/interface/adapter.py", line 619, in subscribers
    subscription(*objects)
  File "/home/jenkins/.buildout/eggs/cp27m/zope.component-4.6.2-py2.7.egg/zope/component/event.py", line 36, in objectEventNotify
    component_subscribers((event.object, event), None)
  File "/home/jenkins/.buildout/eggs/cp27m/zope.component-4.6.2-py2.7.egg/zope/component/_api.py", line 134, in subscribers
    return sitemanager.subscribers(objects, interface)
  File "/home/jenkins/.buildout/eggs/cp27m/zope.interface-5.2.0-py2.7-linux-x86_64.egg/zope/interface/registry.py", line 448, in subscribers
    return self.adapters.subscribers(objects, provided)
  File "/home/jenkins/.buildout/eggs/cp27m/zope.interface-5.2.0-py2.7-linux-x86_64.egg/zope/interface/adapter.py", line 619, in subscribers
    subscription(*objects)
  File "/home/jenkins/workspace/plone-5.2-python-2.7/src/plone.app.contenttypes/plone/app/contenttypes/subscribers.py", line 14, in set_title_description
    datafield = obj.image
  File "/home/jenkins/workspace/plone-5.2-python-2.7/src/plone.dexterity/plone/dexterity/content.py", line 411, in __getattr__
    raise AttributeError(name)


FAILED:  plone.api.tests.test_content.TestPloneApiContent.test_get_state

Error Message:
image

Stack Trace:
image

  File "/srv/python2.7/lib/python2.7/unittest/case.py", line 320, in run
    self.setUp()
  File "/home/jenkins/workspace/plone-5.2-python-2.7/src/plone.api/src/plone/api/tests/test_content.py", line 113, in setUp
    id='image',
  File "<decorator-gen-9>", line 2, in create
  File "/home/jenkins/workspace/plone-5.2-python-2.7/src/plone.api/src/plone/api/validation.py", line 81, in wrapped
    return function(*args, **kwargs)
  File "<decorator-gen-8>", line 2, in create
  File "/home/jenkins/workspace/plone-5.2-python-2.7/src/plone.api/src/plone/api/validation.py", line 153, in wrapped
    return function(*args, **kwargs)
  File "/home/jenkins/workspace/plone-5.2-python-2.7/src/plone.api/src/plone/api/content.py", line 88, in create
    container.invokeFactory(type, content_id, **kwargs)
  File "/home/jenkins/.buildout/eggs/cp27m/Products.CMFCore-2.5.1-py2.7.egg/Products/CMFCore/PortalFolder.py", line 300, in invokeFactory
    *args, **kw)
  File "/home/jenkins/.buildout/eggs/cp27m/Products.CMFCore-2.5.1-py2.7.egg/Products/CMFCore/TypesTool.py", line 809, in constructContent
    ob = info.constructInstance(container, id, *args, **kw)
  File "/home/jenkins/.buildout/eggs/cp27m/Products.CMFCore-2.5.1-py2.7.egg/Products/CMFCore/TypesTool.py", line 308, in constructInstance
    return self._constructInstance(container, id, *args, **kw)
  File "/home/jenkins/.buildout/eggs/cp27m/Products.CMFCore-2.5.1-py2.7.egg/Products/CMFCore/TypesTool.py", line 569, in _constructInstance
    notify(ObjectCreatedEvent(obj))
  File "/home/jenkins/.buildout/eggs/cp27m/zope.event-4.5.0-py2.7.egg/zope/event/__init__.py", line 32, in notify
    subscriber(event)
  File "/home/jenkins/.buildout/eggs/cp27m/zope.component-4.6.2-py2.7.egg/zope/component/event.py", line 27, in dispatch
    component_subscribers(event, None)
  File "/home/jenkins/.buildout/eggs/cp27m/zope.component-4.6.2-py2.7.egg/zope/component/_api.py", line 134, in subscribers
    return sitemanager.subscribers(objects, interface)
  File "/home/jenkins/.buildout/eggs/cp27m/zope.interface-5.2.0-py2.7-linux-x86_64.egg/zope/interface/registry.py", line 448, in subscribers
    return self.adapters.subscribers(objects, provided)
  File "/home/jenkins/.buildout/eggs/cp27m/zope.interface-5.2.0-py2.7-linux-x86_64.egg/zope/interface/adapter.py", line 619, in subscribers
    subscription(*objects)
  File "/home/jenkins/.buildout/eggs/cp27m/zope.component-4.6.2-py2.7.egg/zope/component/event.py", line 36, in objectEventNotify
    component_subscribers((event.object, event), None)
  File "/home/jenkins/.buildout/eggs/cp27m/zope.component-4.6.2-py2.7.egg/zope/component/_api.py", line 134, in subscribers
    return sitemanager.subscribers(objects, interface)
  File "/home/jenkins/.buildout/eggs/cp27m/zope.interface-5.2.0-py2.7-linux-x86_64.egg/zope/interface/registry.py", line 448, in subscribers
    return self.adapters.subscribers(objects, provided)
  File "/home/jenkins/.buildout/eggs/cp27m/zope.interface-5.2.0-py2.7-linux-x86_64.egg/zope/interface/adapter.py", line 619, in subscribers
    subscription(*objects)
  File "/home/jenkins/workspace/plone-5.2-python-2.7/src/plone.app.contenttypes/plone/app/contenttypes/subscribers.py", line 14, in set_title_description
    datafield = obj.image
  File "/home/jenkins/workspace/plone-5.2-python-2.7/src/plone.dexterity/plone/dexterity/content.py", line 411, in __getattr__
    raise AttributeError(name)


FAILED:  plone.api.tests.test_content.TestPloneApiContent.test_get_state_default_value

Error Message:
image

Stack Trace:
image

  File "/srv/python2.7/lib/python2.7/unittest/case.py", line 320, in run
    self.setUp()
  File "/home/jenkins/workspace/plone-5.2-python-2.7/src/plone.api/src/plone/api/tests/test_content.py", line 113, in setUp
    id='image',
  File "<decorator-gen-9>", line 2, in create
  File "/home/jenkins/workspace/plone-5.2-python-2.7/src/plone.api/src/plone/api/validation.py", line 81, in wrapped
    return function(*args, **kwargs)
  File "<decorator-gen-8>", line 2, in create
  File "/home/jenkins/workspace/plone-5.2-python-2.7/src/plone.api/src/plone/api/validation.py", line 153, in wrapped
    return function(*args, **kwargs)
  File "/home/jenkins/workspace/plone-5.2-python-2.7/src/plone.api/src/plone/api/content.py", line 88, in create
    container.invokeFactory(type, content_id, **kwargs)
  File "/home/jenkins/.buildout/eggs/cp27m/Products.CMFCore-2.5.1-py2.7.egg/Products/CMFCore/PortalFolder.py", line 300, in invokeFactory
    *args, **kw)
  File "/home/jenkins/.buildout/eggs/cp27m/Products.CMFCore-2.5.1-py2.7.egg/Products/CMFCore/TypesTool.py", line 809, in constructContent
    ob = info.constructInstance(container, id, *args, **kw)
  File "/home/jenkins/.buildout/eggs/cp27m/Products.CMFCore-2.5.1-py2.7.egg/Products/CMFCore/TypesTool.py", line 308, in constructInstance
    return self._constructInstance(container, id, *args, **kw)
  File "/home/jenkins/.buildout/eggs/cp27m/Products.CMFCore-2.5.1-py2.7.egg/Products/CMFCore/TypesTool.py", line 569, in _constructInstance
    notify(ObjectCreatedEvent(obj))
  File "/home/jenkins/.buildout/eggs/cp27m/zope.event-4.5.0-py2.7.egg/zope/event/__init__.py", line 32, in notify
    subscriber(event)
  File "/home/jenkins/.buildout/eggs/cp27m/zope.component-4.6.2-py2.7.egg/zope/component/event.py", line 27, in dispatch
    component_subscribers(event, None)
  File "/home/jenkins/.buildout/eggs/cp27m/zope.component-4.6.2-py2.7.egg/zope/component/_api.py", line 134, in subscribers
    return sitemanager.subscribers(objects, interface)
  File "/home/jenkins/.buildout/eggs/cp27m/zope.interface-5.2.0-py2.7-linux-x86_64.egg/zope/interface/registry.py", line 448, in subscribers
    return self.adapters.subscribers(objects, provided)
  File "/home/jenkins/.buildout/eggs/cp27m/zope.interface-5.2.0-py2.7-linux-x86_64.egg/zope/interface/adapter.py", line 619, in subscribers
    subscription(*objects)
  File "/home/jenkins/.buildout/eggs/cp27m/zope.component-4.6.2-py2.7.egg/zope/component/event.py", line 36, in objectEventNotify
    component_subscribers((event.object, event), None)
  File "/home/jenkins/.buildout/eggs/cp27m/zope.component-4.6.2-py2.7.egg/zope/component/_api.py", line 134, in subscribers
    return sitemanager.subscribers(objects, interface)
  File "/home/jenkins/.buildout/eggs/cp27m/zope.interface-5.2.0-py2.7-linux-x86_64.egg/zope/interface/registry.py", line 448, in subscribers
    return self.adapters.subscribers(objects, provided)
  File "/home/jenkins/.buildout/eggs/cp27m/zope.interface-5.2.0-py2.7-linux-x86_64.egg/zope/interface/adapter.py", line 619, in subscribers
    subscription(*objects)
  File "/home/jenkins/workspace/plone-5.2-python-2.7/src/plone.app.contenttypes/plone/app/contenttypes/subscribers.py", line 14, in set_title_description
    datafield = obj.image
  File "/home/jenkins/workspace/plone-5.2-python-2.7/src/plone.dexterity/plone/dexterity/content.py", line 411, in __getattr__
    raise AttributeError(name)


FAILED:  plone.api.tests.test_content.TestPloneApiContent.test_get_uuid

Error Message:
image

Stack Trace:
image

  File "/srv/python2.7/lib/python2.7/unittest/case.py", line 320, in run
    self.setUp()
  File "/home/jenkins/workspace/plone-5.2-python-2.7/src/plone.api/src/plone/api/tests/test_content.py", line 113, in setUp
    id='image',
  File "<decorator-gen-9>", line 2, in create
  File "/home/jenkins/workspace/plone-5.2-python-2.7/src/plone.api/src/plone/api/validation.py", line 81, in wrapped
    return function(*args, **kwargs)
  File "<decorator-gen-8>", line 2, in create
  File "/home/jenkins/workspace/plone-5.2-python-2.7/src/plone.api/src/plone/api/validation.py", line 153, in wrapped
    return function(*args, **kwargs)
  File "/home/jenkins/workspace/plone-5.2-python-2.7/src/plone.api/src/plone/api/content.py", line 88, in create
    container.invokeFactory(type, content_id, **kwargs)
  File "/home/jenkins/.buildout/eggs/cp27m/Products.CMFCore-2.5.1-py2.7.egg/Products/CMFCore/PortalFolder.py", line 300, in invokeFactory
    *args, **kw)
  File "/home/jenkins/.buildout/eggs/cp27m/Products.CMFCore-2.5.1-py2.7.egg/Products/CMFCore/TypesTool.py", line 809, in constructContent
    ob = info.constructInstance(container, id, *args, **kw)
  File "/home/jenkins/.buildout/eggs/cp27m/Products.CMFCore-2.5.1-py2.7.egg/Products/CMFCore/TypesTool.py", line 308, in constructInstance
    return self._constructInstance(container, id, *args, **kw)
  File "/home/jenkins/.buildout/eggs/cp27m/Products.CMFCore-2.5.1-py2.7.egg/Products/CMFCore/TypesTool.py", line 569, in _constructInstance
    notify(ObjectCreatedEvent(obj))
  File "/home/jenkins/.buildout/eggs/cp27m/zope.event-4.5.0-py2.7.egg/zope/event/__init__.py", line 32, in notify
    subscriber(event)
  File "/home/jenkins/.buildout/eggs/cp27m/zope.component-4.6.2-py2.7.egg/zope/component/event.py", line 27, in dispatch
    component_subscribers(event, None)
  File "/home/jenkins/.buildout/eggs/cp27m/zope.component-4.6.2-py2.7.egg/zope/component/_api.py", line 134, in subscribers
    return sitemanager.subscribers(objects, interface)
  File "/home/jenkins/.buildout/eggs/cp27m/zope.interface-5.2.0-py2.7-linux-x86_64.egg/zope/interface/registry.py", line 448, in subscribers
    return self.adapters.subscribers(objects, provided)
  File "/home/jenkins/.buildout/eggs/cp27m/zope.interface-5.2.0-py2.7-linux-x86_64.egg/zope/interface/adapter.py", line 619, in subscribers
    subscription(*objects)
  File "/home/jenkins/.buildout/eggs/cp27m/zope.component-4.6.2-py2.7.egg/zope/component/event.py", line 36, in objectEventNotify
    component_subscribers((event.object, event), None)
  File "/home/jenkins/.buildout/eggs/cp27m/zope.component-4.6.2-py2.7.egg/zope/component/_api.py", line 134, in subscribers
    return sitemanager.subscribers(objects, interface)
  File "/home/jenkins/.buildout/eggs/cp27m/zope.interface-5.2.0-py2.7-linux-x86_64.egg/zope/interface/registry.py", line 448, in subscribers
    return self.adapters.subscribers(objects, provided)
  File "/home/jenkins/.buildout/eggs/cp27m/zope.interface-5.2.0-py2.7-linux-x86_64.egg/zope/interface/adapter.py", line 619, in subscribers
    subscription(*objects)
  File "/home/jenkins/workspace/plone-5.2-python-2.7/src/plone.app.contenttypes/plone/app/contenttypes/subscribers.py", line 14, in set_title_description
    datafield = obj.image
  File "/home/jenkins/workspace/plone-5.2-python-2.7/src/plone.dexterity/plone/dexterity/content.py", line 411, in __getattr__
    raise AttributeError(name)


FAILED:  plone.api.tests.test_content.TestPloneApiContent.test_get_view

Error Message:
image

Stack Trace:
image

  File "/srv/python2.7/lib/python2.7/unittest/case.py", line 320, in run
    self.setUp()
  File "/home/jenkins/workspace/plone-5.2-python-2.7/src/plone.api/src/plone/api/tests/test_content.py", line 113, in setUp
    id='image',
  File "<decorator-gen-9>", line 2, in create
  File "/home/jenkins/workspace/plone-5.2-python-2.7/src/plone.api/src/plone/api/validation.py", line 81, in wrapped
    return function(*args, **kwargs)
  File "<decorator-gen-8>", line 2, in create
  File "/home/jenkins/workspace/plone-5.2-python-2.7/src/plone.api/src/plone/api/validation.py", line 153, in wrapped
    return function(*args, **kwargs)
  File "/home/jenkins/workspace/plone-5.2-python-2.7/src/plone.api/src/plone/api/content.py", line 88, in create
    container.invokeFactory(type, content_id, **kwargs)
  File "/home/jenkins/.buildout/eggs/cp27m/Products.CMFCore-2.5.1-py2.7.egg/Products/CMFCore/PortalFolder.py", line 300, in invokeFactory
    *args, **kw)
  File "/home/jenkins/.buildout/eggs/cp27m/Products.CMFCore-2.5.1-py2.7.egg/Products/CMFCore/TypesTool.py", line 809, in constructContent
    ob = info.constructInstance(container, id, *args, **kw)
  File "/home/jenkins/.buildout/eggs/cp27m/Products.CMFCore-2.5.1-py2.7.egg/Products/CMFCore/TypesTool.py", line 308, in constructInstance
    return self._constructInstance(container, id, *args, **kw)
  File "/home/jenkins/.buildout/eggs/cp27m/Products.CMFCore-2.5.1-py2.7.egg/Products/CMFCore/TypesTool.py", line 569, in _constructInstance
    notify(ObjectCreatedEvent(obj))
  File "/home/jenkins/.buildout/eggs/cp27m/zope.event-4.5.0-py2.7.egg/zope/event/__init__.py", line 32, in notify
    subscriber(event)
  File "/home/jenkins/.buildout/eggs/cp27m/zope.component-4.6.2-py2.7.egg/zope/component/event.py", line 27, in dispatch
    component_subscribers(event, None)
  File "/home/jenkins/.buildout/eggs/cp27m/zope.component-4.6.2-py2.7.egg/zope/component/_api.py", line 134, in subscribers
    return sitemanager.subscribers(objects, interface)
  File "/home/jenkins/.buildout/eggs/cp27m/zope.interface-5.2.0-py2.7-linux-x86_64.egg/zope/interface/registry.py", line 448, in subscribers
    return self.adapters.subscribers(objects, provided)
  File "/home/jenkins/.buildout/eggs/cp27m/zope.interface-5.2.0-py2.7-linux-x86_64.egg/zope/interface/adapter.py", line 619, in subscribers
    subscription(*objects)
  File "/home/jenkins/.buildout/eggs/cp27m/zope.component-4.6.2-py2.7.egg/zope/component/event.py", line 36, in objectEventNotify
    component_subscribers((event.object, event), None)
  File "/home/jenkins/.buildout/eggs/cp27m/zope.component-4.6.2-py2.7.egg/zope/component/_api.py", line 134, in subscribers
    return sitemanager.subscribers(objects, interface)
  File "/home/jenkins/.buildout/eggs/cp27m/zope.interface-5.2.0-py2.7-linux-x86_64.egg/zope/interface/registry.py", line 448, in subscribers
    return self.adapters.subscribers(objects, provided)
  File "/home/jenkins/.buildout/eggs/cp27m/zope.interface-5.2.0-py2.7-linux-x86_64.egg/zope/interface/adapter.py", line 619, in subscribers
    subscription(*objects)
  File "/home/jenkins/workspace/plone-5.2-python-2.7/src/plone.app.contenttypes/plone/app/contenttypes/subscribers.py", line 14, in set_title_description
    datafield = obj.image
  File "/home/jenkins/workspace/plone-5.2-python-2.7/src/plone.dexterity/plone/dexterity/content.py", line 411, in __getattr__
    raise AttributeError(name)


FAILED:  plone.api.tests.test_content.TestPloneApiContent.test_get_view_constraints

Error Message:
image

Stack Trace:
image

  File "/srv/python2.7/lib/python2.7/unittest/case.py", line 320, in run
    self.setUp()
  File "/home/jenkins/workspace/plone-5.2-python-2.7/src/plone.api/src/plone/api/tests/test_content.py", line 113, in setUp
    id='image',
  File "<decorator-gen-9>", line 2, in create
  File "/home/jenkins/workspace/plone-5.2-python-2.7/src/plone.api/src/plone/api/validation.py", line 81, in wrapped
    return function(*args, **kwargs)
  File "<decorator-gen-8>", line 2, in create
  File "/home/jenkins/workspace/plone-5.2-python-2.7/src/plone.api/src/plone/api/validation.py", line 153, in wrapped
    return function(*args, **kwargs)
  File "/home/jenkins/workspace/plone-5.2-python-2.7/src/plone.api/src/plone/api/content.py", line 88, in create
    container.invokeFactory(type, content_id, **kwargs)
  File "/home/jenkins/.buildout/eggs/cp27m/Products.CMFCore-2.5.1-py2.7.egg/Products/CMFCore/PortalFolder.py", line 300, in invokeFactory
    *args, **kw)
  File "/home/jenkins/.buildout/eggs/cp27m/Products.CMFCore-2.5.1-py2.7.egg/Products/CMFCore/TypesTool.py", line 809, in constructContent
    ob = info.constructInstance(container, id, *args, **kw)
  File "/home/jenkins/.buildout/eggs/cp27m/Products.CMFCore-2.5.1-py2.7.egg/Products/CMFCore/TypesTool.py", line 308, in constructInstance
    return self._constructInstance(container, id, *args, **kw)
  File "/home/jenkins/.buildout/eggs/cp27m/Products.CMFCore-2.5.1-py2.7.egg/Products/CMFCore/TypesTool.py", line 569, in _constructInstance
    notify(ObjectCreatedEvent(obj))
  File "/home/jenkins/.buildout/eggs/cp27m/zope.event-4.5.0-py2.7.egg/zope/event/__init__.py", line 32, in notify
    subscriber(event)
  File "/home/jenkins/.buildout/eggs/cp27m/zope.component-4.6.2-py2.7.egg/zope/component/event.py", line 27, in dispatch
    component_subscribers(event, None)
  File "/home/jenkins/.buildout/eggs/cp27m/zope.component-4.6.2-py2.7.egg/zope/component/_api.py", line 134, in subscribers
    return sitemanager.subscribers(objects, interface)
  File "/home/jenkins/.buildout/eggs/cp27m/zope.interface-5.2.0-py2.7-linux-x86_64.egg/zope/interface/registry.py", line 448, in subscribers
    return self.adapters.subscribers(objects, provided)
  File "/home/jenkins/.buildout/eggs/cp27m/zope.interface-5.2.0-py2.7-linux-x86_64.egg/zope/interface/adapter.py", line 619, in subscribers
    subscription(*objects)
  File "/home/jenkins/.buildout/eggs/cp27m/zope.component-4.6.2-py2.7.egg/zope/component/event.py", line 36, in objectEventNotify
    component_subscribers((event.object, event), None)
  File "/home/jenkins/.buildout/eggs/cp27m/zope.component-4.6.2-py2.7.egg/zope/component/_api.py", line 134, in subscribers
    return sitemanager.subscribers(objects, interface)
  File "/home/jenkins/.buildout/eggs/cp27m/zope.interface-5.2.0-py2.7-linux-x86_64.egg/zope/interface/registry.py", line 448, in subscribers
    return self.adapters.subscribers(objects, provided)
  File "/home/jenkins/.buildout/eggs/cp27m/zope.interface-5.2.0-py2.7-linux-x86_64.egg/zope/interface/adapter.py", line 619, in subscribers
    subscription(*objects)
  File "/home/jenkins/workspace/plone-5.2-python-2.7/src/plone.app.contenttypes/plone/app/contenttypes/subscribers.py", line 14, in set_title_description
    datafield = obj.image
  File "/home/jenkins/workspace/plone-5.2-python-2.7/src/plone.dexterity/plone/dexterity/content.py", line 411, in __getattr__
    raise AttributeError(name)


FAILED:  plone.api.tests.test_content.TestPloneApiContent.test_get_view_view_not_found

Error Message:
image

Stack Trace:
image

  File "/srv/python2.7/lib/python2.7/unittest/case.py", line 320, in run
    self.setUp()
  File "/home/jenkins/workspace/plone-5.2-python-2.7/src/plone.api/src/plone/api/tests/test_content.py", line 113, in setUp
    id='image',
  File "<decorator-gen-9>", line 2, in create
  File "/home/jenkins/workspace/plone-5.2-python-2.7/src/plone.api/src/plone/api/validation.py", line 81, in wrapped
    return function(*args, **kwargs)
  File "<decorator-gen-8>", line 2, in create
  File "/home/jenkins/workspace/plone-5.2-python-2.7/src/plone.api/src/plone/api/validation.py", line 153, in wrapped
    return function(*args, **kwargs)
  File "/home/jenkins/workspace/plone-5.2-python-2.7/src/plone.api/src/plone/api/content.py", line 88, in create
    container.invokeFactory(type, content_id, **kwargs)
  File "/home/jenkins/.buildout/eggs/cp27m/Products.CMFCore-2.5.1-py2.7.egg/Products/CMFCore/PortalFolder.py", line 300, in invokeFactory
    *args, **kw)
  File "/home/jenkins/.buildout/eggs/cp27m/Products.CMFCore-2.5.1-py2.7.egg/Products/CMFCore/TypesTool.py", line 809, in constructContent
    ob = info.constructInstance(container, id, *args, **kw)
  File "/home/jenkins/.buildout/eggs/cp27m/Products.CMFCore-2.5.1-py2.7.egg/Products/CMFCore/TypesTool.py", line 308, in constructInstance
    return self._constructInstance(container, id, *args, **kw)
  File "/home/jenkins/.buildout/eggs/cp27m/Products.CMFCore-2.5.1-py2.7.egg/Products/CMFCore/TypesTool.py", line 569, in _constructInstance
    notify(ObjectCreatedEvent(obj))
  File "/home/jenkins/.buildout/eggs/cp27m/zope.event-4.5.0-py2.7.egg/zope/event/__init__.py", line 32, in notify
    subscriber(event)
  File "/home/jenkins/.buildout/eggs/cp27m/zope.component-4.6.2-py2.7.egg/zope/component/event.py", line 27, in dispatch
    component_subscribers(event, None)
  File "/home/jenkins/.buildout/eggs/cp27m/zope.component-4.6.2-py2.7.egg/zope/component/_api.py", line 134, in subscribers
    return sitemanager.subscribers(objects, interface)
  File "/home/jenkins/.buildout/eggs/cp27m/zope.interface-5.2.0-py2.7-linux-x86_64.egg/zope/interface/registry.py", line 448, in subscribers
    return self.adapters.subscribers(objects, provided)
  File "/home/jenkins/.buildout/eggs/cp27m/zope.interface-5.2.0-py2.7-linux-x86_64.egg/zope/interface/adapter.py", line 619, in subscribers
    subscription(*objects)
  File "/home/jenkins/.buildout/eggs/cp27m/zope.component-4.6.2-py2.7.egg/zope/component/event.py", line 36, in objectEventNotify
    component_subscribers((event.object, event), None)
  File "/home/jenkins/.buildout/eggs/cp27m/zope.component-4.6.2-py2.7.egg/zope/component/_api.py", line 134, in subscribers
    return sitemanager.subscribers(objects, interface)
  File "/home/jenkins/.buildout/eggs/cp27m/zope.interface-5.2.0-py2.7-linux-x86_64.egg/zope/interface/registry.py", line 448, in subscribers
    return self.adapters.subscribers(objects, provided)
  File "/home/jenkins/.buildout/eggs/cp27m/zope.interface-5.2.0-py2.7-linux-x86_64.egg/zope/interface/adapter.py", line 619, in subscribers
    subscription(*objects)
  File "/home/jenkins/workspace/plone-5.2-python-2.7/src/plone.app.contenttypes/plone/app/contenttypes/subscribers.py", line 14, in set_title_description
    datafield = obj.image
  File "/home/jenkins/workspace/plone-5.2-python-2.7/src/plone.dexterity/plone/dexterity/content.py", line 411, in __getattr__
    raise AttributeError(name)


FAILED:  plone.api.tests.test_content.TestPloneApiContent.test_move

Error Message:
image

Stack Trace:
image

  File "/srv/python2.7/lib/python2.7/unittest/case.py", line 320, in run
    self.setUp()
  File "/home/jenkins/workspace/plone-5.2-python-2.7/src/plone.api/src/plone/api/tests/test_content.py", line 113, in setUp
    id='image',
  File "<decorator-gen-9>", line 2, in create
  File "/home/jenkins/workspace/plone-5.2-python-2.7/src/plone.api/src/plone/api/validation.py", line 81, in wrapped
    return function(*args, **kwargs)
  File "<decorator-gen-8>", line 2, in create
  File "/home/jenkins/workspace/plone-5.2-python-2.7/src/plone.api/src/plone/api/validation.py", line 153, in wrapped
    return function(*args, **kwargs)
  File "/home/jenkins/workspace/plone-5.2-python-2.7/src/plone.api/src/plone/api/content.py", line 88, in create
    container.invokeFactory(type, content_id, **kwargs)
  File "/home/jenkins/.buildout/eggs/cp27m/Products.CMFCore-2.5.1-py2.7.egg/Products/CMFCore/PortalFolder.py", line 300, in invokeFactory
    *args, **kw)
  File "/home/jenkins/.buildout/eggs/cp27m/Products.CMFCore-2.5.1-py2.7.egg/Products/CMFCore/TypesTool.py", line 809, in constructContent
    ob = info.constructInstance(container, id, *args, **kw)
  File "/home/jenkins/.buildout/eggs/cp27m/Products.CMFCore-2.5.1-py2.7.egg/Products/CMFCore/TypesTool.py", line 308, in constructInstance
    return self._constructInstance(container, id, *args, **kw)
  File "/home/jenkins/.buildout/eggs/cp27m/Products.CMFCore-2.5.1-py2.7.egg/Products/CMFCore/TypesTool.py", line 569, in _constructInstance
    notify(ObjectCreatedEvent(obj))
  File "/home/jenkins/.buildout/eggs/cp27m/zope.event-4.5.0-py2.7.egg/zope/event/__init__.py", line 32, in notify
    subscriber(event)
  File "/home/jenkins/.buildout/eggs/cp27m/zope.component-4.6.2-py2.7.egg/zope/component/event.py", line 27, in dispatch
    component_subscribers(event, None)
  File "/home/jenkins/.buildout/eggs/cp27m/zope.component-4.6.2-py2.7.egg/zope/component/_api.py", line 134, in subscribers
    return sitemanager.subscribers(objects, interface)
  File "/home/jenkins/.buildout/eggs/cp27m/zope.interface-5.2.0-py2.7-linux-x86_64.egg/zope/interface/registry.py", line 448, in subscribers
    return self.adapters.subscribers(objects, provided)
  File "/home/jenkins/.buildout/eggs/cp27m/zope.interface-5.2.0-py2.7-linux-x86_64.egg/zope/interface/adapter.py", line 619, in subscribers
    subscription(*objects)
  File "/home/jenkins/.buildout/eggs/cp27m/zope.component-4.6.2-py2.7.egg/zope/component/event.py", line 36, in objectEventNotify
    component_subscribers((event.object, event), None)
  File "/home/jenkins/.buildout/eggs/cp27m/zope.component-4.6.2-py2.7.egg/zope/component/_api.py", line 134, in subscribers
    return sitemanager.subscribers(objects, interface)
  File "/home/jenkins/.buildout/eggs/cp27m/zope.interface-5.2.0-py2.7-linux-x86_64.egg/zope/interface/registry.py", line 448, in subscribers
    return self.adapters.subscribers(objects, provided)
  File "/home/jenkins/.buildout/eggs/cp27m/zope.interface-5.2.0-py2.7-linux-x86_64.egg/zope/interface/adapter.py", line 619, in subscribers
    subscription(*objects)
  File "/home/jenkins/workspace/plone-5.2-python-2.7/src/plone.app.contenttypes/plone/app/contenttypes/subscribers.py", line 14, in set_title_description
    datafield = obj.image
  File "/home/jenkins/workspace/plone-5.2-python-2.7/src/plone.dexterity/plone/dexterity/content.py", line 411, in __getattr__
    raise AttributeError(name)


FAILED:  plone.api.tests.test_content.TestPloneApiContent.test_move_constraints

Error Message:
image

Stack Trace:
image

  File "/srv/python2.7/lib/python2.7/unittest/case.py", line 320, in run
    self.setUp()
  File "/home/jenkins/workspace/plone-5.2-python-2.7/src/plone.api/src/plone/api/tests/test_content.py", line 113, in setUp
    id='image',
  File "<decorator-gen-9>", line 2, in create
  File "/home/jenkins/workspace/plone-5.2-python-2.7/src/plone.api/src/plone/api/validation.py", line 81, in wrapped
    return function(*args, **kwargs)
  File "<decorator-gen-8>", line 2, in create
  File "/home/jenkins/workspace/plone-5.2-python-2.7/src/plone.api/src/plone/api/validation.py", line 153, in wrapped
    return function(*args, **kwargs)
  File "/home/jenkins/workspace/plone-5.2-python-2.7/src/plone.api/src/plone/api/content.py", line 88, in create
    container.invokeFactory(type, content_id, **kwargs)
  File "/home/jenkins/.buildout/eggs/cp27m/Products.CMFCore-2.5.1-py2.7.egg/Products/CMFCore/PortalFolder.py", line 300, in invokeFactory
    *args, **kw)
  File "/home/jenkins/.buildout/eggs/cp27m/Products.CMFCore-2.5.1-py2.7.egg/Products/CMFCore/TypesTool.py", line 809, in constructContent
    ob = info.constructInstance(container, id, *args, **kw)
  File "/home/jenkins/.buildout/eggs/cp27m/Products.CMFCore-2.5.1-py2.7.egg/Products/CMFCore/TypesTool.py", line 308, in constructInstance
    return self._constructInstance(container, id, *args, **kw)
  File "/home/jenkins/.buildout/eggs/cp27m/Products.CMFCore-2.5.1-py2.7.egg/Products/CMFCore/TypesTool.py", line 569, in _constructInstance
    notify(ObjectCreatedEvent(obj))
  File "/home/jenkins/.buildout/eggs/cp27m/zope.event-4.5.0-py2.7.egg/zope/event/__init__.py", line 32, in notify
    subscriber(event)
  File "/home/jenkins/.buildout/eggs/cp27m/zope.component-4.6.2-py2.7.egg/zope/component/event.py", line 27, in dispatch
    component_subscribers(event, None)
  File "/home/jenkins/.buildout/eggs/cp27m/zope.component-4.6.2-py2.7.egg/zope/component/_api.py", line 134, in subscribers
    return sitemanager.subscribers(objects, interface)
  File "/home/jenkins/.buildout/eggs/cp27m/zope.interface-5.2.0-py2.7-linux-x86_64.egg/zope/interface/registry.py", line 448, in subscribers
    return self.adapters.subscribers(objects, provided)
  File "/home/jenkins/.buildout/eggs/cp27m/zope.interface-5.2.0-py2.7-linux-x86_64.egg/zope/interface/adapter.py", line 619, in subscribers
    subscription(*objects)
  File "/home/jenkins/.buildout/eggs/cp27m/zope.component-4.6.2-py2.7.egg/zope/component/event.py", line 36, in objectEventNotify
    component_subscribers((event.object, event), None)
  File "/home/jenkins/.buildout/eggs/cp27m/zope.component-4.6.2-py2.7.egg/zope/component/_api.py", line 134, in subscribers
    return sitemanager.subscribers(objects, interface)
  File "/home/jenkins/.buildout/eggs/cp27m/zope.interface-5.2.0-py2.7-linux-x86_64.egg/zope/interface/registry.py", line 448, in subscribers
    return self.adapters.subscribers(objects, provided)
  File "/home/jenkins/.buildout/eggs/cp27m/zope.interface-5.2.0-py2.7-linux-x86_64.egg/zope/interface/adapter.py", line 619, in subscribers
    subscription(*objects)
  File "/home/jenkins/workspace/plone-5.2-python-2.7/src/plone.app.contenttypes/plone/app/contenttypes/subscribers.py", line 14, in set_title_description
    datafield = obj.image
  File "/home/jenkins/workspace/plone-5.2-python-2.7/src/plone.dexterity/plone/dexterity/content.py", line 411, in __getattr__
    raise AttributeError(name)


FAILED:  plone.api.tests.test_content.TestPloneApiContent.test_move_no_move_if_target_is_source_parent

Error Message:
image

Stack Trace:
image

  File "/srv/python2.7/lib/python2.7/unittest/case.py", line 320, in run
    self.setUp()
  File "/home/jenkins/workspace/plone-5.2-python-2.7/src/plone.api/src/plone/api/tests/test_content.py", line 113, in setUp
    id='image',
  File "<decorator-gen-9>", line 2, in create
  File "/home/jenkins/workspace/plone-5.2-python-2.7/src/plone.api/src/plone/api/validation.py", line 81, in wrapped
    return function(*args, **kwargs)
  File "<decorator-gen-8>", line 2, in create
  File "/home/jenkins/workspace/plone-5.2-python-2.7/src/plone.api/src/plone/api/validation.py", line 153, in wrapped
    return function(*args, **kwargs)
  File "/home/jenkins/workspace/plone-5.2-python-2.7/src/plone.api/src/plone/api/content.py", line 88, in create
    container.invokeFactory(type, content_id, **kwargs)
  File "/home/jenkins/.buildout/eggs/cp27m/Products.CMFCore-2.5.1-py2.7.egg/Products/CMFCore/PortalFolder.py", line 300, in invokeFactory
    *args, **kw)
  File "/home/jenkins/.buildout/eggs/cp27m/Products.CMFCore-2.5.1-py2.7.egg/Products/CMFCore/TypesTool.py", line 809, in constructContent
    ob = info.constructInstance(container, id, *args, **kw)
  File "/home/jenkins/.buildout/eggs/cp27m/Products.CMFCore-2.5.1-py2.7.egg/Products/CMFCore/TypesTool.py", line 308, in constructInstance
    return self._constructInstance(container, id, *args, **kw)
  File "/home/jenkins/.buildout/eggs/cp27m/Products.CMFCore-2.5.1-py2.7.egg/Products/CMFCore/TypesTool.py", line 569, in _constructInstance
    notify(ObjectCreatedEvent(obj))
  File "/home/jenkins/.buildout/eggs/cp27m/zope.event-4.5.0-py2.7.egg/zope/event/__init__.py", line 32, in notify
    subscriber(event)
  File "/home/jenkins/.buildout/eggs/cp27m/zope.component-4.6.2-py2.7.egg/zope/component/event.py", line 27, in dispatch
    component_subscribers(event, None)
  File "/home/jenkins/.buildout/eggs/cp27m/zope.component-4.6.2-py2.7.egg/zope/component/_api.py", line 134, in subscribers
    return sitemanager.subscribers(objects, interface)
  File "/home/jenkins/.buildout/eggs/cp27m/zope.interface-5.2.0-py2.7-linux-x86_64.egg/zope/interface/registry.py", line 448, in subscribers
    return self.adapters.subscribers(objects, provided)
  File "/home/jenkins/.buildout/eggs/cp27m/zope.interface-5.2.0-py2.7-linux-x86_64.egg/zope/interface/adapter.py", line 619, in subscribers
    subscription(*objects)
  File "/home/jenkins/.buildout/eggs/cp27m/zope.component-4.6.2-py2.7.egg/zope/component/event.py", line 36, in objectEventNotify
    component_subscribers((event.object, event), None)
  File "/home/jenkins/.buildout/eggs/cp27m/zope.component-4.6.2-py2.7.egg/zope/component/_api.py", line 134, in subscribers
    return sitemanager.subscribers(objects, interface)
  File "/home/jenkins/.buildout/eggs/cp27m/zope.interface-5.2.0-py2.7-linux-x86_64.egg/zope/interface/registry.py", line 448, in subscribers
    return self.adapters.subscribers(objects, provided)
  File "/home/jenkins/.buildout/eggs/cp27m/zope.interface-5.2.0-py2.7-linux-x86_64.egg/zope/interface/adapter.py", line 619, in subscribers
    subscription(*objects)
  File "/home/jenkins/workspace/plone-5.2-python-2.7/src/plone.app.contenttypes/plone/app/contenttypes/subscribers.py", line 14, in set_title_description
    datafield = obj.image
  File "/home/jenkins/workspace/plone-5.2-python-2.7/src/plone.dexterity/plone/dexterity/content.py", line 411, in __getattr__
    raise AttributeError(name)


FAILED:  plone.api.tests.test_content.TestPloneApiContent.test_rename

Error Message:
image

Stack Trace:
image

  File "/srv/python2.7/lib/python2.7/unittest/case.py", line 320, in run
    self.setUp()
  File "/home/jenkins/workspace/plone-5.2-python-2.7/src/plone.api/src/plone/api/tests/test_content.py", line 113, in setUp
    id='image',
  File "<decorator-gen-9>", line 2, in create
  File "/home/jenkins/workspace/plone-5.2-python-2.7/src/plone.api/src/plone/api/validation.py", line 81, in wrapped
    return function(*args, **kwargs)
  File "<decorator-gen-8>", line 2, in create
  File "/home/jenkins/workspace/plone-5.2-python-2.7/src/plone.api/src/plone/api/validation.py", line 153, in wrapped
    return function(*args, **kwargs)
  File "/home/jenkins/workspace/plone-5.2-python-2.7/src/plone.api/src/plone/api/content.py", line 88, in create
    container.invokeFactory(type, content_id, **kwargs)
  File "/home/jenkins/.buildout/eggs/cp27m/Products.CMFCore-2.5.1-py2.7.egg/Products/CMFCore/PortalFolder.py", line 300, in invokeFactory
    *args, **kw)
  File "/home/jenkins/.buildout/eggs/cp27m/Products.CMFCore-2.5.1-py2.7.egg/Products/CMFCore/TypesTool.py", line 809, in constructContent
    ob = info.constructInstance(container, id, *args, **kw)
  File "/home/jenkins/.buildout/eggs/cp27m/Products.CMFCore-2.5.1-py2.7.egg/Products/CMFCore/TypesTool.py", line 308, in constructInstance
    return self._constructInstance(container, id, *args, **kw)
  File "/home/jenkins/.buildout/eggs/cp27m/Products.CMFCore-2.5.1-py2.7.egg/Products/CMFCore/TypesTool.py", line 569, in _constructInstance
    notify(ObjectCreatedEvent(obj))
  File "/home/jenkins/.buildout/eggs/cp27m/zope.event-4.5.0-py2.7.egg/zope/event/__init__.py", line 32, in notify
    subscriber(event)
  File "/home/jenkins/.buildout/eggs/cp27m/zope.component-4.6.2-py2.7.egg/zope/component/event.py", line 27, in dispatch
    component_subscribers(event, None)
  File "/home/jenkins/.buildout/eggs/cp27m/zope.component-4.6.2-py2.7.egg/zope/component/_api.py", line 134, in subscribers
    return sitemanager.subscribers(objects, interface)
  File "/home/jenkins/.buildout/eggs/cp27m/zope.interface-5.2.0-py2.7-linux-x86_64.egg/zope/interface/registry.py", line 448, in subscribers
    return self.adapters.subscribers(objects, provided)
  File "/home/jenkins/.buildout/eggs/cp27m/zope.interface-5.2.0-py2.7-linux-x86_64.egg/zope/interface/adapter.py", line 619, in subscribers
    subscription(*objects)
  File "/home/jenkins/.buildout/eggs/cp27m/zope.component-4.6.2-py2.7.egg/zope/component/event.py", line 36, in objectEventNotify
    component_subscribers((event.object, event), None)
  File "/home/jenkins/.buildout/eggs/cp27m/zope.component-4.6.2-py2.7.egg/zope/component/_api.py", line 134, in subscribers
    return sitemanager.subscribers(objects, interface)
  File "/home/jenkins/.buildout/eggs/cp27m/zope.interface-5.2.0-py2.7-linux-x86_64.egg/zope/interface/registry.py", line 448, in subscribers
    return self.adapters.subscribers(objects, provided)
  File "/home/jenkins/.buildout/eggs/cp27m/zope.interface-5.2.0-py2.7-linux-x86_64.egg/zope/interface/adapter.py", line 619, in subscribers
    subscription(*objects)
  File "/home/jenkins/workspace/plone-5.2-python-2.7/src/plone.app.contenttypes/plone/app/contenttypes/subscribers.py", line 14, in set_title_description
    datafield = obj.image
  File "/home/jenkins/workspace/plone-5.2-python-2.7/src/plone.dexterity/plone/dexterity/content.py", line 411, in __getattr__
    raise AttributeError(name)


FAILED:  plone.api.tests.test_content.TestPloneApiContent.test_rename_constraints

Error Message:
image

Stack Trace:
image

  File "/srv/python2.7/lib/python2.7/unittest/case.py", line 320, in run
    self.setUp()
  File "/home/jenkins/workspace/plone-5.2-python-2.7/src/plone.api/src/plone/api/tests/test_content.py", line 113, in setUp
    id='image',
  File "<decorator-gen-9>", line 2, in create
  File "/home/jenkins/workspace/plone-5.2-python-2.7/src/plone.api/src/plone/api/validation.py", line 81, in wrapped
    return function(*args, **kwargs)
  File "<decorator-gen-8>", line 2, in create
  File "/home/jenkins/workspace/plone-5.2-python-2.7/src/plone.api/src/plone/api/validation.py", line 153, in wrapped
    return function(*args, **kwargs)
  File "/home/jenkins/workspace/plone-5.2-python-2.7/src/plone.api/src/plone/api/content.py", line 88, in create
    container.invokeFactory(type, content_id, **kwargs)
  File "/home/jenkins/.buildout/eggs/cp27m/Products.CMFCore-2.5.1-py2.7.egg/Products/CMFCore/PortalFolder.py", line 300, in invokeFactory
    *args, **kw)
  File "/home/jenkins/.buildout/eggs/cp27m/Products.CMFCore-2.5.1-py2.7.egg/Products/CMFCore/TypesTool.py", line 809, in constructContent
    ob = info.constructInstance(container, id, *args, **kw)
  File "/home/jenkins/.buildout/eggs/cp27m/Products.CMFCore-2.5.1-py2.7.egg/Products/CMFCore/TypesTool.py", line 308, in constructInstance
    return self._constructInstance(container, id, *args, **kw)
  File "/home/jenkins/.buildout/eggs/cp27m/Products.CMFCore-2.5.1-py2.7.egg/Products/CMFCore/TypesTool.py", line 569, in _constructInstance
    notify(ObjectCreatedEvent(obj))
  File "/home/jenkins/.buildout/eggs/cp27m/zope.event-4.5.0-py2.7.egg/zope/event/__init__.py", line 32, in notify
    subscriber(event)
  File "/home/jenkins/.buildout/eggs/cp27m/zope.component-4.6.2-py2.7.egg/zope/component/event.py", line 27, in dispatch
    component_subscribers(event, None)
  File "/home/jenkins/.buildout/eggs/cp27m/zope.component-4.6.2-py2.7.egg/zope/component/_api.py", line 134, in subscribers
    return sitemanager.subscribers(objects, interface)
  File "/home/jenkins/.buildout/eggs/cp27m/zope.interface-5.2.0-py2.7-linux-x86_64.egg/zope/interface/registry.py", line 448, in subscribers
    return self.adapters.subscribers(objects, provided)
  File "/home/jenkins/.buildout/eggs/cp27m/zope.interface-5.2.0-py2.7-linux-x86_64.egg/zope/interface/adapter.py", line 619, in subscribers
    subscription(*objects)
  File "/home/jenkins/.buildout/eggs/cp27m/zope.component-4.6.2-py2.7.egg/zope/component/event.py", line 36, in objectEventNotify
    component_subscribers((event.object, event), None)
  File "/home/jenkins/.buildout/eggs/cp27m/zope.component-4.6.2-py2.7.egg/zope/component/_api.py", line 134, in subscribers
    return sitemanager.subscribers(objects, interface)
  File "/home/jenkins/.buildout/eggs/cp27m/zope.interface-5.2.0-py2.7-linux-x86_64.egg/zope/interface/registry.py", line 448, in subscribers
    return self.adapters.subscribers(objects, provided)
  File "/home/jenkins/.buildout/eggs/cp27m/zope.interface-5.2.0-py2.7-linux-x86_64.egg/zope/interface/adapter.py", line 619, in subscribers
    subscription(*objects)
  File "/home/jenkins/workspace/plone-5.2-python-2.7/src/plone.app.contenttypes/plone/app/contenttypes/subscribers.py", line 14, in set_title_description
    datafield = obj.image
  File "/home/jenkins/workspace/plone-5.2-python-2.7/src/plone.dexterity/plone/dexterity/content.py", line 411, in __getattr__
    raise AttributeError(name)


FAILED:  plone.api.tests.test_content.TestPloneApiContent.test_rename_same_folder

Error Message:
image

Stack Trace:
image

  File "/srv/python2.7/lib/python2.7/unittest/case.py", line 320, in run
    self.setUp()
  File "/home/jenkins/workspace/plone-5.2-python-2.7/src/plone.api/src/plone/api/tests/test_content.py", line 113, in setUp
    id='image',
  File "<decorator-gen-9>", line 2, in create
  File "/home/jenkins/workspace/plone-5.2-python-2.7/src/plone.api/src/plone/api/validation.py", line 81, in wrapped
    return function(*args, **kwargs)
  File "<decorator-gen-8>", line 2, in create
  File "/home/jenkins/workspace/plone-5.2-python-2.7/src/plone.api/src/plone/api/validation.py", line 153, in wrapped
    return function(*args, **kwargs)
  File "/home/jenkins/workspace/plone-5.2-python-2.7/src/plone.api/src/plone/api/content.py", line 88, in create
    container.invokeFactory(type, content_id, **kwargs)
  File "/home/jenkins/.buildout/eggs/cp27m/Products.CMFCore-2.5.1-py2.7.egg/Products/CMFCore/PortalFolder.py", line 300, in invokeFactory
    *args, **kw)
  File "/home/jenkins/.buildout/eggs/cp27m/Products.CMFCore-2.5.1-py2.7.egg/Products/CMFCore/TypesTool.py", line 809, in constructContent
    ob = info.constructInstance(container, id, *args, **kw)
  File "/home/jenkins/.buildout/eggs/cp27m/Products.CMFCore-2.5.1-py2.7.egg/Products/CMFCore/TypesTool.py", line 308, in constructInstance
    return self._constructInstance(container, id, *args, **kw)
  File "/home/jenkins/.buildout/eggs/cp27m/Products.CMFCore-2.5.1-py2.7.egg/Products/CMFCore/TypesTool.py", line 569, in _constructInstance
    notify(ObjectCreatedEvent(obj))
  File "/home/jenkins/.buildout/eggs/cp27m/zope.event-4.5.0-py2.7.egg/zope/event/__init__.py", line 32, in notify
    subscriber(event)
  File "/home/jenkins/.buildout/eggs/cp27m/zope.component-4.6.2-py2.7.egg/zope/component/event.py", line 27, in dispatch
    component_subscribers(event, None)
  File "/home/jenkins/.buildout/eggs/cp27m/zope.component-4.6.2-py2.7.egg/zope/component/_api.py", line 134, in subscribers
    return sitemanager.subscribers(objects, interface)
  File "/home/jenkins/.buildout/eggs/cp27m/zope.interface-5.2.0-py2.7-linux-x86_64.egg/zope/interface/registry.py", line 448, in subscribers
    return self.adapters.subscribers(objects, provided)
  File "/home/jenkins/.buildout/eggs/cp27m/zope.interface-5.2.0-py2.7-linux-x86_64.egg/zope/interface/adapter.py", line 619, in subscribers
    subscription(*objects)
  File "/home/jenkins/.buildout/eggs/cp27m/zope.component-4.6.2-py2.7.egg/zope/component/event.py", line 36, in objectEventNotify
    component_subscribers((event.object, event), None)
  File "/home/jenkins/.buildout/eggs/cp27m/zope.component-4.6.2-py2.7.egg/zope/component/_api.py", line 134, in subscribers
    return sitemanager.subscribers(objects, interface)
  File "/home/jenkins/.buildout/eggs/cp27m/zope.interface-5.2.0-py2.7-linux-x86_64.egg/zope/interface/registry.py", line 448, in subscribers
    return self.adapters.subscribers(objects, provided)
  File "/home/jenkins/.buildout/eggs/cp27m/zope.interface-5.2.0-py2.7-linux-x86_64.egg/zope/interface/adapter.py", line 619, in subscribers
    subscription(*objects)
  File "/home/jenkins/workspace/plone-5.2-python-2.7/src/plone.app.contenttypes/plone/app/contenttypes/subscribers.py", line 14, in set_title_description
    datafield = obj.image
  File "/home/jenkins/workspace/plone-5.2-python-2.7/src/plone.dexterity/plone/dexterity/content.py", line 411, in __getattr__
    raise AttributeError(name)


FAILED:  plone.api.tests.test_content.TestPloneApiContent.test_rename_same_id

Error Message:
image

Stack Trace:
image

  File "/srv/python2.7/lib/python2.7/unittest/case.py", line 320, in run
    self.setUp()
  File "/home/jenkins/workspace/plone-5.2-python-2.7/src/plone.api/src/plone/api/tests/test_content.py", line 113, in setUp
    id='image',
  File "<decorator-gen-9>", line 2, in create
  File "/home/jenkins/workspace/plone-5.2-python-2.7/src/plone.api/src/plone/api/validation.py", line 81, in wrapped
    return function(*args, **kwargs)
  File "<decorator-gen-8>", line 2, in create
  File "/home/jenkins/workspace/plone-5.2-python-2.7/src/plone.api/src/plone/api/validation.py", line 153, in wrapped
    return function(*args, **kwargs)
  File "/home/jenkins/workspace/plone-5.2-python-2.7/src/plone.api/src/plone/api/content.py", line 88, in create
    container.invokeFactory(type, content_id, **kwargs)
  File "/home/jenkins/.buildout/eggs/cp27m/Products.CMFCore-2.5.1-py2.7.egg/Products/CMFCore/PortalFolder.py", line 300, in invokeFactory
    *args, **kw)
  File "/home/jenkins/.buildout/eggs/cp27m/Products.CMFCore-2.5.1-py2.7.egg/Products/CMFCore/TypesTool.py", line 809, in constructContent
    ob = info.constructInstance(container, id, *args, **kw)
  File "/home/jenkins/.buildout/eggs/cp27m/Products.CMFCore-2.5.1-py2.7.egg/Products/CMFCore/TypesTool.py", line 308, in constructInstance
    return self._constructInstance(container, id, *args, **kw)
  File "/home/jenkins/.buildout/eggs/cp27m/Products.CMFCore-2.5.1-py2.7.egg/Products/CMFCore/TypesTool.py", line 569, in _constructInstance
    notify(ObjectCreatedEvent(obj))
  File "/home/jenkins/.buildout/eggs/cp27m/zope.event-4.5.0-py2.7.egg/zope/event/__init__.py", line 32, in notify
    subscriber(event)
  File "/home/jenkins/.buildout/eggs/cp27m/zope.component-4.6.2-py2.7.egg/zope/component/event.py", line 27, in dispatch
    component_subscribers(event, None)
  File "/home/jenkins/.buildout/eggs/cp27m/zope.component-4.6.2-py2.7.egg/zope/component/_api.py", line 134, in subscribers
    return sitemanager.subscribers(objects, interface)
  File "/home/jenkins/.buildout/eggs/cp27m/zope.interface-5.2.0-py2.7-linux-x86_64.egg/zope/interface/registry.py", line 448, in subscribers
    return self.adapters.subscribers(objects, provided)
  File "/home/jenkins/.buildout/eggs/cp27m/zope.interface-5.2.0-py2.7-linux-x86_64.egg/zope/interface/adapter.py", line 619, in subscribers
    subscription(*objects)
  File "/home/jenkins/.buildout/eggs/cp27m/zope.component-4.6.2-py2.7.egg/zope/component/event.py", line 36, in objectEventNotify
    component_subscribers((event.object, event), None)
  File "/home/jenkins/.buildout/eggs/cp27m/zope.component-4.6.2-py2.7.egg/zope/component/_api.py", line 134, in subscribers
    return sitemanager.subscribers(objects, interface)
  File "/home/jenkins/.buildout/eggs/cp27m/zope.interface-5.2.0-py2.7-linux-x86_64.egg/zope/interface/registry.py", line 448, in subscribers
    return self.adapters.subscribers(objects, provided)
  File "/home/jenkins/.buildout/eggs/cp27m/zope.interface-5.2.0-py2.7-linux-x86_64.egg/zope/interface/adapter.py", line 619, in subscribers
    subscription(*objects)
  File "/home/jenkins/workspace/plone-5.2-python-2.7/src/plone.app.contenttypes/plone/app/contenttypes/subscribers.py", line 14, in set_title_description
    datafield = obj.image
  File "/home/jenkins/workspace/plone-5.2-python-2.7/src/plone.dexterity/plone/dexterity/content.py", line 411, in __getattr__
    raise AttributeError(name)


FAILED:  plone.api.tests.test_content.TestPloneApiContent.test_transition

Error Message:
image

Stack Trace:
image

  File "/srv/python2.7/lib/python2.7/unittest/case.py", line 320, in run
    self.setUp()
  File "/home/jenkins/workspace/plone-5.2-python-2.7/src/plone.api/src/plone/api/tests/test_content.py", line 113, in setUp
    id='image',
  File "<decorator-gen-9>", line 2, in create
  File "/home/jenkins/workspace/plone-5.2-python-2.7/src/plone.api/src/plone/api/validation.py", line 81, in wrapped
    return function(*args, **kwargs)
  File "<decorator-gen-8>", line 2, in create
  File "/home/jenkins/workspace/plone-5.2-python-2.7/src/plone.api/src/plone/api/validation.py", line 153, in wrapped
    return function(*args, **kwargs)
  File "/home/jenkins/workspace/plone-5.2-python-2.7/src/plone.api/src/plone/api/content.py", line 88, in create
    container.invokeFactory(type, content_id, **kwargs)
  File "/home/jenkins/.buildout/eggs/cp27m/Products.CMFCore-2.5.1-py2.7.egg/Products/CMFCore/PortalFolder.py", line 300, in invokeFactory
    *args, **kw)
  File "/home/jenkins/.buildout/eggs/cp27m/Products.CMFCore-2.5.1-py2.7.egg/Products/CMFCore/TypesTool.py", line 809, in constructContent
    ob = info.constructInstance(container, id, *args, **kw)
  File "/home/jenkins/.buildout/eggs/cp27m/Products.CMFCore-2.5.1-py2.7.egg/Products/CMFCore/TypesTool.py", line 308, in constructInstance
    return self._constructInstance(container, id, *args, **kw)
  File "/home/jenkins/.buildout/eggs/cp27m/Products.CMFCore-2.5.1-py2.7.egg/Products/CMFCore/TypesTool.py", line 569, in _constructInstance
    notify(ObjectCreatedEvent(obj))
  File "/home/jenkins/.buildout/eggs/cp27m/zope.event-4.5.0-py2.7.egg/zope/event/__init__.py", line 32, in notify
    subscriber(event)
  File "/home/jenkins/.buildout/eggs/cp27m/zope.component-4.6.2-py2.7.egg/zope/component/event.py", line 27, in dispatch
    component_subscribers(event, None)
  File "/home/jenkins/.buildout/eggs/cp27m/zope.component-4.6.2-py2.7.egg/zope/component/_api.py", line 134, in subscribers
    return sitemanager.subscribers(objects, interface)
  File "/home/jenkins/.buildout/eggs/cp27m/zope.interface-5.2.0-py2.7-linux-x86_64.egg/zope/interface/registry.py", line 448, in subscribers
    return self.adapters.subscribers(objects, provided)
  File "/home/jenkins/.buildout/eggs/cp27m/zope.interface-5.2.0-py2.7-linux-x86_64.egg/zope/interface/adapter.py", line 619, in subscribers
    subscription(*objects)
  File "/home/jenkins/.buildout/eggs/cp27m/zope.component-4.6.2-py2.7.egg/zope/component/event.py", line 36, in objectEventNotify
    component_subscribers((event.object, event), None)
  File "/home/jenkins/.buildout/eggs/cp27m/zope.component-4.6.2-py2.7.egg/zope/component/_api.py", line 134, in subscribers
    return sitemanager.subscribers(objects, interface)
  File "/home/jenkins/.buildout/eggs/cp27m/zope.interface-5.2.0-py2.7-linux-x86_64.egg/zope/interface/registry.py", line 448, in subscribers
    return self.adapters.subscribers(objects, provided)
  File "/home/jenkins/.buildout/eggs/cp27m/zope.interface-5.2.0-py2.7-linux-x86_64.egg/zope/interface/adapter.py", line 619, in subscribers
    subscription(*objects)
  File "/home/jenkins/workspace/plone-5.2-python-2.7/src/plone.app.contenttypes/plone/app/contenttypes/subscribers.py", line 14, in set_title_description
    datafield = obj.image
  File "/home/jenkins/workspace/plone-5.2-python-2.7/src/plone.dexterity/plone/dexterity/content.py", line 411, in __getattr__
    raise AttributeError(name)


More information about the Testbot mailing list