[Testbot] Plone 5.2 - Python 2.7 - Build # 1213 - Still Failing!

jenkins at plone.org jenkins at plone.org
Sat Jan 9 13:42:07 UTC 2021


Plone 5.2 - Python 2.7 - Build # 1213 - Still Failing:

Check console output at https://jenkins.plone.org/job/plone-5.2-python-2.7/1213/ to view the results.


Plone 5.2 - Python 2.7 - Build # 1213 - Still Failing:

Check console output at https://jenkins.plone.org/job/plone-5.2-python-2.7/1213/ to view the results.

Test Results:

35 tests failed.
FAILED:  Products.CMFPlone.tests.testBrowserDefault.TestPloneToolBrowserDefault.testBrowserDefaultMixinFileDumpsContent

Error Message:
file

Stack Trace:
file

  File "/srv/python2.7/lib/python2.7/unittest/case.py", line 320, in run
    self.setUp()
  File "/home/jenkins/workspace/plone-5.2-python-2.7/src/Products.CMFPlone/Products/CMFPlone/tests/testBrowserDefault.py", line 49, in setUp
    _createObjectByType('File', self.portal, 'file')
  File "/home/jenkins/workspace/plone-5.2-python-2.7/src/Products.CMFPlone/Products/CMFPlone/utils.py", line 357, in _createObjectByType
    return fti._constructInstance(container, id, *args, **kw)
  File "/home/jenkins/.buildout/eggs/cp27m/Products.CMFCore-2.4.8-py2.7.egg/Products/CMFCore/TypesTool.py", line 569, in _constructInstance
    notify(ObjectCreatedEvent(obj))
  File "/home/jenkins/.buildout/eggs/cp27m/zope.event-4.5.0-py2.7.egg/zope/event/__init__.py", line 32, in notify
    subscriber(event)
  File "/home/jenkins/.buildout/eggs/cp27m/zope.component-4.6.2-py2.7.egg/zope/component/event.py", line 27, in dispatch
    component_subscribers(event, None)
  File "/home/jenkins/.buildout/eggs/cp27m/zope.component-4.6.2-py2.7.egg/zope/component/_api.py", line 134, in subscribers
    return sitemanager.subscribers(objects, interface)
  File "/home/jenkins/.buildout/eggs/cp27m/zope.interface-5.2.0-py2.7-linux-x86_64.egg/zope/interface/registry.py", line 448, in subscribers
    return self.adapters.subscribers(objects, provided)
  File "/home/jenkins/.buildout/eggs/cp27m/zope.interface-5.2.0-py2.7-linux-x86_64.egg/zope/interface/adapter.py", line 619, in subscribers
    subscription(*objects)
  File "/home/jenkins/.buildout/eggs/cp27m/zope.component-4.6.2-py2.7.egg/zope/component/event.py", line 36, in objectEventNotify
    component_subscribers((event.object, event), None)
  File "/home/jenkins/.buildout/eggs/cp27m/zope.component-4.6.2-py2.7.egg/zope/component/_api.py", line 134, in subscribers
    return sitemanager.subscribers(objects, interface)
  File "/home/jenkins/.buildout/eggs/cp27m/zope.interface-5.2.0-py2.7-linux-x86_64.egg/zope/interface/registry.py", line 448, in subscribers
    return self.adapters.subscribers(objects, provided)
  File "/home/jenkins/.buildout/eggs/cp27m/zope.interface-5.2.0-py2.7-linux-x86_64.egg/zope/interface/adapter.py", line 619, in subscribers
    subscription(*objects)
  File "/home/jenkins/.buildout/eggs/cp27m/plone.app.contenttypes-2.2.1-py2.7.egg/plone/app/contenttypes/subscribers.py", line 16, in set_title_description
    datafield = obj.file
  File "/home/jenkins/.buildout/eggs/cp27m/plone.dexterity-2.10.0-py2.7.egg/plone/dexterity/content.py", line 411, in __getattr__
    raise AttributeError(name)


FAILED:  Products.CMFPlone.tests.testBrowserDefault.TestPloneToolBrowserDefault.testBrowserDefaultMixinFileViewMethodGetsTemplate

Error Message:
file

Stack Trace:
file

  File "/srv/python2.7/lib/python2.7/unittest/case.py", line 320, in run
    self.setUp()
  File "/home/jenkins/workspace/plone-5.2-python-2.7/src/Products.CMFPlone/Products/CMFPlone/tests/testBrowserDefault.py", line 49, in setUp
    _createObjectByType('File', self.portal, 'file')
  File "/home/jenkins/workspace/plone-5.2-python-2.7/src/Products.CMFPlone/Products/CMFPlone/utils.py", line 357, in _createObjectByType
    return fti._constructInstance(container, id, *args, **kw)
  File "/home/jenkins/.buildout/eggs/cp27m/Products.CMFCore-2.4.8-py2.7.egg/Products/CMFCore/TypesTool.py", line 569, in _constructInstance
    notify(ObjectCreatedEvent(obj))
  File "/home/jenkins/.buildout/eggs/cp27m/zope.event-4.5.0-py2.7.egg/zope/event/__init__.py", line 32, in notify
    subscriber(event)
  File "/home/jenkins/.buildout/eggs/cp27m/zope.component-4.6.2-py2.7.egg/zope/component/event.py", line 27, in dispatch
    component_subscribers(event, None)
  File "/home/jenkins/.buildout/eggs/cp27m/zope.component-4.6.2-py2.7.egg/zope/component/_api.py", line 134, in subscribers
    return sitemanager.subscribers(objects, interface)
  File "/home/jenkins/.buildout/eggs/cp27m/zope.interface-5.2.0-py2.7-linux-x86_64.egg/zope/interface/registry.py", line 448, in subscribers
    return self.adapters.subscribers(objects, provided)
  File "/home/jenkins/.buildout/eggs/cp27m/zope.interface-5.2.0-py2.7-linux-x86_64.egg/zope/interface/adapter.py", line 619, in subscribers
    subscription(*objects)
  File "/home/jenkins/.buildout/eggs/cp27m/zope.component-4.6.2-py2.7.egg/zope/component/event.py", line 36, in objectEventNotify
    component_subscribers((event.object, event), None)
  File "/home/jenkins/.buildout/eggs/cp27m/zope.component-4.6.2-py2.7.egg/zope/component/_api.py", line 134, in subscribers
    return sitemanager.subscribers(objects, interface)
  File "/home/jenkins/.buildout/eggs/cp27m/zope.interface-5.2.0-py2.7-linux-x86_64.egg/zope/interface/registry.py", line 448, in subscribers
    return self.adapters.subscribers(objects, provided)
  File "/home/jenkins/.buildout/eggs/cp27m/zope.interface-5.2.0-py2.7-linux-x86_64.egg/zope/interface/adapter.py", line 619, in subscribers
    subscription(*objects)
  File "/home/jenkins/.buildout/eggs/cp27m/plone.app.contenttypes-2.2.1-py2.7.egg/plone/app/contenttypes/subscribers.py", line 16, in set_title_description
    datafield = obj.file
  File "/home/jenkins/.buildout/eggs/cp27m/plone.dexterity-2.10.0-py2.7.egg/plone/dexterity/content.py", line 411, in __getattr__
    raise AttributeError(name)


FAILED:  Products.CMFPlone.tests.testBrowserDefault.TestPloneToolBrowserDefault.testBrowserDefaultMixinFolderDefaultPage

Error Message:
file

Stack Trace:
file

  File "/srv/python2.7/lib/python2.7/unittest/case.py", line 320, in run
    self.setUp()
  File "/home/jenkins/workspace/plone-5.2-python-2.7/src/Products.CMFPlone/Products/CMFPlone/tests/testBrowserDefault.py", line 49, in setUp
    _createObjectByType('File', self.portal, 'file')
  File "/home/jenkins/workspace/plone-5.2-python-2.7/src/Products.CMFPlone/Products/CMFPlone/utils.py", line 357, in _createObjectByType
    return fti._constructInstance(container, id, *args, **kw)
  File "/home/jenkins/.buildout/eggs/cp27m/Products.CMFCore-2.4.8-py2.7.egg/Products/CMFCore/TypesTool.py", line 569, in _constructInstance
    notify(ObjectCreatedEvent(obj))
  File "/home/jenkins/.buildout/eggs/cp27m/zope.event-4.5.0-py2.7.egg/zope/event/__init__.py", line 32, in notify
    subscriber(event)
  File "/home/jenkins/.buildout/eggs/cp27m/zope.component-4.6.2-py2.7.egg/zope/component/event.py", line 27, in dispatch
    component_subscribers(event, None)
  File "/home/jenkins/.buildout/eggs/cp27m/zope.component-4.6.2-py2.7.egg/zope/component/_api.py", line 134, in subscribers
    return sitemanager.subscribers(objects, interface)
  File "/home/jenkins/.buildout/eggs/cp27m/zope.interface-5.2.0-py2.7-linux-x86_64.egg/zope/interface/registry.py", line 448, in subscribers
    return self.adapters.subscribers(objects, provided)
  File "/home/jenkins/.buildout/eggs/cp27m/zope.interface-5.2.0-py2.7-linux-x86_64.egg/zope/interface/adapter.py", line 619, in subscribers
    subscription(*objects)
  File "/home/jenkins/.buildout/eggs/cp27m/zope.component-4.6.2-py2.7.egg/zope/component/event.py", line 36, in objectEventNotify
    component_subscribers((event.object, event), None)
  File "/home/jenkins/.buildout/eggs/cp27m/zope.component-4.6.2-py2.7.egg/zope/component/_api.py", line 134, in subscribers
    return sitemanager.subscribers(objects, interface)
  File "/home/jenkins/.buildout/eggs/cp27m/zope.interface-5.2.0-py2.7-linux-x86_64.egg/zope/interface/registry.py", line 448, in subscribers
    return self.adapters.subscribers(objects, provided)
  File "/home/jenkins/.buildout/eggs/cp27m/zope.interface-5.2.0-py2.7-linux-x86_64.egg/zope/interface/adapter.py", line 619, in subscribers
    subscription(*objects)
  File "/home/jenkins/.buildout/eggs/cp27m/plone.app.contenttypes-2.2.1-py2.7.egg/plone/app/contenttypes/subscribers.py", line 16, in set_title_description
    datafield = obj.file
  File "/home/jenkins/.buildout/eggs/cp27m/plone.dexterity-2.10.0-py2.7.egg/plone/dexterity/content.py", line 411, in __getattr__
    raise AttributeError(name)


FAILED:  Products.CMFPlone.tests.testBrowserDefault.TestPloneToolBrowserDefault.testBrowserDefaultMixinFolderGlobalDefaultPage

Error Message:
file

Stack Trace:
file

  File "/srv/python2.7/lib/python2.7/unittest/case.py", line 320, in run
    self.setUp()
  File "/home/jenkins/workspace/plone-5.2-python-2.7/src/Products.CMFPlone/Products/CMFPlone/tests/testBrowserDefault.py", line 49, in setUp
    _createObjectByType('File', self.portal, 'file')
  File "/home/jenkins/workspace/plone-5.2-python-2.7/src/Products.CMFPlone/Products/CMFPlone/utils.py", line 357, in _createObjectByType
    return fti._constructInstance(container, id, *args, **kw)
  File "/home/jenkins/.buildout/eggs/cp27m/Products.CMFCore-2.4.8-py2.7.egg/Products/CMFCore/TypesTool.py", line 569, in _constructInstance
    notify(ObjectCreatedEvent(obj))
  File "/home/jenkins/.buildout/eggs/cp27m/zope.event-4.5.0-py2.7.egg/zope/event/__init__.py", line 32, in notify
    subscriber(event)
  File "/home/jenkins/.buildout/eggs/cp27m/zope.component-4.6.2-py2.7.egg/zope/component/event.py", line 27, in dispatch
    component_subscribers(event, None)
  File "/home/jenkins/.buildout/eggs/cp27m/zope.component-4.6.2-py2.7.egg/zope/component/_api.py", line 134, in subscribers
    return sitemanager.subscribers(objects, interface)
  File "/home/jenkins/.buildout/eggs/cp27m/zope.interface-5.2.0-py2.7-linux-x86_64.egg/zope/interface/registry.py", line 448, in subscribers
    return self.adapters.subscribers(objects, provided)
  File "/home/jenkins/.buildout/eggs/cp27m/zope.interface-5.2.0-py2.7-linux-x86_64.egg/zope/interface/adapter.py", line 619, in subscribers
    subscription(*objects)
  File "/home/jenkins/.buildout/eggs/cp27m/zope.component-4.6.2-py2.7.egg/zope/component/event.py", line 36, in objectEventNotify
    component_subscribers((event.object, event), None)
  File "/home/jenkins/.buildout/eggs/cp27m/zope.component-4.6.2-py2.7.egg/zope/component/_api.py", line 134, in subscribers
    return sitemanager.subscribers(objects, interface)
  File "/home/jenkins/.buildout/eggs/cp27m/zope.interface-5.2.0-py2.7-linux-x86_64.egg/zope/interface/registry.py", line 448, in subscribers
    return self.adapters.subscribers(objects, provided)
  File "/home/jenkins/.buildout/eggs/cp27m/zope.interface-5.2.0-py2.7-linux-x86_64.egg/zope/interface/adapter.py", line 619, in subscribers
    subscription(*objects)
  File "/home/jenkins/.buildout/eggs/cp27m/plone.app.contenttypes-2.2.1-py2.7.egg/plone/app/contenttypes/subscribers.py", line 16, in set_title_description
    datafield = obj.file
  File "/home/jenkins/.buildout/eggs/cp27m/plone.dexterity-2.10.0-py2.7.egg/plone/dexterity/content.py", line 411, in __getattr__
    raise AttributeError(name)


FAILED:  Products.CMFPlone.tests.testBrowserDefault.TestPloneToolBrowserDefault.testBrowserDefaultMixinFolderIndexHtml

Error Message:
file

Stack Trace:
file

  File "/srv/python2.7/lib/python2.7/unittest/case.py", line 320, in run
    self.setUp()
  File "/home/jenkins/workspace/plone-5.2-python-2.7/src/Products.CMFPlone/Products/CMFPlone/tests/testBrowserDefault.py", line 49, in setUp
    _createObjectByType('File', self.portal, 'file')
  File "/home/jenkins/workspace/plone-5.2-python-2.7/src/Products.CMFPlone/Products/CMFPlone/utils.py", line 357, in _createObjectByType
    return fti._constructInstance(container, id, *args, **kw)
  File "/home/jenkins/.buildout/eggs/cp27m/Products.CMFCore-2.4.8-py2.7.egg/Products/CMFCore/TypesTool.py", line 569, in _constructInstance
    notify(ObjectCreatedEvent(obj))
  File "/home/jenkins/.buildout/eggs/cp27m/zope.event-4.5.0-py2.7.egg/zope/event/__init__.py", line 32, in notify
    subscriber(event)
  File "/home/jenkins/.buildout/eggs/cp27m/zope.component-4.6.2-py2.7.egg/zope/component/event.py", line 27, in dispatch
    component_subscribers(event, None)
  File "/home/jenkins/.buildout/eggs/cp27m/zope.component-4.6.2-py2.7.egg/zope/component/_api.py", line 134, in subscribers
    return sitemanager.subscribers(objects, interface)
  File "/home/jenkins/.buildout/eggs/cp27m/zope.interface-5.2.0-py2.7-linux-x86_64.egg/zope/interface/registry.py", line 448, in subscribers
    return self.adapters.subscribers(objects, provided)
  File "/home/jenkins/.buildout/eggs/cp27m/zope.interface-5.2.0-py2.7-linux-x86_64.egg/zope/interface/adapter.py", line 619, in subscribers
    subscription(*objects)
  File "/home/jenkins/.buildout/eggs/cp27m/zope.component-4.6.2-py2.7.egg/zope/component/event.py", line 36, in objectEventNotify
    component_subscribers((event.object, event), None)
  File "/home/jenkins/.buildout/eggs/cp27m/zope.component-4.6.2-py2.7.egg/zope/component/_api.py", line 134, in subscribers
    return sitemanager.subscribers(objects, interface)
  File "/home/jenkins/.buildout/eggs/cp27m/zope.interface-5.2.0-py2.7-linux-x86_64.egg/zope/interface/registry.py", line 448, in subscribers
    return self.adapters.subscribers(objects, provided)
  File "/home/jenkins/.buildout/eggs/cp27m/zope.interface-5.2.0-py2.7-linux-x86_64.egg/zope/interface/adapter.py", line 619, in subscribers
    subscription(*objects)
  File "/home/jenkins/.buildout/eggs/cp27m/plone.app.contenttypes-2.2.1-py2.7.egg/plone/app/contenttypes/subscribers.py", line 16, in set_title_description
    datafield = obj.file
  File "/home/jenkins/.buildout/eggs/cp27m/plone.dexterity-2.10.0-py2.7.egg/plone/dexterity/content.py", line 411, in __getattr__
    raise AttributeError(name)


FAILED:  Products.CMFPlone.tests.testBrowserDefault.TestPloneToolBrowserDefault.testBrowserDefaultMixinWithoutFtiGivesSensibleError

Error Message:
file

Stack Trace:
file

  File "/srv/python2.7/lib/python2.7/unittest/case.py", line 320, in run
    self.setUp()
  File "/home/jenkins/workspace/plone-5.2-python-2.7/src/Products.CMFPlone/Products/CMFPlone/tests/testBrowserDefault.py", line 49, in setUp
    _createObjectByType('File', self.portal, 'file')
  File "/home/jenkins/workspace/plone-5.2-python-2.7/src/Products.CMFPlone/Products/CMFPlone/utils.py", line 357, in _createObjectByType
    return fti._constructInstance(container, id, *args, **kw)
  File "/home/jenkins/.buildout/eggs/cp27m/Products.CMFCore-2.4.8-py2.7.egg/Products/CMFCore/TypesTool.py", line 569, in _constructInstance
    notify(ObjectCreatedEvent(obj))
  File "/home/jenkins/.buildout/eggs/cp27m/zope.event-4.5.0-py2.7.egg/zope/event/__init__.py", line 32, in notify
    subscriber(event)
  File "/home/jenkins/.buildout/eggs/cp27m/zope.component-4.6.2-py2.7.egg/zope/component/event.py", line 27, in dispatch
    component_subscribers(event, None)
  File "/home/jenkins/.buildout/eggs/cp27m/zope.component-4.6.2-py2.7.egg/zope/component/_api.py", line 134, in subscribers
    return sitemanager.subscribers(objects, interface)
  File "/home/jenkins/.buildout/eggs/cp27m/zope.interface-5.2.0-py2.7-linux-x86_64.egg/zope/interface/registry.py", line 448, in subscribers
    return self.adapters.subscribers(objects, provided)
  File "/home/jenkins/.buildout/eggs/cp27m/zope.interface-5.2.0-py2.7-linux-x86_64.egg/zope/interface/adapter.py", line 619, in subscribers
    subscription(*objects)
  File "/home/jenkins/.buildout/eggs/cp27m/zope.component-4.6.2-py2.7.egg/zope/component/event.py", line 36, in objectEventNotify
    component_subscribers((event.object, event), None)
  File "/home/jenkins/.buildout/eggs/cp27m/zope.component-4.6.2-py2.7.egg/zope/component/_api.py", line 134, in subscribers
    return sitemanager.subscribers(objects, interface)
  File "/home/jenkins/.buildout/eggs/cp27m/zope.interface-5.2.0-py2.7-linux-x86_64.egg/zope/interface/registry.py", line 448, in subscribers
    return self.adapters.subscribers(objects, provided)
  File "/home/jenkins/.buildout/eggs/cp27m/zope.interface-5.2.0-py2.7-linux-x86_64.egg/zope/interface/adapter.py", line 619, in subscribers
    subscription(*objects)
  File "/home/jenkins/.buildout/eggs/cp27m/plone.app.contenttypes-2.2.1-py2.7.egg/plone/app/contenttypes/subscribers.py", line 16, in set_title_description
    datafield = obj.file
  File "/home/jenkins/.buildout/eggs/cp27m/plone.dexterity-2.10.0-py2.7.egg/plone/dexterity/content.py", line 411, in __getattr__
    raise AttributeError(name)


FAILED:  Products.CMFPlone.tests.testBrowserDefault.TestPloneToolBrowserDefault.testCallDocumentGivesTemplate

Error Message:
file

Stack Trace:
file

  File "/srv/python2.7/lib/python2.7/unittest/case.py", line 320, in run
    self.setUp()
  File "/home/jenkins/workspace/plone-5.2-python-2.7/src/Products.CMFPlone/Products/CMFPlone/tests/testBrowserDefault.py", line 49, in setUp
    _createObjectByType('File', self.portal, 'file')
  File "/home/jenkins/workspace/plone-5.2-python-2.7/src/Products.CMFPlone/Products/CMFPlone/utils.py", line 357, in _createObjectByType
    return fti._constructInstance(container, id, *args, **kw)
  File "/home/jenkins/.buildout/eggs/cp27m/Products.CMFCore-2.4.8-py2.7.egg/Products/CMFCore/TypesTool.py", line 569, in _constructInstance
    notify(ObjectCreatedEvent(obj))
  File "/home/jenkins/.buildout/eggs/cp27m/zope.event-4.5.0-py2.7.egg/zope/event/__init__.py", line 32, in notify
    subscriber(event)
  File "/home/jenkins/.buildout/eggs/cp27m/zope.component-4.6.2-py2.7.egg/zope/component/event.py", line 27, in dispatch
    component_subscribers(event, None)
  File "/home/jenkins/.buildout/eggs/cp27m/zope.component-4.6.2-py2.7.egg/zope/component/_api.py", line 134, in subscribers
    return sitemanager.subscribers(objects, interface)
  File "/home/jenkins/.buildout/eggs/cp27m/zope.interface-5.2.0-py2.7-linux-x86_64.egg/zope/interface/registry.py", line 448, in subscribers
    return self.adapters.subscribers(objects, provided)
  File "/home/jenkins/.buildout/eggs/cp27m/zope.interface-5.2.0-py2.7-linux-x86_64.egg/zope/interface/adapter.py", line 619, in subscribers
    subscription(*objects)
  File "/home/jenkins/.buildout/eggs/cp27m/zope.component-4.6.2-py2.7.egg/zope/component/event.py", line 36, in objectEventNotify
    component_subscribers((event.object, event), None)
  File "/home/jenkins/.buildout/eggs/cp27m/zope.component-4.6.2-py2.7.egg/zope/component/_api.py", line 134, in subscribers
    return sitemanager.subscribers(objects, interface)
  File "/home/jenkins/.buildout/eggs/cp27m/zope.interface-5.2.0-py2.7-linux-x86_64.egg/zope/interface/registry.py", line 448, in subscribers
    return self.adapters.subscribers(objects, provided)
  File "/home/jenkins/.buildout/eggs/cp27m/zope.interface-5.2.0-py2.7-linux-x86_64.egg/zope/interface/adapter.py", line 619, in subscribers
    subscription(*objects)
  File "/home/jenkins/.buildout/eggs/cp27m/plone.app.contenttypes-2.2.1-py2.7.egg/plone/app/contenttypes/subscribers.py", line 16, in set_title_description
    datafield = obj.file
  File "/home/jenkins/.buildout/eggs/cp27m/plone.dexterity-2.10.0-py2.7.egg/plone/dexterity/content.py", line 411, in __getattr__
    raise AttributeError(name)


FAILED:  Products.CMFPlone.tests.testBrowserDefault.TestPloneToolBrowserDefault.testCallFileGivesTemplate

Error Message:
file

Stack Trace:
file

  File "/srv/python2.7/lib/python2.7/unittest/case.py", line 320, in run
    self.setUp()
  File "/home/jenkins/workspace/plone-5.2-python-2.7/src/Products.CMFPlone/Products/CMFPlone/tests/testBrowserDefault.py", line 49, in setUp
    _createObjectByType('File', self.portal, 'file')
  File "/home/jenkins/workspace/plone-5.2-python-2.7/src/Products.CMFPlone/Products/CMFPlone/utils.py", line 357, in _createObjectByType
    return fti._constructInstance(container, id, *args, **kw)
  File "/home/jenkins/.buildout/eggs/cp27m/Products.CMFCore-2.4.8-py2.7.egg/Products/CMFCore/TypesTool.py", line 569, in _constructInstance
    notify(ObjectCreatedEvent(obj))
  File "/home/jenkins/.buildout/eggs/cp27m/zope.event-4.5.0-py2.7.egg/zope/event/__init__.py", line 32, in notify
    subscriber(event)
  File "/home/jenkins/.buildout/eggs/cp27m/zope.component-4.6.2-py2.7.egg/zope/component/event.py", line 27, in dispatch
    component_subscribers(event, None)
  File "/home/jenkins/.buildout/eggs/cp27m/zope.component-4.6.2-py2.7.egg/zope/component/_api.py", line 134, in subscribers
    return sitemanager.subscribers(objects, interface)
  File "/home/jenkins/.buildout/eggs/cp27m/zope.interface-5.2.0-py2.7-linux-x86_64.egg/zope/interface/registry.py", line 448, in subscribers
    return self.adapters.subscribers(objects, provided)
  File "/home/jenkins/.buildout/eggs/cp27m/zope.interface-5.2.0-py2.7-linux-x86_64.egg/zope/interface/adapter.py", line 619, in subscribers
    subscription(*objects)
  File "/home/jenkins/.buildout/eggs/cp27m/zope.component-4.6.2-py2.7.egg/zope/component/event.py", line 36, in objectEventNotify
    component_subscribers((event.object, event), None)
  File "/home/jenkins/.buildout/eggs/cp27m/zope.component-4.6.2-py2.7.egg/zope/component/_api.py", line 134, in subscribers
    return sitemanager.subscribers(objects, interface)
  File "/home/jenkins/.buildout/eggs/cp27m/zope.interface-5.2.0-py2.7-linux-x86_64.egg/zope/interface/registry.py", line 448, in subscribers
    return self.adapters.subscribers(objects, provided)
  File "/home/jenkins/.buildout/eggs/cp27m/zope.interface-5.2.0-py2.7-linux-x86_64.egg/zope/interface/adapter.py", line 619, in subscribers
    subscription(*objects)
  File "/home/jenkins/.buildout/eggs/cp27m/plone.app.contenttypes-2.2.1-py2.7.egg/plone/app/contenttypes/subscribers.py", line 16, in set_title_description
    datafield = obj.file
  File "/home/jenkins/.buildout/eggs/cp27m/plone.dexterity-2.10.0-py2.7.egg/plone/dexterity/content.py", line 411, in __getattr__
    raise AttributeError(name)


FAILED:  Products.CMFPlone.tests.testBrowserDefault.TestPloneToolBrowserDefault.testCallFolderWithDefaultPageGivesTemplate

Error Message:
file

Stack Trace:
file

  File "/srv/python2.7/lib/python2.7/unittest/case.py", line 320, in run
    self.setUp()
  File "/home/jenkins/workspace/plone-5.2-python-2.7/src/Products.CMFPlone/Products/CMFPlone/tests/testBrowserDefault.py", line 49, in setUp
    _createObjectByType('File', self.portal, 'file')
  File "/home/jenkins/workspace/plone-5.2-python-2.7/src/Products.CMFPlone/Products/CMFPlone/utils.py", line 357, in _createObjectByType
    return fti._constructInstance(container, id, *args, **kw)
  File "/home/jenkins/.buildout/eggs/cp27m/Products.CMFCore-2.4.8-py2.7.egg/Products/CMFCore/TypesTool.py", line 569, in _constructInstance
    notify(ObjectCreatedEvent(obj))
  File "/home/jenkins/.buildout/eggs/cp27m/zope.event-4.5.0-py2.7.egg/zope/event/__init__.py", line 32, in notify
    subscriber(event)
  File "/home/jenkins/.buildout/eggs/cp27m/zope.component-4.6.2-py2.7.egg/zope/component/event.py", line 27, in dispatch
    component_subscribers(event, None)
  File "/home/jenkins/.buildout/eggs/cp27m/zope.component-4.6.2-py2.7.egg/zope/component/_api.py", line 134, in subscribers
    return sitemanager.subscribers(objects, interface)
  File "/home/jenkins/.buildout/eggs/cp27m/zope.interface-5.2.0-py2.7-linux-x86_64.egg/zope/interface/registry.py", line 448, in subscribers
    return self.adapters.subscribers(objects, provided)
  File "/home/jenkins/.buildout/eggs/cp27m/zope.interface-5.2.0-py2.7-linux-x86_64.egg/zope/interface/adapter.py", line 619, in subscribers
    subscription(*objects)
  File "/home/jenkins/.buildout/eggs/cp27m/zope.component-4.6.2-py2.7.egg/zope/component/event.py", line 36, in objectEventNotify
    component_subscribers((event.object, event), None)
  File "/home/jenkins/.buildout/eggs/cp27m/zope.component-4.6.2-py2.7.egg/zope/component/_api.py", line 134, in subscribers
    return sitemanager.subscribers(objects, interface)
  File "/home/jenkins/.buildout/eggs/cp27m/zope.interface-5.2.0-py2.7-linux-x86_64.egg/zope/interface/registry.py", line 448, in subscribers
    return self.adapters.subscribers(objects, provided)
  File "/home/jenkins/.buildout/eggs/cp27m/zope.interface-5.2.0-py2.7-linux-x86_64.egg/zope/interface/adapter.py", line 619, in subscribers
    subscription(*objects)
  File "/home/jenkins/.buildout/eggs/cp27m/plone.app.contenttypes-2.2.1-py2.7.egg/plone/app/contenttypes/subscribers.py", line 16, in set_title_description
    datafield = obj.file
  File "/home/jenkins/.buildout/eggs/cp27m/plone.dexterity-2.10.0-py2.7.egg/plone/dexterity/content.py", line 411, in __getattr__
    raise AttributeError(name)


FAILED:  Products.CMFPlone.tests.testBrowserDefault.TestPloneToolBrowserDefault.testCallFolderWithoutDefaultPageGivesTemplate

Error Message:
file

Stack Trace:
file

  File "/srv/python2.7/lib/python2.7/unittest/case.py", line 320, in run
    self.setUp()
  File "/home/jenkins/workspace/plone-5.2-python-2.7/src/Products.CMFPlone/Products/CMFPlone/tests/testBrowserDefault.py", line 49, in setUp
    _createObjectByType('File', self.portal, 'file')
  File "/home/jenkins/workspace/plone-5.2-python-2.7/src/Products.CMFPlone/Products/CMFPlone/utils.py", line 357, in _createObjectByType
    return fti._constructInstance(container, id, *args, **kw)
  File "/home/jenkins/.buildout/eggs/cp27m/Products.CMFCore-2.4.8-py2.7.egg/Products/CMFCore/TypesTool.py", line 569, in _constructInstance
    notify(ObjectCreatedEvent(obj))
  File "/home/jenkins/.buildout/eggs/cp27m/zope.event-4.5.0-py2.7.egg/zope/event/__init__.py", line 32, in notify
    subscriber(event)
  File "/home/jenkins/.buildout/eggs/cp27m/zope.component-4.6.2-py2.7.egg/zope/component/event.py", line 27, in dispatch
    component_subscribers(event, None)
  File "/home/jenkins/.buildout/eggs/cp27m/zope.component-4.6.2-py2.7.egg/zope/component/_api.py", line 134, in subscribers
    return sitemanager.subscribers(objects, interface)
  File "/home/jenkins/.buildout/eggs/cp27m/zope.interface-5.2.0-py2.7-linux-x86_64.egg/zope/interface/registry.py", line 448, in subscribers
    return self.adapters.subscribers(objects, provided)
  File "/home/jenkins/.buildout/eggs/cp27m/zope.interface-5.2.0-py2.7-linux-x86_64.egg/zope/interface/adapter.py", line 619, in subscribers
    subscription(*objects)
  File "/home/jenkins/.buildout/eggs/cp27m/zope.component-4.6.2-py2.7.egg/zope/component/event.py", line 36, in objectEventNotify
    component_subscribers((event.object, event), None)
  File "/home/jenkins/.buildout/eggs/cp27m/zope.component-4.6.2-py2.7.egg/zope/component/_api.py", line 134, in subscribers
    return sitemanager.subscribers(objects, interface)
  File "/home/jenkins/.buildout/eggs/cp27m/zope.interface-5.2.0-py2.7-linux-x86_64.egg/zope/interface/registry.py", line 448, in subscribers
    return self.adapters.subscribers(objects, provided)
  File "/home/jenkins/.buildout/eggs/cp27m/zope.interface-5.2.0-py2.7-linux-x86_64.egg/zope/interface/adapter.py", line 619, in subscribers
    subscription(*objects)
  File "/home/jenkins/.buildout/eggs/cp27m/plone.app.contenttypes-2.2.1-py2.7.egg/plone/app/contenttypes/subscribers.py", line 16, in set_title_description
    datafield = obj.file
  File "/home/jenkins/.buildout/eggs/cp27m/plone.dexterity-2.10.0-py2.7.egg/plone/dexterity/content.py", line 411, in __getattr__
    raise AttributeError(name)


FAILED:  Products.CMFPlone.tests.testBrowserDefault.TestPloneToolBrowserDefault.testCallWithBrowserDefaultMixinGetsSelectedLayout

Error Message:
file

Stack Trace:
file

  File "/srv/python2.7/lib/python2.7/unittest/case.py", line 320, in run
    self.setUp()
  File "/home/jenkins/workspace/plone-5.2-python-2.7/src/Products.CMFPlone/Products/CMFPlone/tests/testBrowserDefault.py", line 49, in setUp
    _createObjectByType('File', self.portal, 'file')
  File "/home/jenkins/workspace/plone-5.2-python-2.7/src/Products.CMFPlone/Products/CMFPlone/utils.py", line 357, in _createObjectByType
    return fti._constructInstance(container, id, *args, **kw)
  File "/home/jenkins/.buildout/eggs/cp27m/Products.CMFCore-2.4.8-py2.7.egg/Products/CMFCore/TypesTool.py", line 569, in _constructInstance
    notify(ObjectCreatedEvent(obj))
  File "/home/jenkins/.buildout/eggs/cp27m/zope.event-4.5.0-py2.7.egg/zope/event/__init__.py", line 32, in notify
    subscriber(event)
  File "/home/jenkins/.buildout/eggs/cp27m/zope.component-4.6.2-py2.7.egg/zope/component/event.py", line 27, in dispatch
    component_subscribers(event, None)
  File "/home/jenkins/.buildout/eggs/cp27m/zope.component-4.6.2-py2.7.egg/zope/component/_api.py", line 134, in subscribers
    return sitemanager.subscribers(objects, interface)
  File "/home/jenkins/.buildout/eggs/cp27m/zope.interface-5.2.0-py2.7-linux-x86_64.egg/zope/interface/registry.py", line 448, in subscribers
    return self.adapters.subscribers(objects, provided)
  File "/home/jenkins/.buildout/eggs/cp27m/zope.interface-5.2.0-py2.7-linux-x86_64.egg/zope/interface/adapter.py", line 619, in subscribers
    subscription(*objects)
  File "/home/jenkins/.buildout/eggs/cp27m/zope.component-4.6.2-py2.7.egg/zope/component/event.py", line 36, in objectEventNotify
    component_subscribers((event.object, event), None)
  File "/home/jenkins/.buildout/eggs/cp27m/zope.component-4.6.2-py2.7.egg/zope/component/_api.py", line 134, in subscribers
    return sitemanager.subscribers(objects, interface)
  File "/home/jenkins/.buildout/eggs/cp27m/zope.interface-5.2.0-py2.7-linux-x86_64.egg/zope/interface/registry.py", line 448, in subscribers
    return self.adapters.subscribers(objects, provided)
  File "/home/jenkins/.buildout/eggs/cp27m/zope.interface-5.2.0-py2.7-linux-x86_64.egg/zope/interface/adapter.py", line 619, in subscribers
    subscription(*objects)
  File "/home/jenkins/.buildout/eggs/cp27m/plone.app.contenttypes-2.2.1-py2.7.egg/plone/app/contenttypes/subscribers.py", line 16, in set_title_description
    datafield = obj.file
  File "/home/jenkins/.buildout/eggs/cp27m/plone.dexterity-2.10.0-py2.7.egg/plone/dexterity/content.py", line 411, in __getattr__
    raise AttributeError(name)


FAILED:  Products.CMFPlone.tests.testBrowserDefault.TestPloneToolBrowserDefault.testDefaultPageSetting

Error Message:
file

Stack Trace:
file

  File "/srv/python2.7/lib/python2.7/unittest/case.py", line 320, in run
    self.setUp()
  File "/home/jenkins/workspace/plone-5.2-python-2.7/src/Products.CMFPlone/Products/CMFPlone/tests/testBrowserDefault.py", line 49, in setUp
    _createObjectByType('File', self.portal, 'file')
  File "/home/jenkins/workspace/plone-5.2-python-2.7/src/Products.CMFPlone/Products/CMFPlone/utils.py", line 357, in _createObjectByType
    return fti._constructInstance(container, id, *args, **kw)
  File "/home/jenkins/.buildout/eggs/cp27m/Products.CMFCore-2.4.8-py2.7.egg/Products/CMFCore/TypesTool.py", line 569, in _constructInstance
    notify(ObjectCreatedEvent(obj))
  File "/home/jenkins/.buildout/eggs/cp27m/zope.event-4.5.0-py2.7.egg/zope/event/__init__.py", line 32, in notify
    subscriber(event)
  File "/home/jenkins/.buildout/eggs/cp27m/zope.component-4.6.2-py2.7.egg/zope/component/event.py", line 27, in dispatch
    component_subscribers(event, None)
  File "/home/jenkins/.buildout/eggs/cp27m/zope.component-4.6.2-py2.7.egg/zope/component/_api.py", line 134, in subscribers
    return sitemanager.subscribers(objects, interface)
  File "/home/jenkins/.buildout/eggs/cp27m/zope.interface-5.2.0-py2.7-linux-x86_64.egg/zope/interface/registry.py", line 448, in subscribers
    return self.adapters.subscribers(objects, provided)
  File "/home/jenkins/.buildout/eggs/cp27m/zope.interface-5.2.0-py2.7-linux-x86_64.egg/zope/interface/adapter.py", line 619, in subscribers
    subscription(*objects)
  File "/home/jenkins/.buildout/eggs/cp27m/zope.component-4.6.2-py2.7.egg/zope/component/event.py", line 36, in objectEventNotify
    component_subscribers((event.object, event), None)
  File "/home/jenkins/.buildout/eggs/cp27m/zope.component-4.6.2-py2.7.egg/zope/component/_api.py", line 134, in subscribers
    return sitemanager.subscribers(objects, interface)
  File "/home/jenkins/.buildout/eggs/cp27m/zope.interface-5.2.0-py2.7-linux-x86_64.egg/zope/interface/registry.py", line 448, in subscribers
    return self.adapters.subscribers(objects, provided)
  File "/home/jenkins/.buildout/eggs/cp27m/zope.interface-5.2.0-py2.7-linux-x86_64.egg/zope/interface/adapter.py", line 619, in subscribers
    subscription(*objects)
  File "/home/jenkins/.buildout/eggs/cp27m/plone.app.contenttypes-2.2.1-py2.7.egg/plone/app/contenttypes/subscribers.py", line 16, in set_title_description
    datafield = obj.file
  File "/home/jenkins/.buildout/eggs/cp27m/plone.dexterity-2.10.0-py2.7.egg/plone/dexterity/content.py", line 411, in __getattr__
    raise AttributeError(name)


FAILED:  Products.CMFPlone.tests.testBrowserDefault.TestPloneToolBrowserDefault.testFolderDefaultPageSameAsSelfWithPageMissing

Error Message:
file

Stack Trace:
file

  File "/srv/python2.7/lib/python2.7/unittest/case.py", line 320, in run
    self.setUp()
  File "/home/jenkins/workspace/plone-5.2-python-2.7/src/Products.CMFPlone/Products/CMFPlone/tests/testBrowserDefault.py", line 49, in setUp
    _createObjectByType('File', self.portal, 'file')
  File "/home/jenkins/workspace/plone-5.2-python-2.7/src/Products.CMFPlone/Products/CMFPlone/utils.py", line 357, in _createObjectByType
    return fti._constructInstance(container, id, *args, **kw)
  File "/home/jenkins/.buildout/eggs/cp27m/Products.CMFCore-2.4.8-py2.7.egg/Products/CMFCore/TypesTool.py", line 569, in _constructInstance
    notify(ObjectCreatedEvent(obj))
  File "/home/jenkins/.buildout/eggs/cp27m/zope.event-4.5.0-py2.7.egg/zope/event/__init__.py", line 32, in notify
    subscriber(event)
  File "/home/jenkins/.buildout/eggs/cp27m/zope.component-4.6.2-py2.7.egg/zope/component/event.py", line 27, in dispatch
    component_subscribers(event, None)
  File "/home/jenkins/.buildout/eggs/cp27m/zope.component-4.6.2-py2.7.egg/zope/component/_api.py", line 134, in subscribers
    return sitemanager.subscribers(objects, interface)
  File "/home/jenkins/.buildout/eggs/cp27m/zope.interface-5.2.0-py2.7-linux-x86_64.egg/zope/interface/registry.py", line 448, in subscribers
    return self.adapters.subscribers(objects, provided)
  File "/home/jenkins/.buildout/eggs/cp27m/zope.interface-5.2.0-py2.7-linux-x86_64.egg/zope/interface/adapter.py", line 619, in subscribers
    subscription(*objects)
  File "/home/jenkins/.buildout/eggs/cp27m/zope.component-4.6.2-py2.7.egg/zope/component/event.py", line 36, in objectEventNotify
    component_subscribers((event.object, event), None)
  File "/home/jenkins/.buildout/eggs/cp27m/zope.component-4.6.2-py2.7.egg/zope/component/_api.py", line 134, in subscribers
    return sitemanager.subscribers(objects, interface)
  File "/home/jenkins/.buildout/eggs/cp27m/zope.interface-5.2.0-py2.7-linux-x86_64.egg/zope/interface/registry.py", line 448, in subscribers
    return self.adapters.subscribers(objects, provided)
  File "/home/jenkins/.buildout/eggs/cp27m/zope.interface-5.2.0-py2.7-linux-x86_64.egg/zope/interface/adapter.py", line 619, in subscribers
    subscription(*objects)
  File "/home/jenkins/.buildout/eggs/cp27m/plone.app.contenttypes-2.2.1-py2.7.egg/plone/app/contenttypes/subscribers.py", line 16, in set_title_description
    datafield = obj.file
  File "/home/jenkins/.buildout/eggs/cp27m/plone.dexterity-2.10.0-py2.7.egg/plone/dexterity/content.py", line 411, in __getattr__
    raise AttributeError(name)


FAILED:  Products.CMFPlone.tests.testBrowserDefault.TestPloneToolBrowserDefault.testIndexHtmlNotAcquired

Error Message:
file

Stack Trace:
file

  File "/srv/python2.7/lib/python2.7/unittest/case.py", line 320, in run
    self.setUp()
  File "/home/jenkins/workspace/plone-5.2-python-2.7/src/Products.CMFPlone/Products/CMFPlone/tests/testBrowserDefault.py", line 49, in setUp
    _createObjectByType('File', self.portal, 'file')
  File "/home/jenkins/workspace/plone-5.2-python-2.7/src/Products.CMFPlone/Products/CMFPlone/utils.py", line 357, in _createObjectByType
    return fti._constructInstance(container, id, *args, **kw)
  File "/home/jenkins/.buildout/eggs/cp27m/Products.CMFCore-2.4.8-py2.7.egg/Products/CMFCore/TypesTool.py", line 569, in _constructInstance
    notify(ObjectCreatedEvent(obj))
  File "/home/jenkins/.buildout/eggs/cp27m/zope.event-4.5.0-py2.7.egg/zope/event/__init__.py", line 32, in notify
    subscriber(event)
  File "/home/jenkins/.buildout/eggs/cp27m/zope.component-4.6.2-py2.7.egg/zope/component/event.py", line 27, in dispatch
    component_subscribers(event, None)
  File "/home/jenkins/.buildout/eggs/cp27m/zope.component-4.6.2-py2.7.egg/zope/component/_api.py", line 134, in subscribers
    return sitemanager.subscribers(objects, interface)
  File "/home/jenkins/.buildout/eggs/cp27m/zope.interface-5.2.0-py2.7-linux-x86_64.egg/zope/interface/registry.py", line 448, in subscribers
    return self.adapters.subscribers(objects, provided)
  File "/home/jenkins/.buildout/eggs/cp27m/zope.interface-5.2.0-py2.7-linux-x86_64.egg/zope/interface/adapter.py", line 619, in subscribers
    subscription(*objects)
  File "/home/jenkins/.buildout/eggs/cp27m/zope.component-4.6.2-py2.7.egg/zope/component/event.py", line 36, in objectEventNotify
    component_subscribers((event.object, event), None)
  File "/home/jenkins/.buildout/eggs/cp27m/zope.component-4.6.2-py2.7.egg/zope/component/_api.py", line 134, in subscribers
    return sitemanager.subscribers(objects, interface)
  File "/home/jenkins/.buildout/eggs/cp27m/zope.interface-5.2.0-py2.7-linux-x86_64.egg/zope/interface/registry.py", line 448, in subscribers
    return self.adapters.subscribers(objects, provided)
  File "/home/jenkins/.buildout/eggs/cp27m/zope.interface-5.2.0-py2.7-linux-x86_64.egg/zope/interface/adapter.py", line 619, in subscribers
    subscription(*objects)
  File "/home/jenkins/.buildout/eggs/cp27m/plone.app.contenttypes-2.2.1-py2.7.egg/plone/app/contenttypes/subscribers.py", line 16, in set_title_description
    datafield = obj.file
  File "/home/jenkins/.buildout/eggs/cp27m/plone.dexterity-2.10.0-py2.7.egg/plone/dexterity/content.py", line 411, in __getattr__
    raise AttributeError(name)


FAILED:  Products.CMFPlone.tests.testBrowserDefault.TestPloneToolBrowserDefault.testIndexHtmlReplaceableWrapper

Error Message:
file

Stack Trace:
file

  File "/srv/python2.7/lib/python2.7/unittest/case.py", line 320, in run
    self.setUp()
  File "/home/jenkins/workspace/plone-5.2-python-2.7/src/Products.CMFPlone/Products/CMFPlone/tests/testBrowserDefault.py", line 49, in setUp
    _createObjectByType('File', self.portal, 'file')
  File "/home/jenkins/workspace/plone-5.2-python-2.7/src/Products.CMFPlone/Products/CMFPlone/utils.py", line 357, in _createObjectByType
    return fti._constructInstance(container, id, *args, **kw)
  File "/home/jenkins/.buildout/eggs/cp27m/Products.CMFCore-2.4.8-py2.7.egg/Products/CMFCore/TypesTool.py", line 569, in _constructInstance
    notify(ObjectCreatedEvent(obj))
  File "/home/jenkins/.buildout/eggs/cp27m/zope.event-4.5.0-py2.7.egg/zope/event/__init__.py", line 32, in notify
    subscriber(event)
  File "/home/jenkins/.buildout/eggs/cp27m/zope.component-4.6.2-py2.7.egg/zope/component/event.py", line 27, in dispatch
    component_subscribers(event, None)
  File "/home/jenkins/.buildout/eggs/cp27m/zope.component-4.6.2-py2.7.egg/zope/component/_api.py", line 134, in subscribers
    return sitemanager.subscribers(objects, interface)
  File "/home/jenkins/.buildout/eggs/cp27m/zope.interface-5.2.0-py2.7-linux-x86_64.egg/zope/interface/registry.py", line 448, in subscribers
    return self.adapters.subscribers(objects, provided)
  File "/home/jenkins/.buildout/eggs/cp27m/zope.interface-5.2.0-py2.7-linux-x86_64.egg/zope/interface/adapter.py", line 619, in subscribers
    subscription(*objects)
  File "/home/jenkins/.buildout/eggs/cp27m/zope.component-4.6.2-py2.7.egg/zope/component/event.py", line 36, in objectEventNotify
    component_subscribers((event.object, event), None)
  File "/home/jenkins/.buildout/eggs/cp27m/zope.component-4.6.2-py2.7.egg/zope/component/_api.py", line 134, in subscribers
    return sitemanager.subscribers(objects, interface)
  File "/home/jenkins/.buildout/eggs/cp27m/zope.interface-5.2.0-py2.7-linux-x86_64.egg/zope/interface/registry.py", line 448, in subscribers
    return self.adapters.subscribers(objects, provided)
  File "/home/jenkins/.buildout/eggs/cp27m/zope.interface-5.2.0-py2.7-linux-x86_64.egg/zope/interface/adapter.py", line 619, in subscribers
    subscription(*objects)
  File "/home/jenkins/.buildout/eggs/cp27m/plone.app.contenttypes-2.2.1-py2.7.egg/plone/app/contenttypes/subscribers.py", line 16, in set_title_description
    datafield = obj.file
  File "/home/jenkins/.buildout/eggs/cp27m/plone.dexterity-2.10.0-py2.7.egg/plone/dexterity/content.py", line 411, in __getattr__
    raise AttributeError(name)


FAILED:  Products.CMFPlone.tests.testBrowserDefault.TestPloneToolBrowserDefault.testReselectingDefaultLayoutAfterDefaultPageWorks

Error Message:
file

Stack Trace:
file

  File "/srv/python2.7/lib/python2.7/unittest/case.py", line 320, in run
    self.setUp()
  File "/home/jenkins/workspace/plone-5.2-python-2.7/src/Products.CMFPlone/Products/CMFPlone/tests/testBrowserDefault.py", line 49, in setUp
    _createObjectByType('File', self.portal, 'file')
  File "/home/jenkins/workspace/plone-5.2-python-2.7/src/Products.CMFPlone/Products/CMFPlone/utils.py", line 357, in _createObjectByType
    return fti._constructInstance(container, id, *args, **kw)
  File "/home/jenkins/.buildout/eggs/cp27m/Products.CMFCore-2.4.8-py2.7.egg/Products/CMFCore/TypesTool.py", line 569, in _constructInstance
    notify(ObjectCreatedEvent(obj))
  File "/home/jenkins/.buildout/eggs/cp27m/zope.event-4.5.0-py2.7.egg/zope/event/__init__.py", line 32, in notify
    subscriber(event)
  File "/home/jenkins/.buildout/eggs/cp27m/zope.component-4.6.2-py2.7.egg/zope/component/event.py", line 27, in dispatch
    component_subscribers(event, None)
  File "/home/jenkins/.buildout/eggs/cp27m/zope.component-4.6.2-py2.7.egg/zope/component/_api.py", line 134, in subscribers
    return sitemanager.subscribers(objects, interface)
  File "/home/jenkins/.buildout/eggs/cp27m/zope.interface-5.2.0-py2.7-linux-x86_64.egg/zope/interface/registry.py", line 448, in subscribers
    return self.adapters.subscribers(objects, provided)
  File "/home/jenkins/.buildout/eggs/cp27m/zope.interface-5.2.0-py2.7-linux-x86_64.egg/zope/interface/adapter.py", line 619, in subscribers
    subscription(*objects)
  File "/home/jenkins/.buildout/eggs/cp27m/zope.component-4.6.2-py2.7.egg/zope/component/event.py", line 36, in objectEventNotify
    component_subscribers((event.object, event), None)
  File "/home/jenkins/.buildout/eggs/cp27m/zope.component-4.6.2-py2.7.egg/zope/component/_api.py", line 134, in subscribers
    return sitemanager.subscribers(objects, interface)
  File "/home/jenkins/.buildout/eggs/cp27m/zope.interface-5.2.0-py2.7-linux-x86_64.egg/zope/interface/registry.py", line 448, in subscribers
    return self.adapters.subscribers(objects, provided)
  File "/home/jenkins/.buildout/eggs/cp27m/zope.interface-5.2.0-py2.7-linux-x86_64.egg/zope/interface/adapter.py", line 619, in subscribers
    subscription(*objects)
  File "/home/jenkins/.buildout/eggs/cp27m/plone.app.contenttypes-2.2.1-py2.7.egg/plone/app/contenttypes/subscribers.py", line 16, in set_title_description
    datafield = obj.file
  File "/home/jenkins/.buildout/eggs/cp27m/plone.dexterity-2.10.0-py2.7.egg/plone/dexterity/content.py", line 411, in __getattr__
    raise AttributeError(name)


FAILED:  Products.CMFPlone.tests.testBrowserDefault.TestPloneToolBrowserDefault.testViewMethodWithBrowserDefaultMixinGetsSelectedLayout

Error Message:
file

Stack Trace:
file

  File "/srv/python2.7/lib/python2.7/unittest/case.py", line 320, in run
    self.setUp()
  File "/home/jenkins/workspace/plone-5.2-python-2.7/src/Products.CMFPlone/Products/CMFPlone/tests/testBrowserDefault.py", line 49, in setUp
    _createObjectByType('File', self.portal, 'file')
  File "/home/jenkins/workspace/plone-5.2-python-2.7/src/Products.CMFPlone/Products/CMFPlone/utils.py", line 357, in _createObjectByType
    return fti._constructInstance(container, id, *args, **kw)
  File "/home/jenkins/.buildout/eggs/cp27m/Products.CMFCore-2.4.8-py2.7.egg/Products/CMFCore/TypesTool.py", line 569, in _constructInstance
    notify(ObjectCreatedEvent(obj))
  File "/home/jenkins/.buildout/eggs/cp27m/zope.event-4.5.0-py2.7.egg/zope/event/__init__.py", line 32, in notify
    subscriber(event)
  File "/home/jenkins/.buildout/eggs/cp27m/zope.component-4.6.2-py2.7.egg/zope/component/event.py", line 27, in dispatch
    component_subscribers(event, None)
  File "/home/jenkins/.buildout/eggs/cp27m/zope.component-4.6.2-py2.7.egg/zope/component/_api.py", line 134, in subscribers
    return sitemanager.subscribers(objects, interface)
  File "/home/jenkins/.buildout/eggs/cp27m/zope.interface-5.2.0-py2.7-linux-x86_64.egg/zope/interface/registry.py", line 448, in subscribers
    return self.adapters.subscribers(objects, provided)
  File "/home/jenkins/.buildout/eggs/cp27m/zope.interface-5.2.0-py2.7-linux-x86_64.egg/zope/interface/adapter.py", line 619, in subscribers
    subscription(*objects)
  File "/home/jenkins/.buildout/eggs/cp27m/zope.component-4.6.2-py2.7.egg/zope/component/event.py", line 36, in objectEventNotify
    component_subscribers((event.object, event), None)
  File "/home/jenkins/.buildout/eggs/cp27m/zope.component-4.6.2-py2.7.egg/zope/component/_api.py", line 134, in subscribers
    return sitemanager.subscribers(objects, interface)
  File "/home/jenkins/.buildout/eggs/cp27m/zope.interface-5.2.0-py2.7-linux-x86_64.egg/zope/interface/registry.py", line 448, in subscribers
    return self.adapters.subscribers(objects, provided)
  File "/home/jenkins/.buildout/eggs/cp27m/zope.interface-5.2.0-py2.7-linux-x86_64.egg/zope/interface/adapter.py", line 619, in subscribers
    subscription(*objects)
  File "/home/jenkins/.buildout/eggs/cp27m/plone.app.contenttypes-2.2.1-py2.7.egg/plone/app/contenttypes/subscribers.py", line 16, in set_title_description
    datafield = obj.file
  File "/home/jenkins/.buildout/eggs/cp27m/plone.dexterity-2.10.0-py2.7.egg/plone/dexterity/content.py", line 411, in __getattr__
    raise AttributeError(name)


FAILED:  Products.CMFPlone.tests.test_patternsettings.TestPatternSettingsView.testFileUrls

Error Message:
file

Stack Trace:
file

  File "/srv/python2.7/lib/python2.7/unittest/case.py", line 329, in run
    testMethod()
  File "/home/jenkins/workspace/plone-5.2-python-2.7/src/Products.CMFPlone/Products/CMFPlone/tests/test_patternsettings.py", line 85, in testFileUrls
    self.folder.invokeFactory('File', 'file1')
  File "/home/jenkins/.buildout/eggs/cp27m/plone.dexterity-2.10.0-py2.7.egg/plone/dexterity/content.py", line 833, in invokeFactory
    type_name, id, RESPONSE, *args, **kw
  File "/home/jenkins/.buildout/eggs/cp27m/Products.CMFCore-2.4.8-py2.7.egg/Products/CMFCore/PortalFolder.py", line 300, in invokeFactory
    *args, **kw)
  File "/home/jenkins/.buildout/eggs/cp27m/Products.CMFCore-2.4.8-py2.7.egg/Products/CMFCore/TypesTool.py", line 809, in constructContent
    ob = info.constructInstance(container, id, *args, **kw)
  File "/home/jenkins/.buildout/eggs/cp27m/Products.CMFCore-2.4.8-py2.7.egg/Products/CMFCore/TypesTool.py", line 308, in constructInstance
    return self._constructInstance(container, id, *args, **kw)
  File "/home/jenkins/.buildout/eggs/cp27m/Products.CMFCore-2.4.8-py2.7.egg/Products/CMFCore/TypesTool.py", line 569, in _constructInstance
    notify(ObjectCreatedEvent(obj))
  File "/home/jenkins/.buildout/eggs/cp27m/zope.event-4.5.0-py2.7.egg/zope/event/__init__.py", line 32, in notify
    subscriber(event)
  File "/home/jenkins/.buildout/eggs/cp27m/zope.component-4.6.2-py2.7.egg/zope/component/event.py", line 27, in dispatch
    component_subscribers(event, None)
  File "/home/jenkins/.buildout/eggs/cp27m/zope.component-4.6.2-py2.7.egg/zope/component/_api.py", line 134, in subscribers
    return sitemanager.subscribers(objects, interface)
  File "/home/jenkins/.buildout/eggs/cp27m/zope.interface-5.2.0-py2.7-linux-x86_64.egg/zope/interface/registry.py", line 448, in subscribers
    return self.adapters.subscribers(objects, provided)
  File "/home/jenkins/.buildout/eggs/cp27m/zope.interface-5.2.0-py2.7-linux-x86_64.egg/zope/interface/adapter.py", line 619, in subscribers
    subscription(*objects)
  File "/home/jenkins/.buildout/eggs/cp27m/zope.component-4.6.2-py2.7.egg/zope/component/event.py", line 36, in objectEventNotify
    component_subscribers((event.object, event), None)
  File "/home/jenkins/.buildout/eggs/cp27m/zope.component-4.6.2-py2.7.egg/zope/component/_api.py", line 134, in subscribers
    return sitemanager.subscribers(objects, interface)
  File "/home/jenkins/.buildout/eggs/cp27m/zope.interface-5.2.0-py2.7-linux-x86_64.egg/zope/interface/registry.py", line 448, in subscribers
    return self.adapters.subscribers(objects, provided)
  File "/home/jenkins/.buildout/eggs/cp27m/zope.interface-5.2.0-py2.7-linux-x86_64.egg/zope/interface/adapter.py", line 619, in subscribers
    subscription(*objects)
  File "/home/jenkins/.buildout/eggs/cp27m/plone.app.contenttypes-2.2.1-py2.7.egg/plone/app/contenttypes/subscribers.py", line 16, in set_title_description
    datafield = obj.file
  File "/home/jenkins/.buildout/eggs/cp27m/plone.dexterity-2.10.0-py2.7.egg/plone/dexterity/content.py", line 411, in __getattr__
    raise AttributeError(name)


FAILED:  Products.CMFPlone.tests.csrf.txt

Error Message:
Failed doctest test for csrf.txt

Stack Trace:
Failed doctest test for csrf.txt
  File "/home/jenkins/workspace/plone-5.2-python-2.7/src/Products.CMFPlone/Products/CMFPlone/tests/csrf.txt", line 0

----------------------------------------------------------------------
File "/home/jenkins/workspace/plone-5.2-python-2.7/src/Products.CMFPlone/Products/CMFPlone/tests/csrf.txt", line 416, in csrf.txt
Failed example:
    browser.getControl(name='_authenticator', index=0).value = 'invalid!'
Exception raised:
    Traceback (most recent call last):
      File "/srv/python2.7/lib/python2.7/doctest.py", line 1315, in __run
        compileflags, 1) in test.globs
      File "<doctest csrf.txt[186]>", line 1, in <module>
        browser.getControl(name='_authenticator', index=0).value = 'invalid!'
      File "/home/jenkins/.buildout/eggs/cp27m/zope.testbrowser-5.5.1-py2.7.egg/zope/testbrowser/browser.py", line 397, in getControl
        available)
      File "/home/jenkins/.buildout/eggs/cp27m/zope.testbrowser-5.5.1-py2.7.egg/zope/testbrowser/browser.py", line 1357, in disambiguate
        raise LookupError(msg)
    LookupError: name '_authenticator'
    available items:
      <SelectControl(path=[*, ambiguous])>
      <TextControl(SearchableText=)>
      <SubmitControl(<None>=Search)>
      <SelectControl(form.widgets.enable_self_reg:list=[*, ambiguous])>
      <HiddenControl(form.widgets.enable_self_reg-empty-marker=1) (readonly)>
      <SelectControl(form.widgets.enable_user_pwd_choice:list=[*, ambiguous])>
      <HiddenControl(form.widgets.enable_user_pwd_choice-empty-marker=1) (readonly)>
      <SelectControl(form.widgets.enable_user_folders:list=[*, ambiguous])>
      <HiddenControl(form.widgets.enable_user_folders-empty-marker=1) (readonly)>
      <SelectControl(form.widgets.allow_anon_views_about:list=[*, ambiguous])>
      <HiddenControl(form.widgets.allow_anon_views_about-empty-marker=1) (readonly)>
      <SelectControl(form.widgets.use_email_as_login:list=[*, ambiguous])>
      <HiddenControl(form.widgets.use_email_as_login-empty-marker=1) (readonly)>
      <SelectControl(form.widgets.use_uuid_as_userid:list=[*, ambiguous])>
      <HiddenControl(form.widgets.use_uuid_as_userid-empty-marker=1) (readonly)>
      <SelectControl(form.widgets.autologin_after_password_reset:list=[*, ambiguous])>
      <HiddenControl(form.widgets.autologin_after_password_reset-empty-marker=1) (readonly)>
      <SubmitControl(form.buttons.save=Save)>
      <SubmitControl(form.buttons.cancel=Cancel)>


  File "/srv/python2.7/lib/python2.7/unittest/case.py", line 329, in run
    testMethod()
  File "/srv/python2.7/lib/python2.7/doctest.py", line 2224, in runTest
    raise self.failureException(self.format_failure(new.getvalue()))


FAILED:  plone.app.caching.tests.test_purge.TestScalesPurgePaths.test_scale_purge_paths

Error Message:
'/plone/media/image/@@images/image/large' not found in <generator object getRelativePaths at 0x7f7a1491b820>

Stack Trace:
'/plone/media/image/@@images/image/large' not found in <generator object getRelativePaths at 0x7f7a1491b820>

  File "/srv/python2.7/lib/python2.7/unittest/case.py", line 329, in run
    testMethod()
  File "/home/jenkins/.buildout/eggs/cp27m/plone.app.caching-2.0.8-py2.7.egg/plone/app/caching/tests/test_purge.py", line 486, in test_scale_purge_paths
    [self.assertIn(j, paths) for j in scalepaths]
  File "/srv/python2.7/lib/python2.7/unittest/case.py", line 804, in assertIn
    self.fail(self._formatMessage(msg, standardMsg))
  File "/srv/python2.7/lib/python2.7/unittest/case.py", line 410, in fail
    raise self.failureException(msg)


FAILED:  plone.app.caching.tests.test_purge.TestScalesPurgePaths.test_scale_purge_paths_unicode

Error Message:
Lists differ: [] != ['/plone/media/file/view/++wid...

Stack Trace:
Lists differ: [] != ['/plone/media/file/view/++wid...

Second list contains 2 additional elements.
First extra element 0:
'/plone/media/file/view/++widget++form.widgets.file/@@download/data/t\xc3\xb6stfile.csv'

- []
+ ['/plone/media/file/view/++widget++form.widgets.file/@@download/data/t\xc3\xb6stfile.csv',
+  '/plone/media/file/@@download/file/data/t\xc3\xb6stfile.csv']

  File "/srv/python2.7/lib/python2.7/unittest/case.py", line 329, in run
    testMethod()
  File "/home/jenkins/.buildout/eggs/cp27m/plone.app.caching-2.0.8-py2.7.egg/plone/app/caching/tests/test_purge.py", line 506, in test_scale_purge_paths_unicode
    expected,
  File "/srv/python2.7/lib/python2.7/unittest/case.py", line 743, in assertListEqual
    self.assertSequenceEqual(list1, list2, msg, seq_type=list)
  File "/srv/python2.7/lib/python2.7/unittest/case.py", line 725, in assertSequenceEqual
    self.fail(msg)
  File "/srv/python2.7/lib/python2.7/unittest/case.py", line 410, in fail
    raise self.failureException(msg)


FAILED:  plone.app.contenttypes.tests.test_file.FileFunctionalTest.test_add_file

Error Message:
name 'form.widgets.title'

Stack Trace:
name 'form.widgets.title'
available items:
  <SelectControl(path=[*, ambiguous])>
  <TextControl(SearchableText=)>
  <SubmitControl(<None>=Search)>
  <TextControl(form.widgets.ICategorization.subjects=)>
  <SelectControl(form.widgets.ICategorization.language=[*, ambiguous])>
  <TextControl(form.widgets.IRelatedItems.relatedItems=)>
  <TextControl(form.widgets.IPublication.effective=)>
  <TextControl(form.widgets.IPublication.expires=)>
  <TextControl(form.widgets.IOwnership.creators=admin)>
  <TextControl(form.widgets.IOwnership.contributors=)>
  <TextControl(form.widgets.IOwnership.rights=)>
  <SelectControl(form.widgets.IAllowDiscussion.allow_discussion:list=[*, ambiguous])>
  <HiddenControl(form.widgets.IAllowDiscussion.allow_discussion-empty-marker=1) (readonly)>
  <TextControl(form.widgets.IShortName.id=)>
  <SelectControl(form.widgets.IExcludeFromNavigation.exclude_from_nav:list=[*, ambiguous])>
  <HiddenControl(form.widgets.IExcludeFromNavigation.exclude_from_nav-empty-marker=1) (readonly)>
  <SubmitControl(form.buttons.save=Save)>
  <SubmitControl(form.buttons.cancel=Cancel)>

  File "/srv/python2.7/lib/python2.7/unittest/case.py", line 329, in run
    testMethod()
  File "/home/jenkins/.buildout/eggs/cp27m/plone.app.contenttypes-2.2.1-py2.7.egg/plone/app/contenttypes/tests/test_file.py", line 131, in test_add_file
    self.browser.getControl(name=widget).value = 'My file'
  File "/home/jenkins/.buildout/eggs/cp27m/zope.testbrowser-5.5.1-py2.7.egg/zope/testbrowser/browser.py", line 397, in getControl
    available)
  File "/home/jenkins/.buildout/eggs/cp27m/zope.testbrowser-5.5.1-py2.7.egg/zope/testbrowser/browser.py", line 1357, in disambiguate
    raise LookupError(msg)


FAILED:  plone.app.contenttypes.tests.test_file.FileFunctionalTest.test_alternative_mime_icon_doc_for_file

Error Message:
name 'form.widgets.title'

Stack Trace:
name 'form.widgets.title'
available items:
  <SelectControl(path=[*, ambiguous])>
  <TextControl(SearchableText=)>
  <SubmitControl(<None>=Search)>
  <TextControl(form.widgets.ICategorization.subjects=)>
  <SelectControl(form.widgets.ICategorization.language=[*, ambiguous])>
  <TextControl(form.widgets.IRelatedItems.relatedItems=)>
  <TextControl(form.widgets.IPublication.effective=)>
  <TextControl(form.widgets.IPublication.expires=)>
  <TextControl(form.widgets.IOwnership.creators=admin)>
  <TextControl(form.widgets.IOwnership.contributors=)>
  <TextControl(form.widgets.IOwnership.rights=)>
  <SelectControl(form.widgets.IAllowDiscussion.allow_discussion:list=[*, ambiguous])>
  <HiddenControl(form.widgets.IAllowDiscussion.allow_discussion-empty-marker=1) (readonly)>
  <TextControl(form.widgets.IShortName.id=)>
  <SelectControl(form.widgets.IExcludeFromNavigation.exclude_from_nav:list=[*, ambiguous])>
  <HiddenControl(form.widgets.IExcludeFromNavigation.exclude_from_nav-empty-marker=1) (readonly)>
  <SubmitControl(form.buttons.save=Save)>
  <SubmitControl(form.buttons.cancel=Cancel)>

  File "/srv/python2.7/lib/python2.7/unittest/case.py", line 329, in run
    testMethod()
  File "/home/jenkins/.buildout/eggs/cp27m/plone.app.contenttypes-2.2.1-py2.7.egg/plone/app/contenttypes/tests/test_file.py", line 182, in test_alternative_mime_icon_doc_for_file
    self.browser.getControl(name=widget).value = 'My file'
  File "/home/jenkins/.buildout/eggs/cp27m/zope.testbrowser-5.5.1-py2.7.egg/zope/testbrowser/browser.py", line 397, in getControl
    available)
  File "/home/jenkins/.buildout/eggs/cp27m/zope.testbrowser-5.5.1-py2.7.egg/zope/testbrowser/browser.py", line 1357, in disambiguate
    raise LookupError(msg)


FAILED:  plone.app.contenttypes.tests.test_file.FileFunctionalTest.test_mime_icon_odt_for_file_

Error Message:
name 'form.widgets.title'

Stack Trace:
name 'form.widgets.title'
available items:
  <SelectControl(path=[*, ambiguous])>
  <TextControl(SearchableText=)>
  <SubmitControl(<None>=Search)>
  <TextControl(form.widgets.ICategorization.subjects=)>
  <SelectControl(form.widgets.ICategorization.language=[*, ambiguous])>
  <TextControl(form.widgets.IRelatedItems.relatedItems=)>
  <TextControl(form.widgets.IPublication.effective=)>
  <TextControl(form.widgets.IPublication.expires=)>
  <TextControl(form.widgets.IOwnership.creators=admin)>
  <TextControl(form.widgets.IOwnership.contributors=)>
  <TextControl(form.widgets.IOwnership.rights=)>
  <SelectControl(form.widgets.IAllowDiscussion.allow_discussion:list=[*, ambiguous])>
  <HiddenControl(form.widgets.IAllowDiscussion.allow_discussion-empty-marker=1) (readonly)>
  <TextControl(form.widgets.IShortName.id=)>
  <SelectControl(form.widgets.IExcludeFromNavigation.exclude_from_nav:list=[*, ambiguous])>
  <HiddenControl(form.widgets.IExcludeFromNavigation.exclude_from_nav-empty-marker=1) (readonly)>
  <SubmitControl(form.buttons.save=Save)>
  <SubmitControl(form.buttons.cancel=Cancel)>

  File "/srv/python2.7/lib/python2.7/unittest/case.py", line 329, in run
    testMethod()
  File "/home/jenkins/.buildout/eggs/cp27m/plone.app.contenttypes-2.2.1-py2.7.egg/plone/app/contenttypes/tests/test_file.py", line 198, in test_mime_icon_odt_for_file_
    self.browser.getControl(name=widget).value = 'My file'
  File "/home/jenkins/.buildout/eggs/cp27m/zope.testbrowser-5.5.1-py2.7.egg/zope/testbrowser/browser.py", line 397, in getControl
    available)
  File "/home/jenkins/.buildout/eggs/cp27m/zope.testbrowser-5.5.1-py2.7.egg/zope/testbrowser/browser.py", line 1357, in disambiguate
    raise LookupError(msg)


FAILED:  plone.app.contenttypes.tests.test_file.FileFunctionalTest.test_mime_icon_pdf_for_file_

Error Message:
name 'form.widgets.title'

Stack Trace:
name 'form.widgets.title'
available items:
  <SelectControl(path=[*, ambiguous])>
  <TextControl(SearchableText=)>
  <SubmitControl(<None>=Search)>
  <TextControl(form.widgets.ICategorization.subjects=)>
  <SelectControl(form.widgets.ICategorization.language=[*, ambiguous])>
  <TextControl(form.widgets.IRelatedItems.relatedItems=)>
  <TextControl(form.widgets.IPublication.effective=)>
  <TextControl(form.widgets.IPublication.expires=)>
  <TextControl(form.widgets.IOwnership.creators=admin)>
  <TextControl(form.widgets.IOwnership.contributors=)>
  <TextControl(form.widgets.IOwnership.rights=)>
  <SelectControl(form.widgets.IAllowDiscussion.allow_discussion:list=[*, ambiguous])>
  <HiddenControl(form.widgets.IAllowDiscussion.allow_discussion-empty-marker=1) (readonly)>
  <TextControl(form.widgets.IShortName.id=)>
  <SelectControl(form.widgets.IExcludeFromNavigation.exclude_from_nav:list=[*, ambiguous])>
  <HiddenControl(form.widgets.IExcludeFromNavigation.exclude_from_nav-empty-marker=1) (readonly)>
  <SubmitControl(form.buttons.save=Save)>
  <SubmitControl(form.buttons.cancel=Cancel)>

  File "/srv/python2.7/lib/python2.7/unittest/case.py", line 329, in run
    testMethod()
  File "/home/jenkins/.buildout/eggs/cp27m/plone.app.contenttypes-2.2.1-py2.7.egg/plone/app/contenttypes/tests/test_file.py", line 162, in test_mime_icon_pdf_for_file_
    self.browser.getControl(name=widget).value = 'My file'
  File "/home/jenkins/.buildout/eggs/cp27m/zope.testbrowser-5.5.1-py2.7.egg/zope/testbrowser/browser.py", line 397, in getControl
    available)
  File "/home/jenkins/.buildout/eggs/cp27m/zope.testbrowser-5.5.1-py2.7.egg/zope/testbrowser/browser.py", line 1357, in disambiguate
    raise LookupError(msg)


FAILED:  plone.app.contenttypes.tests.test_file.FileFunctionalTest.test_shortname_file

Error Message:
name 'form.widgets.title'

Stack Trace:
name 'form.widgets.title'
available items:
  <SelectControl(path=[*, ambiguous])>
  <TextControl(SearchableText=)>
  <SubmitControl(<None>=Search)>
  <TextControl(form.widgets.ICategorization.subjects=)>
  <SelectControl(form.widgets.ICategorization.language=[*, ambiguous])>
  <TextControl(form.widgets.IRelatedItems.relatedItems=)>
  <TextControl(form.widgets.IPublication.effective=)>
  <TextControl(form.widgets.IPublication.expires=)>
  <TextControl(form.widgets.IOwnership.creators=admin)>
  <TextControl(form.widgets.IOwnership.contributors=)>
  <TextControl(form.widgets.IOwnership.rights=)>
  <SelectControl(form.widgets.IAllowDiscussion.allow_discussion:list=[*, ambiguous])>
  <HiddenControl(form.widgets.IAllowDiscussion.allow_discussion-empty-marker=1) (readonly)>
  <TextControl(form.widgets.IShortName.id=)>
  <SelectControl(form.widgets.IExcludeFromNavigation.exclude_from_nav:list=[*, ambiguous])>
  <HiddenControl(form.widgets.IExcludeFromNavigation.exclude_from_nav-empty-marker=1) (readonly)>
  <SubmitControl(form.buttons.save=Save)>
  <SubmitControl(form.buttons.cancel=Cancel)>

  File "/srv/python2.7/lib/python2.7/unittest/case.py", line 329, in run
    testMethod()
  File "/home/jenkins/.buildout/eggs/cp27m/plone.app.contenttypes-2.2.1-py2.7.egg/plone/app/contenttypes/tests/test_file.py", line 147, in test_shortname_file
    self.browser.getControl(name=widget).value = 'My file'
  File "/home/jenkins/.buildout/eggs/cp27m/zope.testbrowser-5.5.1-py2.7.egg/zope/testbrowser/browser.py", line 397, in getControl
    available)
  File "/home/jenkins/.buildout/eggs/cp27m/zope.testbrowser-5.5.1-py2.7.egg/zope/testbrowser/browser.py", line 1357, in disambiguate
    raise LookupError(msg)


FAILED:  plone.app.contenttypes.tests.test_image.ImageFunctionalTest.test_add_image

Error Message:
name 'form.widgets.title'

Stack Trace:
name 'form.widgets.title'
available items:
  <SelectControl(path=[*, ambiguous])>
  <TextControl(SearchableText=)>
  <SubmitControl(<None>=Search)>
  <TextControl(form.widgets.ICategorization.subjects=)>
  <SelectControl(form.widgets.ICategorization.language=[*, ambiguous])>
  <TextControl(form.widgets.IRelatedItems.relatedItems=)>
  <TextControl(form.widgets.IPublication.effective=)>
  <TextControl(form.widgets.IPublication.expires=)>
  <TextControl(form.widgets.IOwnership.creators=admin)>
  <TextControl(form.widgets.IOwnership.contributors=)>
  <TextControl(form.widgets.IOwnership.rights=)>
  <SelectControl(form.widgets.IAllowDiscussion.allow_discussion:list=[*, ambiguous])>
  <HiddenControl(form.widgets.IAllowDiscussion.allow_discussion-empty-marker=1) (readonly)>
  <TextControl(form.widgets.IShortName.id=)>
  <SelectControl(form.widgets.IExcludeFromNavigation.exclude_from_nav:list=[*, ambiguous])>
  <HiddenControl(form.widgets.IExcludeFromNavigation.exclude_from_nav-empty-marker=1) (readonly)>
  <SubmitControl(form.buttons.save=Save)>
  <SubmitControl(form.buttons.cancel=Cancel)>

  File "/srv/python2.7/lib/python2.7/unittest/case.py", line 329, in run
    testMethod()
  File "/home/jenkins/.buildout/eggs/cp27m/plone.app.contenttypes-2.2.1-py2.7.egg/plone/app/contenttypes/tests/test_image.py", line 151, in test_add_image
    self.browser.getControl(name=widget).value = 'My image'
  File "/home/jenkins/.buildout/eggs/cp27m/zope.testbrowser-5.5.1-py2.7.egg/zope/testbrowser/browser.py", line 397, in getControl
    available)
  File "/home/jenkins/.buildout/eggs/cp27m/zope.testbrowser-5.5.1-py2.7.egg/zope/testbrowser/browser.py", line 1357, in disambiguate
    raise LookupError(msg)


FAILED:  plone.app.contenttypes.tests.test_image.ImageFunctionalTest.test_add_image_with_shortname

Error Message:
name 'form.widgets.title'

Stack Trace:
name 'form.widgets.title'
available items:
  <SelectControl(path=[*, ambiguous])>
  <TextControl(SearchableText=)>
  <SubmitControl(<None>=Search)>
  <TextControl(form.widgets.ICategorization.subjects=)>
  <SelectControl(form.widgets.ICategorization.language=[*, ambiguous])>
  <TextControl(form.widgets.IRelatedItems.relatedItems=)>
  <TextControl(form.widgets.IPublication.effective=)>
  <TextControl(form.widgets.IPublication.expires=)>
  <TextControl(form.widgets.IOwnership.creators=admin)>
  <TextControl(form.widgets.IOwnership.contributors=)>
  <TextControl(form.widgets.IOwnership.rights=)>
  <SelectControl(form.widgets.IAllowDiscussion.allow_discussion:list=[*, ambiguous])>
  <HiddenControl(form.widgets.IAllowDiscussion.allow_discussion-empty-marker=1) (readonly)>
  <TextControl(form.widgets.IShortName.id=)>
  <SelectControl(form.widgets.IExcludeFromNavigation.exclude_from_nav:list=[*, ambiguous])>
  <HiddenControl(form.widgets.IExcludeFromNavigation.exclude_from_nav-empty-marker=1) (readonly)>
  <SubmitControl(form.buttons.save=Save)>
  <SubmitControl(form.buttons.cancel=Cancel)>

  File "/srv/python2.7/lib/python2.7/unittest/case.py", line 329, in run
    testMethod()
  File "/home/jenkins/.buildout/eggs/cp27m/plone.app.contenttypes-2.2.1-py2.7.egg/plone/app/contenttypes/tests/test_image.py", line 170, in test_add_image_with_shortname
    self.browser.getControl(name=widget).value = 'My image'
  File "/home/jenkins/.buildout/eggs/cp27m/zope.testbrowser-5.5.1-py2.7.egg/zope/testbrowser/browser.py", line 397, in getControl
    available)
  File "/home/jenkins/.buildout/eggs/cp27m/zope.testbrowser-5.5.1-py2.7.egg/zope/testbrowser/browser.py", line 1357, in disambiguate
    raise LookupError(msg)


FAILED:  plone.app.contenttypes.tests.test_image.ImageFunctionalTest.test_image_view_fullscreen

Error Message:
False is not true

Stack Trace:
False is not true

  File "/srv/python2.7/lib/python2.7/unittest/case.py", line 329, in run
    testMethod()
  File "/home/jenkins/.buildout/eggs/cp27m/plone.app.contenttypes-2.2.1-py2.7.egg/plone/app/contenttypes/tests/test_image.py", line 183, in test_image_view_fullscreen
    self.assertTrue('Title' in self.browser.contents)
  File "/srv/python2.7/lib/python2.7/unittest/case.py", line 422, in assertTrue
    raise self.failureException(msg)


FAILED:  plone.app.contenttypes.tests.test_image.ImageIntegrationTest.test_adding

Error Message:
image

Stack Trace:
image

  File "/srv/python2.7/lib/python2.7/unittest/case.py", line 329, in run
    testMethod()
  File "/home/jenkins/.buildout/eggs/cp27m/plone.app.contenttypes-2.2.1-py2.7.egg/plone/app/contenttypes/tests/test_image.py", line 69, in test_adding
    'doc1'
  File "/home/jenkins/.buildout/eggs/cp27m/Products.CMFCore-2.4.8-py2.7.egg/Products/CMFCore/PortalFolder.py", line 300, in invokeFactory
    *args, **kw)
  File "/home/jenkins/.buildout/eggs/cp27m/Products.CMFCore-2.4.8-py2.7.egg/Products/CMFCore/TypesTool.py", line 809, in constructContent
    ob = info.constructInstance(container, id, *args, **kw)
  File "/home/jenkins/.buildout/eggs/cp27m/Products.CMFCore-2.4.8-py2.7.egg/Products/CMFCore/TypesTool.py", line 308, in constructInstance
    return self._constructInstance(container, id, *args, **kw)
  File "/home/jenkins/.buildout/eggs/cp27m/Products.CMFCore-2.4.8-py2.7.egg/Products/CMFCore/TypesTool.py", line 569, in _constructInstance
    notify(ObjectCreatedEvent(obj))
  File "/home/jenkins/.buildout/eggs/cp27m/zope.event-4.5.0-py2.7.egg/zope/event/__init__.py", line 32, in notify
    subscriber(event)
  File "/home/jenkins/.buildout/eggs/cp27m/zope.component-4.6.2-py2.7.egg/zope/component/event.py", line 27, in dispatch
    component_subscribers(event, None)
  File "/home/jenkins/.buildout/eggs/cp27m/zope.component-4.6.2-py2.7.egg/zope/component/_api.py", line 134, in subscribers
    return sitemanager.subscribers(objects, interface)
  File "/home/jenkins/.buildout/eggs/cp27m/zope.interface-5.2.0-py2.7-linux-x86_64.egg/zope/interface/registry.py", line 448, in subscribers
    return self.adapters.subscribers(objects, provided)
  File "/home/jenkins/.buildout/eggs/cp27m/zope.interface-5.2.0-py2.7-linux-x86_64.egg/zope/interface/adapter.py", line 619, in subscribers
    subscription(*objects)
  File "/home/jenkins/.buildout/eggs/cp27m/zope.component-4.6.2-py2.7.egg/zope/component/event.py", line 36, in objectEventNotify
    component_subscribers((event.object, event), None)
  File "/home/jenkins/.buildout/eggs/cp27m/zope.component-4.6.2-py2.7.egg/zope/component/_api.py", line 134, in subscribers
    return sitemanager.subscribers(objects, interface)
  File "/home/jenkins/.buildout/eggs/cp27m/zope.interface-5.2.0-py2.7-linux-x86_64.egg/zope/interface/registry.py", line 448, in subscribers
    return self.adapters.subscribers(objects, provided)
  File "/home/jenkins/.buildout/eggs/cp27m/zope.interface-5.2.0-py2.7-linux-x86_64.egg/zope/interface/adapter.py", line 619, in subscribers
    subscription(*objects)
  File "/home/jenkins/.buildout/eggs/cp27m/plone.app.contenttypes-2.2.1-py2.7.egg/plone/app/contenttypes/subscribers.py", line 14, in set_title_description
    datafield = obj.image
  File "/home/jenkins/.buildout/eggs/cp27m/plone.dexterity-2.10.0-py2.7.egg/plone/dexterity/content.py", line 411, in __getattr__
    raise AttributeError(name)


FAILED:  plone.app.event.tests.test_ical_import.TestICALImportSettings.test_enable_ical_import

Error Message:
label 'Confirm action'

Stack Trace:
label 'Confirm action'
available items:
  <SelectControl(path=[*, ambiguous])>
  <Item name='/plone/f1' id='searchbox_currentfolder_only' name='path' type='checkbox' id='searchbox_currentfolder_only' value='/plone/f1'>
  <TextControl(SearchableText=)>
  <SubmitControl(<None>=Search)>

  File "/srv/python2.7/lib/python2.7/unittest/case.py", line 329, in run
    testMethod()
  File "/home/jenkins/.buildout/eggs/cp27m/plone.app.event-3.2.10-py2.7.egg/plone/app/event/tests/test_ical_import.py", line 65, in test_enable_ical_import
    self.browser.getControl('Confirm action').click()
  File "/home/jenkins/.buildout/eggs/cp27m/zope.testbrowser-5.5.1-py2.7.egg/zope/testbrowser/browser.py", line 397, in getControl
    available)
  File "/home/jenkins/.buildout/eggs/cp27m/zope.testbrowser-5.5.1-py2.7.egg/zope/testbrowser/browser.py", line 1357, in disambiguate
    raise LookupError(msg)


FAILED:  plone.app.layout.globals.tests.test_context.TestContextStateView.test_view_url

Error Message:
file

Stack Trace:
file

  File "/srv/python2.7/lib/python2.7/unittest/case.py", line 329, in run
    testMethod()
  File "/home/jenkins/.buildout/eggs/cp27m/plone.app.layout-3.4.6-py2.7.egg/plone/app/layout/globals/tests/test_context.py", line 62, in test_view_url
    self.folder.invokeFactory("File", "file1")
  File "/home/jenkins/.buildout/eggs/cp27m/plone.dexterity-2.10.0-py2.7.egg/plone/dexterity/content.py", line 833, in invokeFactory
    type_name, id, RESPONSE, *args, **kw
  File "/home/jenkins/.buildout/eggs/cp27m/Products.CMFCore-2.4.8-py2.7.egg/Products/CMFCore/PortalFolder.py", line 300, in invokeFactory
    *args, **kw)
  File "/home/jenkins/.buildout/eggs/cp27m/Products.CMFCore-2.4.8-py2.7.egg/Products/CMFCore/TypesTool.py", line 809, in constructContent
    ob = info.constructInstance(container, id, *args, **kw)
  File "/home/jenkins/.buildout/eggs/cp27m/Products.CMFCore-2.4.8-py2.7.egg/Products/CMFCore/TypesTool.py", line 308, in constructInstance
    return self._constructInstance(container, id, *args, **kw)
  File "/home/jenkins/.buildout/eggs/cp27m/Products.CMFCore-2.4.8-py2.7.egg/Products/CMFCore/TypesTool.py", line 569, in _constructInstance
    notify(ObjectCreatedEvent(obj))
  File "/home/jenkins/.buildout/eggs/cp27m/zope.event-4.5.0-py2.7.egg/zope/event/__init__.py", line 32, in notify
    subscriber(event)
  File "/home/jenkins/.buildout/eggs/cp27m/zope.component-4.6.2-py2.7.egg/zope/component/event.py", line 27, in dispatch
    component_subscribers(event, None)
  File "/home/jenkins/.buildout/eggs/cp27m/zope.component-4.6.2-py2.7.egg/zope/component/_api.py", line 134, in subscribers
    return sitemanager.subscribers(objects, interface)
  File "/home/jenkins/.buildout/eggs/cp27m/zope.interface-5.2.0-py2.7-linux-x86_64.egg/zope/interface/registry.py", line 448, in subscribers
    return self.adapters.subscribers(objects, provided)
  File "/home/jenkins/.buildout/eggs/cp27m/zope.interface-5.2.0-py2.7-linux-x86_64.egg/zope/interface/adapter.py", line 619, in subscribers
    subscription(*objects)
  File "/home/jenkins/.buildout/eggs/cp27m/zope.component-4.6.2-py2.7.egg/zope/component/event.py", line 36, in objectEventNotify
    component_subscribers((event.object, event), None)
  File "/home/jenkins/.buildout/eggs/cp27m/zope.component-4.6.2-py2.7.egg/zope/component/_api.py", line 134, in subscribers
    return sitemanager.subscribers(objects, interface)
  File "/home/jenkins/.buildout/eggs/cp27m/zope.interface-5.2.0-py2.7-linux-x86_64.egg/zope/interface/registry.py", line 448, in subscribers
    return self.adapters.subscribers(objects, provided)
  File "/home/jenkins/.buildout/eggs/cp27m/zope.interface-5.2.0-py2.7-linux-x86_64.egg/zope/interface/adapter.py", line 619, in subscribers
    subscription(*objects)
  File "/home/jenkins/.buildout/eggs/cp27m/plone.app.contenttypes-2.2.1-py2.7.egg/plone/app/contenttypes/subscribers.py", line 16, in set_title_description
    datafield = obj.file
  File "/home/jenkins/.buildout/eggs/cp27m/plone.dexterity-2.10.0-py2.7.egg/plone/dexterity/content.py", line 411, in __getattr__
    raise AttributeError(name)


FAILED:  plone.restapi.tests.test_serializer.TestSerializeToJsonAdapter.test_serialize_empty_image_returns_none

Error Message:
'image'

Stack Trace:
'image'

  File "/srv/python2.7/lib/python2.7/unittest/case.py", line 329, in run
    testMethod()
  File "/home/jenkins/workspace/plone-5.2-python-2.7/src/plone.restapi/src/plone/restapi/tests/test_serializer.py", line 289, in test_serialize_empty_image_returns_none
    self.assertEqual(None, self.serialize(self.portal.image1)["image"])


FAILED:  plone.restapi.tests.test_serializer.TestSerializeToJsonAdapter.test_serialize_file

Error Message:
{u'download': 'http://nohost/plone/file1/@@download/file', u'size': 13, u'content-type': u'text/plain', u'filename': u'test.txt'} != None

Stack Trace:
{u'download': 'http://nohost/plone/file1/@@download/file', u'size': 13, u'content-type': u'text/plain', u'filename': u'test.txt'} != None

  File "/srv/python2.7/lib/python2.7/unittest/case.py", line 329, in run
    testMethod()
  File "/home/jenkins/workspace/plone-5.2-python-2.7/src/plone.restapi/src/plone/restapi/tests/test_serializer.py", line 242, in test_serialize_file
    self.serialize(self.portal.file1).get("file"),
  File "/srv/python2.7/lib/python2.7/unittest/case.py", line 513, in assertEqual
    assertion_func(first, second, msg=msg)
  File "/srv/python2.7/lib/python2.7/unittest/case.py", line 506, in _baseAssertEqual
    raise self.failureException(msg)


FAILED:  plone.restapi.tests.test_serializer.TestSerializeToJsonAdapter.test_serialize_image

Error Message:
'image'

Stack Trace:
'image'

  File "/srv/python2.7/lib/python2.7/unittest/case.py", line 329, in run
    testMethod()
  File "/home/jenkins/workspace/plone-5.2-python-2.7/src/plone.restapi/src/plone/restapi/tests/test_serializer.py", line 284, in test_serialize_image
    self.serialize(self.portal.image1)["image"],


More information about the Testbot mailing list