[Testbot] Plone 5.2 - Python 2.7 - Build # 1212 - Still Failing!

jenkins at plone.org jenkins at plone.org
Sat Jan 9 12:59:05 UTC 2021


Plone 5.2 - Python 2.7 - Build # 1212 - Still Failing:

Check console output at https://jenkins.plone.org/job/plone-5.2-python-2.7/1212/ to view the results.


Plone 5.2 - Python 2.7 - Build # 1212 - Still Failing:

Check console output at https://jenkins.plone.org/job/plone-5.2-python-2.7/1212/ to view the results.

Test Results:

37 tests failed.
FAILED:  plone.app.portlets.tests.test_navigation_portlet.TestRenderer.testAboveRoot

Error Message:
file

Stack Trace:
file

  File "/srv/python2.7/lib/python2.7/unittest/case.py", line 320, in run
    self.setUp()
  File "/home/jenkins/.buildout/eggs/cp27m/plone.app.portlets-4.4.6-py2.7.egg/plone/app/portlets/tests/base.py", line 22, in setUp
    self.afterSetUp()
  File "/home/jenkins/.buildout/eggs/cp27m/plone.app.portlets-4.4.6-py2.7.egg/plone/app/portlets/tests/test_navigation_portlet.py", line 96, in afterSetUp
    self.populateSite()
  File "/home/jenkins/.buildout/eggs/cp27m/plone.app.portlets-4.4.6-py2.7.egg/plone/app/portlets/tests/test_navigation_portlet.py", line 140, in populateSite
    folder2.invokeFactory('File', 'file21')
  File "/home/jenkins/.buildout/eggs/cp27m/plone.dexterity-2.10.0-py2.7.egg/plone/dexterity/content.py", line 833, in invokeFactory
    type_name, id, RESPONSE, *args, **kw
  File "/home/jenkins/.buildout/eggs/cp27m/Products.CMFCore-2.4.8-py2.7.egg/Products/CMFCore/PortalFolder.py", line 300, in invokeFactory
    *args, **kw)
  File "/home/jenkins/.buildout/eggs/cp27m/Products.CMFCore-2.4.8-py2.7.egg/Products/CMFCore/TypesTool.py", line 809, in constructContent
    ob = info.constructInstance(container, id, *args, **kw)
  File "/home/jenkins/.buildout/eggs/cp27m/Products.CMFCore-2.4.8-py2.7.egg/Products/CMFCore/TypesTool.py", line 308, in constructInstance
    return self._constructInstance(container, id, *args, **kw)
  File "/home/jenkins/.buildout/eggs/cp27m/Products.CMFCore-2.4.8-py2.7.egg/Products/CMFCore/TypesTool.py", line 569, in _constructInstance
    notify(ObjectCreatedEvent(obj))
  File "/home/jenkins/.buildout/eggs/cp27m/zope.event-4.5.0-py2.7.egg/zope/event/__init__.py", line 32, in notify
    subscriber(event)
  File "/home/jenkins/.buildout/eggs/cp27m/zope.component-4.6.2-py2.7.egg/zope/component/event.py", line 27, in dispatch
    component_subscribers(event, None)
  File "/home/jenkins/.buildout/eggs/cp27m/zope.component-4.6.2-py2.7.egg/zope/component/_api.py", line 134, in subscribers
    return sitemanager.subscribers(objects, interface)
  File "/home/jenkins/.buildout/eggs/cp27m/zope.interface-5.2.0-py2.7-linux-x86_64.egg/zope/interface/registry.py", line 448, in subscribers
    return self.adapters.subscribers(objects, provided)
  File "/home/jenkins/.buildout/eggs/cp27m/zope.interface-5.2.0-py2.7-linux-x86_64.egg/zope/interface/adapter.py", line 619, in subscribers
    subscription(*objects)
  File "/home/jenkins/.buildout/eggs/cp27m/zope.component-4.6.2-py2.7.egg/zope/component/event.py", line 36, in objectEventNotify
    component_subscribers((event.object, event), None)
  File "/home/jenkins/.buildout/eggs/cp27m/zope.component-4.6.2-py2.7.egg/zope/component/_api.py", line 134, in subscribers
    return sitemanager.subscribers(objects, interface)
  File "/home/jenkins/.buildout/eggs/cp27m/zope.interface-5.2.0-py2.7-linux-x86_64.egg/zope/interface/registry.py", line 448, in subscribers
    return self.adapters.subscribers(objects, provided)
  File "/home/jenkins/.buildout/eggs/cp27m/zope.interface-5.2.0-py2.7-linux-x86_64.egg/zope/interface/adapter.py", line 619, in subscribers
    subscription(*objects)
  File "/home/jenkins/.buildout/eggs/cp27m/plone.app.contenttypes-2.2.1-py2.7.egg/plone/app/contenttypes/subscribers.py", line 16, in set_title_description
    datafield = obj.file
  File "/home/jenkins/.buildout/eggs/cp27m/plone.dexterity-2.10.0-py2.7.egg/plone/dexterity/content.py", line 411, in __getattr__
    raise AttributeError(name)


FAILED:  plone.app.portlets.tests.test_navigation_portlet.TestRenderer.testBottomLevelStopsAtFolder

Error Message:
file

Stack Trace:
file

  File "/srv/python2.7/lib/python2.7/unittest/case.py", line 320, in run
    self.setUp()
  File "/home/jenkins/.buildout/eggs/cp27m/plone.app.portlets-4.4.6-py2.7.egg/plone/app/portlets/tests/base.py", line 22, in setUp
    self.afterSetUp()
  File "/home/jenkins/.buildout/eggs/cp27m/plone.app.portlets-4.4.6-py2.7.egg/plone/app/portlets/tests/test_navigation_portlet.py", line 96, in afterSetUp
    self.populateSite()
  File "/home/jenkins/.buildout/eggs/cp27m/plone.app.portlets-4.4.6-py2.7.egg/plone/app/portlets/tests/test_navigation_portlet.py", line 140, in populateSite
    folder2.invokeFactory('File', 'file21')
  File "/home/jenkins/.buildout/eggs/cp27m/plone.dexterity-2.10.0-py2.7.egg/plone/dexterity/content.py", line 833, in invokeFactory
    type_name, id, RESPONSE, *args, **kw
  File "/home/jenkins/.buildout/eggs/cp27m/Products.CMFCore-2.4.8-py2.7.egg/Products/CMFCore/PortalFolder.py", line 300, in invokeFactory
    *args, **kw)
  File "/home/jenkins/.buildout/eggs/cp27m/Products.CMFCore-2.4.8-py2.7.egg/Products/CMFCore/TypesTool.py", line 809, in constructContent
    ob = info.constructInstance(container, id, *args, **kw)
  File "/home/jenkins/.buildout/eggs/cp27m/Products.CMFCore-2.4.8-py2.7.egg/Products/CMFCore/TypesTool.py", line 308, in constructInstance
    return self._constructInstance(container, id, *args, **kw)
  File "/home/jenkins/.buildout/eggs/cp27m/Products.CMFCore-2.4.8-py2.7.egg/Products/CMFCore/TypesTool.py", line 569, in _constructInstance
    notify(ObjectCreatedEvent(obj))
  File "/home/jenkins/.buildout/eggs/cp27m/zope.event-4.5.0-py2.7.egg/zope/event/__init__.py", line 32, in notify
    subscriber(event)
  File "/home/jenkins/.buildout/eggs/cp27m/zope.component-4.6.2-py2.7.egg/zope/component/event.py", line 27, in dispatch
    component_subscribers(event, None)
  File "/home/jenkins/.buildout/eggs/cp27m/zope.component-4.6.2-py2.7.egg/zope/component/_api.py", line 134, in subscribers
    return sitemanager.subscribers(objects, interface)
  File "/home/jenkins/.buildout/eggs/cp27m/zope.interface-5.2.0-py2.7-linux-x86_64.egg/zope/interface/registry.py", line 448, in subscribers
    return self.adapters.subscribers(objects, provided)
  File "/home/jenkins/.buildout/eggs/cp27m/zope.interface-5.2.0-py2.7-linux-x86_64.egg/zope/interface/adapter.py", line 619, in subscribers
    subscription(*objects)
  File "/home/jenkins/.buildout/eggs/cp27m/zope.component-4.6.2-py2.7.egg/zope/component/event.py", line 36, in objectEventNotify
    component_subscribers((event.object, event), None)
  File "/home/jenkins/.buildout/eggs/cp27m/zope.component-4.6.2-py2.7.egg/zope/component/_api.py", line 134, in subscribers
    return sitemanager.subscribers(objects, interface)
  File "/home/jenkins/.buildout/eggs/cp27m/zope.interface-5.2.0-py2.7-linux-x86_64.egg/zope/interface/registry.py", line 448, in subscribers
    return self.adapters.subscribers(objects, provided)
  File "/home/jenkins/.buildout/eggs/cp27m/zope.interface-5.2.0-py2.7-linux-x86_64.egg/zope/interface/adapter.py", line 619, in subscribers
    subscription(*objects)
  File "/home/jenkins/.buildout/eggs/cp27m/plone.app.contenttypes-2.2.1-py2.7.egg/plone/app/contenttypes/subscribers.py", line 16, in set_title_description
    datafield = obj.file
  File "/home/jenkins/.buildout/eggs/cp27m/plone.dexterity-2.10.0-py2.7.egg/plone/dexterity/content.py", line 411, in __getattr__
    raise AttributeError(name)


FAILED:  plone.app.portlets.tests.test_navigation_portlet.TestRenderer.testBottomLevelZeroNoLimit

Error Message:
file

Stack Trace:
file

  File "/srv/python2.7/lib/python2.7/unittest/case.py", line 320, in run
    self.setUp()
  File "/home/jenkins/.buildout/eggs/cp27m/plone.app.portlets-4.4.6-py2.7.egg/plone/app/portlets/tests/base.py", line 22, in setUp
    self.afterSetUp()
  File "/home/jenkins/.buildout/eggs/cp27m/plone.app.portlets-4.4.6-py2.7.egg/plone/app/portlets/tests/test_navigation_portlet.py", line 96, in afterSetUp
    self.populateSite()
  File "/home/jenkins/.buildout/eggs/cp27m/plone.app.portlets-4.4.6-py2.7.egg/plone/app/portlets/tests/test_navigation_portlet.py", line 140, in populateSite
    folder2.invokeFactory('File', 'file21')
  File "/home/jenkins/.buildout/eggs/cp27m/plone.dexterity-2.10.0-py2.7.egg/plone/dexterity/content.py", line 833, in invokeFactory
    type_name, id, RESPONSE, *args, **kw
  File "/home/jenkins/.buildout/eggs/cp27m/Products.CMFCore-2.4.8-py2.7.egg/Products/CMFCore/PortalFolder.py", line 300, in invokeFactory
    *args, **kw)
  File "/home/jenkins/.buildout/eggs/cp27m/Products.CMFCore-2.4.8-py2.7.egg/Products/CMFCore/TypesTool.py", line 809, in constructContent
    ob = info.constructInstance(container, id, *args, **kw)
  File "/home/jenkins/.buildout/eggs/cp27m/Products.CMFCore-2.4.8-py2.7.egg/Products/CMFCore/TypesTool.py", line 308, in constructInstance
    return self._constructInstance(container, id, *args, **kw)
  File "/home/jenkins/.buildout/eggs/cp27m/Products.CMFCore-2.4.8-py2.7.egg/Products/CMFCore/TypesTool.py", line 569, in _constructInstance
    notify(ObjectCreatedEvent(obj))
  File "/home/jenkins/.buildout/eggs/cp27m/zope.event-4.5.0-py2.7.egg/zope/event/__init__.py", line 32, in notify
    subscriber(event)
  File "/home/jenkins/.buildout/eggs/cp27m/zope.component-4.6.2-py2.7.egg/zope/component/event.py", line 27, in dispatch
    component_subscribers(event, None)
  File "/home/jenkins/.buildout/eggs/cp27m/zope.component-4.6.2-py2.7.egg/zope/component/_api.py", line 134, in subscribers
    return sitemanager.subscribers(objects, interface)
  File "/home/jenkins/.buildout/eggs/cp27m/zope.interface-5.2.0-py2.7-linux-x86_64.egg/zope/interface/registry.py", line 448, in subscribers
    return self.adapters.subscribers(objects, provided)
  File "/home/jenkins/.buildout/eggs/cp27m/zope.interface-5.2.0-py2.7-linux-x86_64.egg/zope/interface/adapter.py", line 619, in subscribers
    subscription(*objects)
  File "/home/jenkins/.buildout/eggs/cp27m/zope.component-4.6.2-py2.7.egg/zope/component/event.py", line 36, in objectEventNotify
    component_subscribers((event.object, event), None)
  File "/home/jenkins/.buildout/eggs/cp27m/zope.component-4.6.2-py2.7.egg/zope/component/_api.py", line 134, in subscribers
    return sitemanager.subscribers(objects, interface)
  File "/home/jenkins/.buildout/eggs/cp27m/zope.interface-5.2.0-py2.7-linux-x86_64.egg/zope/interface/registry.py", line 448, in subscribers
    return self.adapters.subscribers(objects, provided)
  File "/home/jenkins/.buildout/eggs/cp27m/zope.interface-5.2.0-py2.7-linux-x86_64.egg/zope/interface/adapter.py", line 619, in subscribers
    subscription(*objects)
  File "/home/jenkins/.buildout/eggs/cp27m/plone.app.contenttypes-2.2.1-py2.7.egg/plone/app/contenttypes/subscribers.py", line 16, in set_title_description
    datafield = obj.file
  File "/home/jenkins/.buildout/eggs/cp27m/plone.dexterity-2.10.0-py2.7.egg/plone/dexterity/content.py", line 411, in __getattr__
    raise AttributeError(name)


FAILED:  plone.app.portlets.tests.test_navigation_portlet.TestRenderer.testBottomLevelZeroNoLimitRendering

Error Message:
file

Stack Trace:
file

  File "/srv/python2.7/lib/python2.7/unittest/case.py", line 320, in run
    self.setUp()
  File "/home/jenkins/.buildout/eggs/cp27m/plone.app.portlets-4.4.6-py2.7.egg/plone/app/portlets/tests/base.py", line 22, in setUp
    self.afterSetUp()
  File "/home/jenkins/.buildout/eggs/cp27m/plone.app.portlets-4.4.6-py2.7.egg/plone/app/portlets/tests/test_navigation_portlet.py", line 96, in afterSetUp
    self.populateSite()
  File "/home/jenkins/.buildout/eggs/cp27m/plone.app.portlets-4.4.6-py2.7.egg/plone/app/portlets/tests/test_navigation_portlet.py", line 140, in populateSite
    folder2.invokeFactory('File', 'file21')
  File "/home/jenkins/.buildout/eggs/cp27m/plone.dexterity-2.10.0-py2.7.egg/plone/dexterity/content.py", line 833, in invokeFactory
    type_name, id, RESPONSE, *args, **kw
  File "/home/jenkins/.buildout/eggs/cp27m/Products.CMFCore-2.4.8-py2.7.egg/Products/CMFCore/PortalFolder.py", line 300, in invokeFactory
    *args, **kw)
  File "/home/jenkins/.buildout/eggs/cp27m/Products.CMFCore-2.4.8-py2.7.egg/Products/CMFCore/TypesTool.py", line 809, in constructContent
    ob = info.constructInstance(container, id, *args, **kw)
  File "/home/jenkins/.buildout/eggs/cp27m/Products.CMFCore-2.4.8-py2.7.egg/Products/CMFCore/TypesTool.py", line 308, in constructInstance
    return self._constructInstance(container, id, *args, **kw)
  File "/home/jenkins/.buildout/eggs/cp27m/Products.CMFCore-2.4.8-py2.7.egg/Products/CMFCore/TypesTool.py", line 569, in _constructInstance
    notify(ObjectCreatedEvent(obj))
  File "/home/jenkins/.buildout/eggs/cp27m/zope.event-4.5.0-py2.7.egg/zope/event/__init__.py", line 32, in notify
    subscriber(event)
  File "/home/jenkins/.buildout/eggs/cp27m/zope.component-4.6.2-py2.7.egg/zope/component/event.py", line 27, in dispatch
    component_subscribers(event, None)
  File "/home/jenkins/.buildout/eggs/cp27m/zope.component-4.6.2-py2.7.egg/zope/component/_api.py", line 134, in subscribers
    return sitemanager.subscribers(objects, interface)
  File "/home/jenkins/.buildout/eggs/cp27m/zope.interface-5.2.0-py2.7-linux-x86_64.egg/zope/interface/registry.py", line 448, in subscribers
    return self.adapters.subscribers(objects, provided)
  File "/home/jenkins/.buildout/eggs/cp27m/zope.interface-5.2.0-py2.7-linux-x86_64.egg/zope/interface/adapter.py", line 619, in subscribers
    subscription(*objects)
  File "/home/jenkins/.buildout/eggs/cp27m/zope.component-4.6.2-py2.7.egg/zope/component/event.py", line 36, in objectEventNotify
    component_subscribers((event.object, event), None)
  File "/home/jenkins/.buildout/eggs/cp27m/zope.component-4.6.2-py2.7.egg/zope/component/_api.py", line 134, in subscribers
    return sitemanager.subscribers(objects, interface)
  File "/home/jenkins/.buildout/eggs/cp27m/zope.interface-5.2.0-py2.7-linux-x86_64.egg/zope/interface/registry.py", line 448, in subscribers
    return self.adapters.subscribers(objects, provided)
  File "/home/jenkins/.buildout/eggs/cp27m/zope.interface-5.2.0-py2.7-linux-x86_64.egg/zope/interface/adapter.py", line 619, in subscribers
    subscription(*objects)
  File "/home/jenkins/.buildout/eggs/cp27m/plone.app.contenttypes-2.2.1-py2.7.egg/plone/app/contenttypes/subscribers.py", line 16, in set_title_description
    datafield = obj.file
  File "/home/jenkins/.buildout/eggs/cp27m/plone.dexterity-2.10.0-py2.7.egg/plone/dexterity/content.py", line 411, in __getattr__
    raise AttributeError(name)


FAILED:  plone.app.portlets.tests.test_navigation_portlet.TestRenderer.testCreateNavTree

Error Message:
file

Stack Trace:
file

  File "/srv/python2.7/lib/python2.7/unittest/case.py", line 320, in run
    self.setUp()
  File "/home/jenkins/.buildout/eggs/cp27m/plone.app.portlets-4.4.6-py2.7.egg/plone/app/portlets/tests/base.py", line 22, in setUp
    self.afterSetUp()
  File "/home/jenkins/.buildout/eggs/cp27m/plone.app.portlets-4.4.6-py2.7.egg/plone/app/portlets/tests/test_navigation_portlet.py", line 96, in afterSetUp
    self.populateSite()
  File "/home/jenkins/.buildout/eggs/cp27m/plone.app.portlets-4.4.6-py2.7.egg/plone/app/portlets/tests/test_navigation_portlet.py", line 140, in populateSite
    folder2.invokeFactory('File', 'file21')
  File "/home/jenkins/.buildout/eggs/cp27m/plone.dexterity-2.10.0-py2.7.egg/plone/dexterity/content.py", line 833, in invokeFactory
    type_name, id, RESPONSE, *args, **kw
  File "/home/jenkins/.buildout/eggs/cp27m/Products.CMFCore-2.4.8-py2.7.egg/Products/CMFCore/PortalFolder.py", line 300, in invokeFactory
    *args, **kw)
  File "/home/jenkins/.buildout/eggs/cp27m/Products.CMFCore-2.4.8-py2.7.egg/Products/CMFCore/TypesTool.py", line 809, in constructContent
    ob = info.constructInstance(container, id, *args, **kw)
  File "/home/jenkins/.buildout/eggs/cp27m/Products.CMFCore-2.4.8-py2.7.egg/Products/CMFCore/TypesTool.py", line 308, in constructInstance
    return self._constructInstance(container, id, *args, **kw)
  File "/home/jenkins/.buildout/eggs/cp27m/Products.CMFCore-2.4.8-py2.7.egg/Products/CMFCore/TypesTool.py", line 569, in _constructInstance
    notify(ObjectCreatedEvent(obj))
  File "/home/jenkins/.buildout/eggs/cp27m/zope.event-4.5.0-py2.7.egg/zope/event/__init__.py", line 32, in notify
    subscriber(event)
  File "/home/jenkins/.buildout/eggs/cp27m/zope.component-4.6.2-py2.7.egg/zope/component/event.py", line 27, in dispatch
    component_subscribers(event, None)
  File "/home/jenkins/.buildout/eggs/cp27m/zope.component-4.6.2-py2.7.egg/zope/component/_api.py", line 134, in subscribers
    return sitemanager.subscribers(objects, interface)
  File "/home/jenkins/.buildout/eggs/cp27m/zope.interface-5.2.0-py2.7-linux-x86_64.egg/zope/interface/registry.py", line 448, in subscribers
    return self.adapters.subscribers(objects, provided)
  File "/home/jenkins/.buildout/eggs/cp27m/zope.interface-5.2.0-py2.7-linux-x86_64.egg/zope/interface/adapter.py", line 619, in subscribers
    subscription(*objects)
  File "/home/jenkins/.buildout/eggs/cp27m/zope.component-4.6.2-py2.7.egg/zope/component/event.py", line 36, in objectEventNotify
    component_subscribers((event.object, event), None)
  File "/home/jenkins/.buildout/eggs/cp27m/zope.component-4.6.2-py2.7.egg/zope/component/_api.py", line 134, in subscribers
    return sitemanager.subscribers(objects, interface)
  File "/home/jenkins/.buildout/eggs/cp27m/zope.interface-5.2.0-py2.7-linux-x86_64.egg/zope/interface/registry.py", line 448, in subscribers
    return self.adapters.subscribers(objects, provided)
  File "/home/jenkins/.buildout/eggs/cp27m/zope.interface-5.2.0-py2.7-linux-x86_64.egg/zope/interface/adapter.py", line 619, in subscribers
    subscription(*objects)
  File "/home/jenkins/.buildout/eggs/cp27m/plone.app.contenttypes-2.2.1-py2.7.egg/plone/app/contenttypes/subscribers.py", line 16, in set_title_description
    datafield = obj.file
  File "/home/jenkins/.buildout/eggs/cp27m/plone.dexterity-2.10.0-py2.7.egg/plone/dexterity/content.py", line 411, in __getattr__
    raise AttributeError(name)


FAILED:  plone.app.portlets.tests.test_navigation_portlet.TestRenderer.testCreateNavTreeCurrentItem

Error Message:
file

Stack Trace:
file

  File "/srv/python2.7/lib/python2.7/unittest/case.py", line 320, in run
    self.setUp()
  File "/home/jenkins/.buildout/eggs/cp27m/plone.app.portlets-4.4.6-py2.7.egg/plone/app/portlets/tests/base.py", line 22, in setUp
    self.afterSetUp()
  File "/home/jenkins/.buildout/eggs/cp27m/plone.app.portlets-4.4.6-py2.7.egg/plone/app/portlets/tests/test_navigation_portlet.py", line 96, in afterSetUp
    self.populateSite()
  File "/home/jenkins/.buildout/eggs/cp27m/plone.app.portlets-4.4.6-py2.7.egg/plone/app/portlets/tests/test_navigation_portlet.py", line 140, in populateSite
    folder2.invokeFactory('File', 'file21')
  File "/home/jenkins/.buildout/eggs/cp27m/plone.dexterity-2.10.0-py2.7.egg/plone/dexterity/content.py", line 833, in invokeFactory
    type_name, id, RESPONSE, *args, **kw
  File "/home/jenkins/.buildout/eggs/cp27m/Products.CMFCore-2.4.8-py2.7.egg/Products/CMFCore/PortalFolder.py", line 300, in invokeFactory
    *args, **kw)
  File "/home/jenkins/.buildout/eggs/cp27m/Products.CMFCore-2.4.8-py2.7.egg/Products/CMFCore/TypesTool.py", line 809, in constructContent
    ob = info.constructInstance(container, id, *args, **kw)
  File "/home/jenkins/.buildout/eggs/cp27m/Products.CMFCore-2.4.8-py2.7.egg/Products/CMFCore/TypesTool.py", line 308, in constructInstance
    return self._constructInstance(container, id, *args, **kw)
  File "/home/jenkins/.buildout/eggs/cp27m/Products.CMFCore-2.4.8-py2.7.egg/Products/CMFCore/TypesTool.py", line 569, in _constructInstance
    notify(ObjectCreatedEvent(obj))
  File "/home/jenkins/.buildout/eggs/cp27m/zope.event-4.5.0-py2.7.egg/zope/event/__init__.py", line 32, in notify
    subscriber(event)
  File "/home/jenkins/.buildout/eggs/cp27m/zope.component-4.6.2-py2.7.egg/zope/component/event.py", line 27, in dispatch
    component_subscribers(event, None)
  File "/home/jenkins/.buildout/eggs/cp27m/zope.component-4.6.2-py2.7.egg/zope/component/_api.py", line 134, in subscribers
    return sitemanager.subscribers(objects, interface)
  File "/home/jenkins/.buildout/eggs/cp27m/zope.interface-5.2.0-py2.7-linux-x86_64.egg/zope/interface/registry.py", line 448, in subscribers
    return self.adapters.subscribers(objects, provided)
  File "/home/jenkins/.buildout/eggs/cp27m/zope.interface-5.2.0-py2.7-linux-x86_64.egg/zope/interface/adapter.py", line 619, in subscribers
    subscription(*objects)
  File "/home/jenkins/.buildout/eggs/cp27m/zope.component-4.6.2-py2.7.egg/zope/component/event.py", line 36, in objectEventNotify
    component_subscribers((event.object, event), None)
  File "/home/jenkins/.buildout/eggs/cp27m/zope.component-4.6.2-py2.7.egg/zope/component/_api.py", line 134, in subscribers
    return sitemanager.subscribers(objects, interface)
  File "/home/jenkins/.buildout/eggs/cp27m/zope.interface-5.2.0-py2.7-linux-x86_64.egg/zope/interface/registry.py", line 448, in subscribers
    return self.adapters.subscribers(objects, provided)
  File "/home/jenkins/.buildout/eggs/cp27m/zope.interface-5.2.0-py2.7-linux-x86_64.egg/zope/interface/adapter.py", line 619, in subscribers
    subscription(*objects)
  File "/home/jenkins/.buildout/eggs/cp27m/plone.app.contenttypes-2.2.1-py2.7.egg/plone/app/contenttypes/subscribers.py", line 16, in set_title_description
    datafield = obj.file
  File "/home/jenkins/.buildout/eggs/cp27m/plone.dexterity-2.10.0-py2.7.egg/plone/dexterity/content.py", line 411, in __getattr__
    raise AttributeError(name)


FAILED:  plone.app.portlets.tests.test_navigation_portlet.TestRenderer.testCreateNavTreeWithLink

Error Message:
file

Stack Trace:
file

  File "/srv/python2.7/lib/python2.7/unittest/case.py", line 320, in run
    self.setUp()
  File "/home/jenkins/.buildout/eggs/cp27m/plone.app.portlets-4.4.6-py2.7.egg/plone/app/portlets/tests/base.py", line 22, in setUp
    self.afterSetUp()
  File "/home/jenkins/.buildout/eggs/cp27m/plone.app.portlets-4.4.6-py2.7.egg/plone/app/portlets/tests/test_navigation_portlet.py", line 96, in afterSetUp
    self.populateSite()
  File "/home/jenkins/.buildout/eggs/cp27m/plone.app.portlets-4.4.6-py2.7.egg/plone/app/portlets/tests/test_navigation_portlet.py", line 140, in populateSite
    folder2.invokeFactory('File', 'file21')
  File "/home/jenkins/.buildout/eggs/cp27m/plone.dexterity-2.10.0-py2.7.egg/plone/dexterity/content.py", line 833, in invokeFactory
    type_name, id, RESPONSE, *args, **kw
  File "/home/jenkins/.buildout/eggs/cp27m/Products.CMFCore-2.4.8-py2.7.egg/Products/CMFCore/PortalFolder.py", line 300, in invokeFactory
    *args, **kw)
  File "/home/jenkins/.buildout/eggs/cp27m/Products.CMFCore-2.4.8-py2.7.egg/Products/CMFCore/TypesTool.py", line 809, in constructContent
    ob = info.constructInstance(container, id, *args, **kw)
  File "/home/jenkins/.buildout/eggs/cp27m/Products.CMFCore-2.4.8-py2.7.egg/Products/CMFCore/TypesTool.py", line 308, in constructInstance
    return self._constructInstance(container, id, *args, **kw)
  File "/home/jenkins/.buildout/eggs/cp27m/Products.CMFCore-2.4.8-py2.7.egg/Products/CMFCore/TypesTool.py", line 569, in _constructInstance
    notify(ObjectCreatedEvent(obj))
  File "/home/jenkins/.buildout/eggs/cp27m/zope.event-4.5.0-py2.7.egg/zope/event/__init__.py", line 32, in notify
    subscriber(event)
  File "/home/jenkins/.buildout/eggs/cp27m/zope.component-4.6.2-py2.7.egg/zope/component/event.py", line 27, in dispatch
    component_subscribers(event, None)
  File "/home/jenkins/.buildout/eggs/cp27m/zope.component-4.6.2-py2.7.egg/zope/component/_api.py", line 134, in subscribers
    return sitemanager.subscribers(objects, interface)
  File "/home/jenkins/.buildout/eggs/cp27m/zope.interface-5.2.0-py2.7-linux-x86_64.egg/zope/interface/registry.py", line 448, in subscribers
    return self.adapters.subscribers(objects, provided)
  File "/home/jenkins/.buildout/eggs/cp27m/zope.interface-5.2.0-py2.7-linux-x86_64.egg/zope/interface/adapter.py", line 619, in subscribers
    subscription(*objects)
  File "/home/jenkins/.buildout/eggs/cp27m/zope.component-4.6.2-py2.7.egg/zope/component/event.py", line 36, in objectEventNotify
    component_subscribers((event.object, event), None)
  File "/home/jenkins/.buildout/eggs/cp27m/zope.component-4.6.2-py2.7.egg/zope/component/_api.py", line 134, in subscribers
    return sitemanager.subscribers(objects, interface)
  File "/home/jenkins/.buildout/eggs/cp27m/zope.interface-5.2.0-py2.7-linux-x86_64.egg/zope/interface/registry.py", line 448, in subscribers
    return self.adapters.subscribers(objects, provided)
  File "/home/jenkins/.buildout/eggs/cp27m/zope.interface-5.2.0-py2.7-linux-x86_64.egg/zope/interface/adapter.py", line 619, in subscribers
    subscription(*objects)
  File "/home/jenkins/.buildout/eggs/cp27m/plone.app.contenttypes-2.2.1-py2.7.egg/plone/app/contenttypes/subscribers.py", line 16, in set_title_description
    datafield = obj.file
  File "/home/jenkins/.buildout/eggs/cp27m/plone.dexterity-2.10.0-py2.7.egg/plone/dexterity/content.py", line 411, in __getattr__
    raise AttributeError(name)


FAILED:  plone.app.portlets.tests.test_navigation_portlet.TestRenderer.testCustomQuery

Error Message:
file

Stack Trace:
file

  File "/srv/python2.7/lib/python2.7/unittest/case.py", line 320, in run
    self.setUp()
  File "/home/jenkins/.buildout/eggs/cp27m/plone.app.portlets-4.4.6-py2.7.egg/plone/app/portlets/tests/base.py", line 22, in setUp
    self.afterSetUp()
  File "/home/jenkins/.buildout/eggs/cp27m/plone.app.portlets-4.4.6-py2.7.egg/plone/app/portlets/tests/test_navigation_portlet.py", line 96, in afterSetUp
    self.populateSite()
  File "/home/jenkins/.buildout/eggs/cp27m/plone.app.portlets-4.4.6-py2.7.egg/plone/app/portlets/tests/test_navigation_portlet.py", line 140, in populateSite
    folder2.invokeFactory('File', 'file21')
  File "/home/jenkins/.buildout/eggs/cp27m/plone.dexterity-2.10.0-py2.7.egg/plone/dexterity/content.py", line 833, in invokeFactory
    type_name, id, RESPONSE, *args, **kw
  File "/home/jenkins/.buildout/eggs/cp27m/Products.CMFCore-2.4.8-py2.7.egg/Products/CMFCore/PortalFolder.py", line 300, in invokeFactory
    *args, **kw)
  File "/home/jenkins/.buildout/eggs/cp27m/Products.CMFCore-2.4.8-py2.7.egg/Products/CMFCore/TypesTool.py", line 809, in constructContent
    ob = info.constructInstance(container, id, *args, **kw)
  File "/home/jenkins/.buildout/eggs/cp27m/Products.CMFCore-2.4.8-py2.7.egg/Products/CMFCore/TypesTool.py", line 308, in constructInstance
    return self._constructInstance(container, id, *args, **kw)
  File "/home/jenkins/.buildout/eggs/cp27m/Products.CMFCore-2.4.8-py2.7.egg/Products/CMFCore/TypesTool.py", line 569, in _constructInstance
    notify(ObjectCreatedEvent(obj))
  File "/home/jenkins/.buildout/eggs/cp27m/zope.event-4.5.0-py2.7.egg/zope/event/__init__.py", line 32, in notify
    subscriber(event)
  File "/home/jenkins/.buildout/eggs/cp27m/zope.component-4.6.2-py2.7.egg/zope/component/event.py", line 27, in dispatch
    component_subscribers(event, None)
  File "/home/jenkins/.buildout/eggs/cp27m/zope.component-4.6.2-py2.7.egg/zope/component/_api.py", line 134, in subscribers
    return sitemanager.subscribers(objects, interface)
  File "/home/jenkins/.buildout/eggs/cp27m/zope.interface-5.2.0-py2.7-linux-x86_64.egg/zope/interface/registry.py", line 448, in subscribers
    return self.adapters.subscribers(objects, provided)
  File "/home/jenkins/.buildout/eggs/cp27m/zope.interface-5.2.0-py2.7-linux-x86_64.egg/zope/interface/adapter.py", line 619, in subscribers
    subscription(*objects)
  File "/home/jenkins/.buildout/eggs/cp27m/zope.component-4.6.2-py2.7.egg/zope/component/event.py", line 36, in objectEventNotify
    component_subscribers((event.object, event), None)
  File "/home/jenkins/.buildout/eggs/cp27m/zope.component-4.6.2-py2.7.egg/zope/component/_api.py", line 134, in subscribers
    return sitemanager.subscribers(objects, interface)
  File "/home/jenkins/.buildout/eggs/cp27m/zope.interface-5.2.0-py2.7-linux-x86_64.egg/zope/interface/registry.py", line 448, in subscribers
    return self.adapters.subscribers(objects, provided)
  File "/home/jenkins/.buildout/eggs/cp27m/zope.interface-5.2.0-py2.7-linux-x86_64.egg/zope/interface/adapter.py", line 619, in subscribers
    subscription(*objects)
  File "/home/jenkins/.buildout/eggs/cp27m/plone.app.contenttypes-2.2.1-py2.7.egg/plone/app/contenttypes/subscribers.py", line 16, in set_title_description
    datafield = obj.file
  File "/home/jenkins/.buildout/eggs/cp27m/plone.dexterity-2.10.0-py2.7.egg/plone/dexterity/content.py", line 411, in __getattr__
    raise AttributeError(name)


FAILED:  plone.app.portlets.tests.test_navigation_portlet.TestRenderer.testHeadingLinkRooted

Error Message:
file

Stack Trace:
file

  File "/srv/python2.7/lib/python2.7/unittest/case.py", line 320, in run
    self.setUp()
  File "/home/jenkins/.buildout/eggs/cp27m/plone.app.portlets-4.4.6-py2.7.egg/plone/app/portlets/tests/base.py", line 22, in setUp
    self.afterSetUp()
  File "/home/jenkins/.buildout/eggs/cp27m/plone.app.portlets-4.4.6-py2.7.egg/plone/app/portlets/tests/test_navigation_portlet.py", line 96, in afterSetUp
    self.populateSite()
  File "/home/jenkins/.buildout/eggs/cp27m/plone.app.portlets-4.4.6-py2.7.egg/plone/app/portlets/tests/test_navigation_portlet.py", line 140, in populateSite
    folder2.invokeFactory('File', 'file21')
  File "/home/jenkins/.buildout/eggs/cp27m/plone.dexterity-2.10.0-py2.7.egg/plone/dexterity/content.py", line 833, in invokeFactory
    type_name, id, RESPONSE, *args, **kw
  File "/home/jenkins/.buildout/eggs/cp27m/Products.CMFCore-2.4.8-py2.7.egg/Products/CMFCore/PortalFolder.py", line 300, in invokeFactory
    *args, **kw)
  File "/home/jenkins/.buildout/eggs/cp27m/Products.CMFCore-2.4.8-py2.7.egg/Products/CMFCore/TypesTool.py", line 809, in constructContent
    ob = info.constructInstance(container, id, *args, **kw)
  File "/home/jenkins/.buildout/eggs/cp27m/Products.CMFCore-2.4.8-py2.7.egg/Products/CMFCore/TypesTool.py", line 308, in constructInstance
    return self._constructInstance(container, id, *args, **kw)
  File "/home/jenkins/.buildout/eggs/cp27m/Products.CMFCore-2.4.8-py2.7.egg/Products/CMFCore/TypesTool.py", line 569, in _constructInstance
    notify(ObjectCreatedEvent(obj))
  File "/home/jenkins/.buildout/eggs/cp27m/zope.event-4.5.0-py2.7.egg/zope/event/__init__.py", line 32, in notify
    subscriber(event)
  File "/home/jenkins/.buildout/eggs/cp27m/zope.component-4.6.2-py2.7.egg/zope/component/event.py", line 27, in dispatch
    component_subscribers(event, None)
  File "/home/jenkins/.buildout/eggs/cp27m/zope.component-4.6.2-py2.7.egg/zope/component/_api.py", line 134, in subscribers
    return sitemanager.subscribers(objects, interface)
  File "/home/jenkins/.buildout/eggs/cp27m/zope.interface-5.2.0-py2.7-linux-x86_64.egg/zope/interface/registry.py", line 448, in subscribers
    return self.adapters.subscribers(objects, provided)
  File "/home/jenkins/.buildout/eggs/cp27m/zope.interface-5.2.0-py2.7-linux-x86_64.egg/zope/interface/adapter.py", line 619, in subscribers
    subscription(*objects)
  File "/home/jenkins/.buildout/eggs/cp27m/zope.component-4.6.2-py2.7.egg/zope/component/event.py", line 36, in objectEventNotify
    component_subscribers((event.object, event), None)
  File "/home/jenkins/.buildout/eggs/cp27m/zope.component-4.6.2-py2.7.egg/zope/component/_api.py", line 134, in subscribers
    return sitemanager.subscribers(objects, interface)
  File "/home/jenkins/.buildout/eggs/cp27m/zope.interface-5.2.0-py2.7-linux-x86_64.egg/zope/interface/registry.py", line 448, in subscribers
    return self.adapters.subscribers(objects, provided)
  File "/home/jenkins/.buildout/eggs/cp27m/zope.interface-5.2.0-py2.7-linux-x86_64.egg/zope/interface/adapter.py", line 619, in subscribers
    subscription(*objects)
  File "/home/jenkins/.buildout/eggs/cp27m/plone.app.contenttypes-2.2.1-py2.7.egg/plone/app/contenttypes/subscribers.py", line 16, in set_title_description
    datafield = obj.file
  File "/home/jenkins/.buildout/eggs/cp27m/plone.dexterity-2.10.0-py2.7.egg/plone/dexterity/content.py", line 411, in __getattr__
    raise AttributeError(name)


FAILED:  plone.app.portlets.tests.test_navigation_portlet.TestRenderer.testHeadingLinkRootedItemGone

Error Message:
file

Stack Trace:
file

  File "/srv/python2.7/lib/python2.7/unittest/case.py", line 320, in run
    self.setUp()
  File "/home/jenkins/.buildout/eggs/cp27m/plone.app.portlets-4.4.6-py2.7.egg/plone/app/portlets/tests/base.py", line 22, in setUp
    self.afterSetUp()
  File "/home/jenkins/.buildout/eggs/cp27m/plone.app.portlets-4.4.6-py2.7.egg/plone/app/portlets/tests/test_navigation_portlet.py", line 96, in afterSetUp
    self.populateSite()
  File "/home/jenkins/.buildout/eggs/cp27m/plone.app.portlets-4.4.6-py2.7.egg/plone/app/portlets/tests/test_navigation_portlet.py", line 140, in populateSite
    folder2.invokeFactory('File', 'file21')
  File "/home/jenkins/.buildout/eggs/cp27m/plone.dexterity-2.10.0-py2.7.egg/plone/dexterity/content.py", line 833, in invokeFactory
    type_name, id, RESPONSE, *args, **kw
  File "/home/jenkins/.buildout/eggs/cp27m/Products.CMFCore-2.4.8-py2.7.egg/Products/CMFCore/PortalFolder.py", line 300, in invokeFactory
    *args, **kw)
  File "/home/jenkins/.buildout/eggs/cp27m/Products.CMFCore-2.4.8-py2.7.egg/Products/CMFCore/TypesTool.py", line 809, in constructContent
    ob = info.constructInstance(container, id, *args, **kw)
  File "/home/jenkins/.buildout/eggs/cp27m/Products.CMFCore-2.4.8-py2.7.egg/Products/CMFCore/TypesTool.py", line 308, in constructInstance
    return self._constructInstance(container, id, *args, **kw)
  File "/home/jenkins/.buildout/eggs/cp27m/Products.CMFCore-2.4.8-py2.7.egg/Products/CMFCore/TypesTool.py", line 569, in _constructInstance
    notify(ObjectCreatedEvent(obj))
  File "/home/jenkins/.buildout/eggs/cp27m/zope.event-4.5.0-py2.7.egg/zope/event/__init__.py", line 32, in notify
    subscriber(event)
  File "/home/jenkins/.buildout/eggs/cp27m/zope.component-4.6.2-py2.7.egg/zope/component/event.py", line 27, in dispatch
    component_subscribers(event, None)
  File "/home/jenkins/.buildout/eggs/cp27m/zope.component-4.6.2-py2.7.egg/zope/component/_api.py", line 134, in subscribers
    return sitemanager.subscribers(objects, interface)
  File "/home/jenkins/.buildout/eggs/cp27m/zope.interface-5.2.0-py2.7-linux-x86_64.egg/zope/interface/registry.py", line 448, in subscribers
    return self.adapters.subscribers(objects, provided)
  File "/home/jenkins/.buildout/eggs/cp27m/zope.interface-5.2.0-py2.7-linux-x86_64.egg/zope/interface/adapter.py", line 619, in subscribers
    subscription(*objects)
  File "/home/jenkins/.buildout/eggs/cp27m/zope.component-4.6.2-py2.7.egg/zope/component/event.py", line 36, in objectEventNotify
    component_subscribers((event.object, event), None)
  File "/home/jenkins/.buildout/eggs/cp27m/zope.component-4.6.2-py2.7.egg/zope/component/_api.py", line 134, in subscribers
    return sitemanager.subscribers(objects, interface)
  File "/home/jenkins/.buildout/eggs/cp27m/zope.interface-5.2.0-py2.7-linux-x86_64.egg/zope/interface/registry.py", line 448, in subscribers
    return self.adapters.subscribers(objects, provided)
  File "/home/jenkins/.buildout/eggs/cp27m/zope.interface-5.2.0-py2.7-linux-x86_64.egg/zope/interface/adapter.py", line 619, in subscribers
    subscription(*objects)
  File "/home/jenkins/.buildout/eggs/cp27m/plone.app.contenttypes-2.2.1-py2.7.egg/plone/app/contenttypes/subscribers.py", line 16, in set_title_description
    datafield = obj.file
  File "/home/jenkins/.buildout/eggs/cp27m/plone.dexterity-2.10.0-py2.7.egg/plone/dexterity/content.py", line 411, in __getattr__
    raise AttributeError(name)


FAILED:  plone.app.portlets.tests.test_navigation_portlet.TestRenderer.testHeadingLinkRootless

Error Message:
file

Stack Trace:
file

  File "/srv/python2.7/lib/python2.7/unittest/case.py", line 320, in run
    self.setUp()
  File "/home/jenkins/.buildout/eggs/cp27m/plone.app.portlets-4.4.6-py2.7.egg/plone/app/portlets/tests/base.py", line 22, in setUp
    self.afterSetUp()
  File "/home/jenkins/.buildout/eggs/cp27m/plone.app.portlets-4.4.6-py2.7.egg/plone/app/portlets/tests/test_navigation_portlet.py", line 96, in afterSetUp
    self.populateSite()
  File "/home/jenkins/.buildout/eggs/cp27m/plone.app.portlets-4.4.6-py2.7.egg/plone/app/portlets/tests/test_navigation_portlet.py", line 140, in populateSite
    folder2.invokeFactory('File', 'file21')
  File "/home/jenkins/.buildout/eggs/cp27m/plone.dexterity-2.10.0-py2.7.egg/plone/dexterity/content.py", line 833, in invokeFactory
    type_name, id, RESPONSE, *args, **kw
  File "/home/jenkins/.buildout/eggs/cp27m/Products.CMFCore-2.4.8-py2.7.egg/Products/CMFCore/PortalFolder.py", line 300, in invokeFactory
    *args, **kw)
  File "/home/jenkins/.buildout/eggs/cp27m/Products.CMFCore-2.4.8-py2.7.egg/Products/CMFCore/TypesTool.py", line 809, in constructContent
    ob = info.constructInstance(container, id, *args, **kw)
  File "/home/jenkins/.buildout/eggs/cp27m/Products.CMFCore-2.4.8-py2.7.egg/Products/CMFCore/TypesTool.py", line 308, in constructInstance
    return self._constructInstance(container, id, *args, **kw)
  File "/home/jenkins/.buildout/eggs/cp27m/Products.CMFCore-2.4.8-py2.7.egg/Products/CMFCore/TypesTool.py", line 569, in _constructInstance
    notify(ObjectCreatedEvent(obj))
  File "/home/jenkins/.buildout/eggs/cp27m/zope.event-4.5.0-py2.7.egg/zope/event/__init__.py", line 32, in notify
    subscriber(event)
  File "/home/jenkins/.buildout/eggs/cp27m/zope.component-4.6.2-py2.7.egg/zope/component/event.py", line 27, in dispatch
    component_subscribers(event, None)
  File "/home/jenkins/.buildout/eggs/cp27m/zope.component-4.6.2-py2.7.egg/zope/component/_api.py", line 134, in subscribers
    return sitemanager.subscribers(objects, interface)
  File "/home/jenkins/.buildout/eggs/cp27m/zope.interface-5.2.0-py2.7-linux-x86_64.egg/zope/interface/registry.py", line 448, in subscribers
    return self.adapters.subscribers(objects, provided)
  File "/home/jenkins/.buildout/eggs/cp27m/zope.interface-5.2.0-py2.7-linux-x86_64.egg/zope/interface/adapter.py", line 619, in subscribers
    subscription(*objects)
  File "/home/jenkins/.buildout/eggs/cp27m/zope.component-4.6.2-py2.7.egg/zope/component/event.py", line 36, in objectEventNotify
    component_subscribers((event.object, event), None)
  File "/home/jenkins/.buildout/eggs/cp27m/zope.component-4.6.2-py2.7.egg/zope/component/_api.py", line 134, in subscribers
    return sitemanager.subscribers(objects, interface)
  File "/home/jenkins/.buildout/eggs/cp27m/zope.interface-5.2.0-py2.7-linux-x86_64.egg/zope/interface/registry.py", line 448, in subscribers
    return self.adapters.subscribers(objects, provided)
  File "/home/jenkins/.buildout/eggs/cp27m/zope.interface-5.2.0-py2.7-linux-x86_64.egg/zope/interface/adapter.py", line 619, in subscribers
    subscription(*objects)
  File "/home/jenkins/.buildout/eggs/cp27m/plone.app.contenttypes-2.2.1-py2.7.egg/plone/app/contenttypes/subscribers.py", line 16, in set_title_description
    datafield = obj.file
  File "/home/jenkins/.buildout/eggs/cp27m/plone.dexterity-2.10.0-py2.7.egg/plone/dexterity/content.py", line 411, in __getattr__
    raise AttributeError(name)


FAILED:  plone.app.portlets.tests.test_navigation_portlet.TestRenderer.testINavigationRootWithRelativeRootSet

Error Message:
file

Stack Trace:
file

  File "/srv/python2.7/lib/python2.7/unittest/case.py", line 320, in run
    self.setUp()
  File "/home/jenkins/.buildout/eggs/cp27m/plone.app.portlets-4.4.6-py2.7.egg/plone/app/portlets/tests/base.py", line 22, in setUp
    self.afterSetUp()
  File "/home/jenkins/.buildout/eggs/cp27m/plone.app.portlets-4.4.6-py2.7.egg/plone/app/portlets/tests/test_navigation_portlet.py", line 96, in afterSetUp
    self.populateSite()
  File "/home/jenkins/.buildout/eggs/cp27m/plone.app.portlets-4.4.6-py2.7.egg/plone/app/portlets/tests/test_navigation_portlet.py", line 140, in populateSite
    folder2.invokeFactory('File', 'file21')
  File "/home/jenkins/.buildout/eggs/cp27m/plone.dexterity-2.10.0-py2.7.egg/plone/dexterity/content.py", line 833, in invokeFactory
    type_name, id, RESPONSE, *args, **kw
  File "/home/jenkins/.buildout/eggs/cp27m/Products.CMFCore-2.4.8-py2.7.egg/Products/CMFCore/PortalFolder.py", line 300, in invokeFactory
    *args, **kw)
  File "/home/jenkins/.buildout/eggs/cp27m/Products.CMFCore-2.4.8-py2.7.egg/Products/CMFCore/TypesTool.py", line 809, in constructContent
    ob = info.constructInstance(container, id, *args, **kw)
  File "/home/jenkins/.buildout/eggs/cp27m/Products.CMFCore-2.4.8-py2.7.egg/Products/CMFCore/TypesTool.py", line 308, in constructInstance
    return self._constructInstance(container, id, *args, **kw)
  File "/home/jenkins/.buildout/eggs/cp27m/Products.CMFCore-2.4.8-py2.7.egg/Products/CMFCore/TypesTool.py", line 569, in _constructInstance
    notify(ObjectCreatedEvent(obj))
  File "/home/jenkins/.buildout/eggs/cp27m/zope.event-4.5.0-py2.7.egg/zope/event/__init__.py", line 32, in notify
    subscriber(event)
  File "/home/jenkins/.buildout/eggs/cp27m/zope.component-4.6.2-py2.7.egg/zope/component/event.py", line 27, in dispatch
    component_subscribers(event, None)
  File "/home/jenkins/.buildout/eggs/cp27m/zope.component-4.6.2-py2.7.egg/zope/component/_api.py", line 134, in subscribers
    return sitemanager.subscribers(objects, interface)
  File "/home/jenkins/.buildout/eggs/cp27m/zope.interface-5.2.0-py2.7-linux-x86_64.egg/zope/interface/registry.py", line 448, in subscribers
    return self.adapters.subscribers(objects, provided)
  File "/home/jenkins/.buildout/eggs/cp27m/zope.interface-5.2.0-py2.7-linux-x86_64.egg/zope/interface/adapter.py", line 619, in subscribers
    subscription(*objects)
  File "/home/jenkins/.buildout/eggs/cp27m/zope.component-4.6.2-py2.7.egg/zope/component/event.py", line 36, in objectEventNotify
    component_subscribers((event.object, event), None)
  File "/home/jenkins/.buildout/eggs/cp27m/zope.component-4.6.2-py2.7.egg/zope/component/_api.py", line 134, in subscribers
    return sitemanager.subscribers(objects, interface)
  File "/home/jenkins/.buildout/eggs/cp27m/zope.interface-5.2.0-py2.7-linux-x86_64.egg/zope/interface/registry.py", line 448, in subscribers
    return self.adapters.subscribers(objects, provided)
  File "/home/jenkins/.buildout/eggs/cp27m/zope.interface-5.2.0-py2.7-linux-x86_64.egg/zope/interface/adapter.py", line 619, in subscribers
    subscription(*objects)
  File "/home/jenkins/.buildout/eggs/cp27m/plone.app.contenttypes-2.2.1-py2.7.egg/plone/app/contenttypes/subscribers.py", line 16, in set_title_description
    datafield = obj.file
  File "/home/jenkins/.buildout/eggs/cp27m/plone.dexterity-2.10.0-py2.7.egg/plone/dexterity/content.py", line 411, in __getattr__
    raise AttributeError(name)


FAILED:  plone.app.portlets.tests.test_navigation_portlet.TestRenderer.testIncludeTopWithoutNavigationRoot

Error Message:
file

Stack Trace:
file

  File "/srv/python2.7/lib/python2.7/unittest/case.py", line 320, in run
    self.setUp()
  File "/home/jenkins/.buildout/eggs/cp27m/plone.app.portlets-4.4.6-py2.7.egg/plone/app/portlets/tests/base.py", line 22, in setUp
    self.afterSetUp()
  File "/home/jenkins/.buildout/eggs/cp27m/plone.app.portlets-4.4.6-py2.7.egg/plone/app/portlets/tests/test_navigation_portlet.py", line 96, in afterSetUp
    self.populateSite()
  File "/home/jenkins/.buildout/eggs/cp27m/plone.app.portlets-4.4.6-py2.7.egg/plone/app/portlets/tests/test_navigation_portlet.py", line 140, in populateSite
    folder2.invokeFactory('File', 'file21')
  File "/home/jenkins/.buildout/eggs/cp27m/plone.dexterity-2.10.0-py2.7.egg/plone/dexterity/content.py", line 833, in invokeFactory
    type_name, id, RESPONSE, *args, **kw
  File "/home/jenkins/.buildout/eggs/cp27m/Products.CMFCore-2.4.8-py2.7.egg/Products/CMFCore/PortalFolder.py", line 300, in invokeFactory
    *args, **kw)
  File "/home/jenkins/.buildout/eggs/cp27m/Products.CMFCore-2.4.8-py2.7.egg/Products/CMFCore/TypesTool.py", line 809, in constructContent
    ob = info.constructInstance(container, id, *args, **kw)
  File "/home/jenkins/.buildout/eggs/cp27m/Products.CMFCore-2.4.8-py2.7.egg/Products/CMFCore/TypesTool.py", line 308, in constructInstance
    return self._constructInstance(container, id, *args, **kw)
  File "/home/jenkins/.buildout/eggs/cp27m/Products.CMFCore-2.4.8-py2.7.egg/Products/CMFCore/TypesTool.py", line 569, in _constructInstance
    notify(ObjectCreatedEvent(obj))
  File "/home/jenkins/.buildout/eggs/cp27m/zope.event-4.5.0-py2.7.egg/zope/event/__init__.py", line 32, in notify
    subscriber(event)
  File "/home/jenkins/.buildout/eggs/cp27m/zope.component-4.6.2-py2.7.egg/zope/component/event.py", line 27, in dispatch
    component_subscribers(event, None)
  File "/home/jenkins/.buildout/eggs/cp27m/zope.component-4.6.2-py2.7.egg/zope/component/_api.py", line 134, in subscribers
    return sitemanager.subscribers(objects, interface)
  File "/home/jenkins/.buildout/eggs/cp27m/zope.interface-5.2.0-py2.7-linux-x86_64.egg/zope/interface/registry.py", line 448, in subscribers
    return self.adapters.subscribers(objects, provided)
  File "/home/jenkins/.buildout/eggs/cp27m/zope.interface-5.2.0-py2.7-linux-x86_64.egg/zope/interface/adapter.py", line 619, in subscribers
    subscription(*objects)
  File "/home/jenkins/.buildout/eggs/cp27m/zope.component-4.6.2-py2.7.egg/zope/component/event.py", line 36, in objectEventNotify
    component_subscribers((event.object, event), None)
  File "/home/jenkins/.buildout/eggs/cp27m/zope.component-4.6.2-py2.7.egg/zope/component/_api.py", line 134, in subscribers
    return sitemanager.subscribers(objects, interface)
  File "/home/jenkins/.buildout/eggs/cp27m/zope.interface-5.2.0-py2.7-linux-x86_64.egg/zope/interface/registry.py", line 448, in subscribers
    return self.adapters.subscribers(objects, provided)
  File "/home/jenkins/.buildout/eggs/cp27m/zope.interface-5.2.0-py2.7-linux-x86_64.egg/zope/interface/adapter.py", line 619, in subscribers
    subscription(*objects)
  File "/home/jenkins/.buildout/eggs/cp27m/plone.app.contenttypes-2.2.1-py2.7.egg/plone/app/contenttypes/subscribers.py", line 16, in set_title_description
    datafield = obj.file
  File "/home/jenkins/.buildout/eggs/cp27m/plone.dexterity-2.10.0-py2.7.egg/plone/dexterity/content.py", line 411, in __getattr__
    raise AttributeError(name)


FAILED:  plone.app.portlets.tests.test_navigation_portlet.TestRenderer.testIsCurrentParentWithOverlapingNames

Error Message:
file

Stack Trace:
file

  File "/srv/python2.7/lib/python2.7/unittest/case.py", line 320, in run
    self.setUp()
  File "/home/jenkins/.buildout/eggs/cp27m/plone.app.portlets-4.4.6-py2.7.egg/plone/app/portlets/tests/base.py", line 22, in setUp
    self.afterSetUp()
  File "/home/jenkins/.buildout/eggs/cp27m/plone.app.portlets-4.4.6-py2.7.egg/plone/app/portlets/tests/test_navigation_portlet.py", line 96, in afterSetUp
    self.populateSite()
  File "/home/jenkins/.buildout/eggs/cp27m/plone.app.portlets-4.4.6-py2.7.egg/plone/app/portlets/tests/test_navigation_portlet.py", line 140, in populateSite
    folder2.invokeFactory('File', 'file21')
  File "/home/jenkins/.buildout/eggs/cp27m/plone.dexterity-2.10.0-py2.7.egg/plone/dexterity/content.py", line 833, in invokeFactory
    type_name, id, RESPONSE, *args, **kw
  File "/home/jenkins/.buildout/eggs/cp27m/Products.CMFCore-2.4.8-py2.7.egg/Products/CMFCore/PortalFolder.py", line 300, in invokeFactory
    *args, **kw)
  File "/home/jenkins/.buildout/eggs/cp27m/Products.CMFCore-2.4.8-py2.7.egg/Products/CMFCore/TypesTool.py", line 809, in constructContent
    ob = info.constructInstance(container, id, *args, **kw)
  File "/home/jenkins/.buildout/eggs/cp27m/Products.CMFCore-2.4.8-py2.7.egg/Products/CMFCore/TypesTool.py", line 308, in constructInstance
    return self._constructInstance(container, id, *args, **kw)
  File "/home/jenkins/.buildout/eggs/cp27m/Products.CMFCore-2.4.8-py2.7.egg/Products/CMFCore/TypesTool.py", line 569, in _constructInstance
    notify(ObjectCreatedEvent(obj))
  File "/home/jenkins/.buildout/eggs/cp27m/zope.event-4.5.0-py2.7.egg/zope/event/__init__.py", line 32, in notify
    subscriber(event)
  File "/home/jenkins/.buildout/eggs/cp27m/zope.component-4.6.2-py2.7.egg/zope/component/event.py", line 27, in dispatch
    component_subscribers(event, None)
  File "/home/jenkins/.buildout/eggs/cp27m/zope.component-4.6.2-py2.7.egg/zope/component/_api.py", line 134, in subscribers
    return sitemanager.subscribers(objects, interface)
  File "/home/jenkins/.buildout/eggs/cp27m/zope.interface-5.2.0-py2.7-linux-x86_64.egg/zope/interface/registry.py", line 448, in subscribers
    return self.adapters.subscribers(objects, provided)
  File "/home/jenkins/.buildout/eggs/cp27m/zope.interface-5.2.0-py2.7-linux-x86_64.egg/zope/interface/adapter.py", line 619, in subscribers
    subscription(*objects)
  File "/home/jenkins/.buildout/eggs/cp27m/zope.component-4.6.2-py2.7.egg/zope/component/event.py", line 36, in objectEventNotify
    component_subscribers((event.object, event), None)
  File "/home/jenkins/.buildout/eggs/cp27m/zope.component-4.6.2-py2.7.egg/zope/component/_api.py", line 134, in subscribers
    return sitemanager.subscribers(objects, interface)
  File "/home/jenkins/.buildout/eggs/cp27m/zope.interface-5.2.0-py2.7-linux-x86_64.egg/zope/interface/registry.py", line 448, in subscribers
    return self.adapters.subscribers(objects, provided)
  File "/home/jenkins/.buildout/eggs/cp27m/zope.interface-5.2.0-py2.7-linux-x86_64.egg/zope/interface/adapter.py", line 619, in subscribers
    subscription(*objects)
  File "/home/jenkins/.buildout/eggs/cp27m/plone.app.contenttypes-2.2.1-py2.7.egg/plone/app/contenttypes/subscribers.py", line 16, in set_title_description
    datafield = obj.file
  File "/home/jenkins/.buildout/eggs/cp27m/plone.dexterity-2.10.0-py2.7.egg/plone/dexterity/content.py", line 411, in __getattr__
    raise AttributeError(name)


FAILED:  plone.app.portlets.tests.test_navigation_portlet.TestRenderer.testMultipleTopLevelWithNavigationRoot

Error Message:
file

Stack Trace:
file

  File "/srv/python2.7/lib/python2.7/unittest/case.py", line 320, in run
    self.setUp()
  File "/home/jenkins/.buildout/eggs/cp27m/plone.app.portlets-4.4.6-py2.7.egg/plone/app/portlets/tests/base.py", line 22, in setUp
    self.afterSetUp()
  File "/home/jenkins/.buildout/eggs/cp27m/plone.app.portlets-4.4.6-py2.7.egg/plone/app/portlets/tests/test_navigation_portlet.py", line 96, in afterSetUp
    self.populateSite()
  File "/home/jenkins/.buildout/eggs/cp27m/plone.app.portlets-4.4.6-py2.7.egg/plone/app/portlets/tests/test_navigation_portlet.py", line 140, in populateSite
    folder2.invokeFactory('File', 'file21')
  File "/home/jenkins/.buildout/eggs/cp27m/plone.dexterity-2.10.0-py2.7.egg/plone/dexterity/content.py", line 833, in invokeFactory
    type_name, id, RESPONSE, *args, **kw
  File "/home/jenkins/.buildout/eggs/cp27m/Products.CMFCore-2.4.8-py2.7.egg/Products/CMFCore/PortalFolder.py", line 300, in invokeFactory
    *args, **kw)
  File "/home/jenkins/.buildout/eggs/cp27m/Products.CMFCore-2.4.8-py2.7.egg/Products/CMFCore/TypesTool.py", line 809, in constructContent
    ob = info.constructInstance(container, id, *args, **kw)
  File "/home/jenkins/.buildout/eggs/cp27m/Products.CMFCore-2.4.8-py2.7.egg/Products/CMFCore/TypesTool.py", line 308, in constructInstance
    return self._constructInstance(container, id, *args, **kw)
  File "/home/jenkins/.buildout/eggs/cp27m/Products.CMFCore-2.4.8-py2.7.egg/Products/CMFCore/TypesTool.py", line 569, in _constructInstance
    notify(ObjectCreatedEvent(obj))
  File "/home/jenkins/.buildout/eggs/cp27m/zope.event-4.5.0-py2.7.egg/zope/event/__init__.py", line 32, in notify
    subscriber(event)
  File "/home/jenkins/.buildout/eggs/cp27m/zope.component-4.6.2-py2.7.egg/zope/component/event.py", line 27, in dispatch
    component_subscribers(event, None)
  File "/home/jenkins/.buildout/eggs/cp27m/zope.component-4.6.2-py2.7.egg/zope/component/_api.py", line 134, in subscribers
    return sitemanager.subscribers(objects, interface)
  File "/home/jenkins/.buildout/eggs/cp27m/zope.interface-5.2.0-py2.7-linux-x86_64.egg/zope/interface/registry.py", line 448, in subscribers
    return self.adapters.subscribers(objects, provided)
  File "/home/jenkins/.buildout/eggs/cp27m/zope.interface-5.2.0-py2.7-linux-x86_64.egg/zope/interface/adapter.py", line 619, in subscribers
    subscription(*objects)
  File "/home/jenkins/.buildout/eggs/cp27m/zope.component-4.6.2-py2.7.egg/zope/component/event.py", line 36, in objectEventNotify
    component_subscribers((event.object, event), None)
  File "/home/jenkins/.buildout/eggs/cp27m/zope.component-4.6.2-py2.7.egg/zope/component/_api.py", line 134, in subscribers
    return sitemanager.subscribers(objects, interface)
  File "/home/jenkins/.buildout/eggs/cp27m/zope.interface-5.2.0-py2.7-linux-x86_64.egg/zope/interface/registry.py", line 448, in subscribers
    return self.adapters.subscribers(objects, provided)
  File "/home/jenkins/.buildout/eggs/cp27m/zope.interface-5.2.0-py2.7-linux-x86_64.egg/zope/interface/adapter.py", line 619, in subscribers
    subscription(*objects)
  File "/home/jenkins/.buildout/eggs/cp27m/plone.app.contenttypes-2.2.1-py2.7.egg/plone/app/contenttypes/subscribers.py", line 16, in set_title_description
    datafield = obj.file
  File "/home/jenkins/.buildout/eggs/cp27m/plone.dexterity-2.10.0-py2.7.egg/plone/dexterity/content.py", line 411, in __getattr__
    raise AttributeError(name)


FAILED:  plone.app.portlets.tests.test_navigation_portlet.TestRenderer.testNavRootWithUnicodeNavigationRoot

Error Message:
file

Stack Trace:
file

  File "/srv/python2.7/lib/python2.7/unittest/case.py", line 320, in run
    self.setUp()
  File "/home/jenkins/.buildout/eggs/cp27m/plone.app.portlets-4.4.6-py2.7.egg/plone/app/portlets/tests/base.py", line 22, in setUp
    self.afterSetUp()
  File "/home/jenkins/.buildout/eggs/cp27m/plone.app.portlets-4.4.6-py2.7.egg/plone/app/portlets/tests/test_navigation_portlet.py", line 96, in afterSetUp
    self.populateSite()
  File "/home/jenkins/.buildout/eggs/cp27m/plone.app.portlets-4.4.6-py2.7.egg/plone/app/portlets/tests/test_navigation_portlet.py", line 140, in populateSite
    folder2.invokeFactory('File', 'file21')
  File "/home/jenkins/.buildout/eggs/cp27m/plone.dexterity-2.10.0-py2.7.egg/plone/dexterity/content.py", line 833, in invokeFactory
    type_name, id, RESPONSE, *args, **kw
  File "/home/jenkins/.buildout/eggs/cp27m/Products.CMFCore-2.4.8-py2.7.egg/Products/CMFCore/PortalFolder.py", line 300, in invokeFactory
    *args, **kw)
  File "/home/jenkins/.buildout/eggs/cp27m/Products.CMFCore-2.4.8-py2.7.egg/Products/CMFCore/TypesTool.py", line 809, in constructContent
    ob = info.constructInstance(container, id, *args, **kw)
  File "/home/jenkins/.buildout/eggs/cp27m/Products.CMFCore-2.4.8-py2.7.egg/Products/CMFCore/TypesTool.py", line 308, in constructInstance
    return self._constructInstance(container, id, *args, **kw)
  File "/home/jenkins/.buildout/eggs/cp27m/Products.CMFCore-2.4.8-py2.7.egg/Products/CMFCore/TypesTool.py", line 569, in _constructInstance
    notify(ObjectCreatedEvent(obj))
  File "/home/jenkins/.buildout/eggs/cp27m/zope.event-4.5.0-py2.7.egg/zope/event/__init__.py", line 32, in notify
    subscriber(event)
  File "/home/jenkins/.buildout/eggs/cp27m/zope.component-4.6.2-py2.7.egg/zope/component/event.py", line 27, in dispatch
    component_subscribers(event, None)
  File "/home/jenkins/.buildout/eggs/cp27m/zope.component-4.6.2-py2.7.egg/zope/component/_api.py", line 134, in subscribers
    return sitemanager.subscribers(objects, interface)
  File "/home/jenkins/.buildout/eggs/cp27m/zope.interface-5.2.0-py2.7-linux-x86_64.egg/zope/interface/registry.py", line 448, in subscribers
    return self.adapters.subscribers(objects, provided)
  File "/home/jenkins/.buildout/eggs/cp27m/zope.interface-5.2.0-py2.7-linux-x86_64.egg/zope/interface/adapter.py", line 619, in subscribers
    subscription(*objects)
  File "/home/jenkins/.buildout/eggs/cp27m/zope.component-4.6.2-py2.7.egg/zope/component/event.py", line 36, in objectEventNotify
    component_subscribers((event.object, event), None)
  File "/home/jenkins/.buildout/eggs/cp27m/zope.component-4.6.2-py2.7.egg/zope/component/_api.py", line 134, in subscribers
    return sitemanager.subscribers(objects, interface)
  File "/home/jenkins/.buildout/eggs/cp27m/zope.interface-5.2.0-py2.7-linux-x86_64.egg/zope/interface/registry.py", line 448, in subscribers
    return self.adapters.subscribers(objects, provided)
  File "/home/jenkins/.buildout/eggs/cp27m/zope.interface-5.2.0-py2.7-linux-x86_64.egg/zope/interface/adapter.py", line 619, in subscribers
    subscription(*objects)
  File "/home/jenkins/.buildout/eggs/cp27m/plone.app.contenttypes-2.2.1-py2.7.egg/plone/app/contenttypes/subscribers.py", line 16, in set_title_description
    datafield = obj.file
  File "/home/jenkins/.buildout/eggs/cp27m/plone.dexterity-2.10.0-py2.7.egg/plone/dexterity/content.py", line 411, in __getattr__
    raise AttributeError(name)


FAILED:  plone.app.portlets.tests.test_navigation_portlet.TestRenderer.testNavTreeExcludesDefaultPage

Error Message:
file

Stack Trace:
file

  File "/srv/python2.7/lib/python2.7/unittest/case.py", line 320, in run
    self.setUp()
  File "/home/jenkins/.buildout/eggs/cp27m/plone.app.portlets-4.4.6-py2.7.egg/plone/app/portlets/tests/base.py", line 22, in setUp
    self.afterSetUp()
  File "/home/jenkins/.buildout/eggs/cp27m/plone.app.portlets-4.4.6-py2.7.egg/plone/app/portlets/tests/test_navigation_portlet.py", line 96, in afterSetUp
    self.populateSite()
  File "/home/jenkins/.buildout/eggs/cp27m/plone.app.portlets-4.4.6-py2.7.egg/plone/app/portlets/tests/test_navigation_portlet.py", line 140, in populateSite
    folder2.invokeFactory('File', 'file21')
  File "/home/jenkins/.buildout/eggs/cp27m/plone.dexterity-2.10.0-py2.7.egg/plone/dexterity/content.py", line 833, in invokeFactory
    type_name, id, RESPONSE, *args, **kw
  File "/home/jenkins/.buildout/eggs/cp27m/Products.CMFCore-2.4.8-py2.7.egg/Products/CMFCore/PortalFolder.py", line 300, in invokeFactory
    *args, **kw)
  File "/home/jenkins/.buildout/eggs/cp27m/Products.CMFCore-2.4.8-py2.7.egg/Products/CMFCore/TypesTool.py", line 809, in constructContent
    ob = info.constructInstance(container, id, *args, **kw)
  File "/home/jenkins/.buildout/eggs/cp27m/Products.CMFCore-2.4.8-py2.7.egg/Products/CMFCore/TypesTool.py", line 308, in constructInstance
    return self._constructInstance(container, id, *args, **kw)
  File "/home/jenkins/.buildout/eggs/cp27m/Products.CMFCore-2.4.8-py2.7.egg/Products/CMFCore/TypesTool.py", line 569, in _constructInstance
    notify(ObjectCreatedEvent(obj))
  File "/home/jenkins/.buildout/eggs/cp27m/zope.event-4.5.0-py2.7.egg/zope/event/__init__.py", line 32, in notify
    subscriber(event)
  File "/home/jenkins/.buildout/eggs/cp27m/zope.component-4.6.2-py2.7.egg/zope/component/event.py", line 27, in dispatch
    component_subscribers(event, None)
  File "/home/jenkins/.buildout/eggs/cp27m/zope.component-4.6.2-py2.7.egg/zope/component/_api.py", line 134, in subscribers
    return sitemanager.subscribers(objects, interface)
  File "/home/jenkins/.buildout/eggs/cp27m/zope.interface-5.2.0-py2.7-linux-x86_64.egg/zope/interface/registry.py", line 448, in subscribers
    return self.adapters.subscribers(objects, provided)
  File "/home/jenkins/.buildout/eggs/cp27m/zope.interface-5.2.0-py2.7-linux-x86_64.egg/zope/interface/adapter.py", line 619, in subscribers
    subscription(*objects)
  File "/home/jenkins/.buildout/eggs/cp27m/zope.component-4.6.2-py2.7.egg/zope/component/event.py", line 36, in objectEventNotify
    component_subscribers((event.object, event), None)
  File "/home/jenkins/.buildout/eggs/cp27m/zope.component-4.6.2-py2.7.egg/zope/component/_api.py", line 134, in subscribers
    return sitemanager.subscribers(objects, interface)
  File "/home/jenkins/.buildout/eggs/cp27m/zope.interface-5.2.0-py2.7-linux-x86_64.egg/zope/interface/registry.py", line 448, in subscribers
    return self.adapters.subscribers(objects, provided)
  File "/home/jenkins/.buildout/eggs/cp27m/zope.interface-5.2.0-py2.7-linux-x86_64.egg/zope/interface/adapter.py", line 619, in subscribers
    subscription(*objects)
  File "/home/jenkins/.buildout/eggs/cp27m/plone.app.contenttypes-2.2.1-py2.7.egg/plone/app/contenttypes/subscribers.py", line 16, in set_title_description
    datafield = obj.file
  File "/home/jenkins/.buildout/eggs/cp27m/plone.dexterity-2.10.0-py2.7.egg/plone/dexterity/content.py", line 411, in __getattr__
    raise AttributeError(name)


FAILED:  plone.app.portlets.tests.test_navigation_portlet.TestRenderer.testNavTreeExcludesItemsWithExcludeProperty

Error Message:
file

Stack Trace:
file

  File "/srv/python2.7/lib/python2.7/unittest/case.py", line 320, in run
    self.setUp()
  File "/home/jenkins/.buildout/eggs/cp27m/plone.app.portlets-4.4.6-py2.7.egg/plone/app/portlets/tests/base.py", line 22, in setUp
    self.afterSetUp()
  File "/home/jenkins/.buildout/eggs/cp27m/plone.app.portlets-4.4.6-py2.7.egg/plone/app/portlets/tests/test_navigation_portlet.py", line 96, in afterSetUp
    self.populateSite()
  File "/home/jenkins/.buildout/eggs/cp27m/plone.app.portlets-4.4.6-py2.7.egg/plone/app/portlets/tests/test_navigation_portlet.py", line 140, in populateSite
    folder2.invokeFactory('File', 'file21')
  File "/home/jenkins/.buildout/eggs/cp27m/plone.dexterity-2.10.0-py2.7.egg/plone/dexterity/content.py", line 833, in invokeFactory
    type_name, id, RESPONSE, *args, **kw
  File "/home/jenkins/.buildout/eggs/cp27m/Products.CMFCore-2.4.8-py2.7.egg/Products/CMFCore/PortalFolder.py", line 300, in invokeFactory
    *args, **kw)
  File "/home/jenkins/.buildout/eggs/cp27m/Products.CMFCore-2.4.8-py2.7.egg/Products/CMFCore/TypesTool.py", line 809, in constructContent
    ob = info.constructInstance(container, id, *args, **kw)
  File "/home/jenkins/.buildout/eggs/cp27m/Products.CMFCore-2.4.8-py2.7.egg/Products/CMFCore/TypesTool.py", line 308, in constructInstance
    return self._constructInstance(container, id, *args, **kw)
  File "/home/jenkins/.buildout/eggs/cp27m/Products.CMFCore-2.4.8-py2.7.egg/Products/CMFCore/TypesTool.py", line 569, in _constructInstance
    notify(ObjectCreatedEvent(obj))
  File "/home/jenkins/.buildout/eggs/cp27m/zope.event-4.5.0-py2.7.egg/zope/event/__init__.py", line 32, in notify
    subscriber(event)
  File "/home/jenkins/.buildout/eggs/cp27m/zope.component-4.6.2-py2.7.egg/zope/component/event.py", line 27, in dispatch
    component_subscribers(event, None)
  File "/home/jenkins/.buildout/eggs/cp27m/zope.component-4.6.2-py2.7.egg/zope/component/_api.py", line 134, in subscribers
    return sitemanager.subscribers(objects, interface)
  File "/home/jenkins/.buildout/eggs/cp27m/zope.interface-5.2.0-py2.7-linux-x86_64.egg/zope/interface/registry.py", line 448, in subscribers
    return self.adapters.subscribers(objects, provided)
  File "/home/jenkins/.buildout/eggs/cp27m/zope.interface-5.2.0-py2.7-linux-x86_64.egg/zope/interface/adapter.py", line 619, in subscribers
    subscription(*objects)
  File "/home/jenkins/.buildout/eggs/cp27m/zope.component-4.6.2-py2.7.egg/zope/component/event.py", line 36, in objectEventNotify
    component_subscribers((event.object, event), None)
  File "/home/jenkins/.buildout/eggs/cp27m/zope.component-4.6.2-py2.7.egg/zope/component/_api.py", line 134, in subscribers
    return sitemanager.subscribers(objects, interface)
  File "/home/jenkins/.buildout/eggs/cp27m/zope.interface-5.2.0-py2.7-linux-x86_64.egg/zope/interface/registry.py", line 448, in subscribers
    return self.adapters.subscribers(objects, provided)
  File "/home/jenkins/.buildout/eggs/cp27m/zope.interface-5.2.0-py2.7-linux-x86_64.egg/zope/interface/adapter.py", line 619, in subscribers
    subscription(*objects)
  File "/home/jenkins/.buildout/eggs/cp27m/plone.app.contenttypes-2.2.1-py2.7.egg/plone/app/contenttypes/subscribers.py", line 16, in set_title_description
    datafield = obj.file
  File "/home/jenkins/.buildout/eggs/cp27m/plone.dexterity-2.10.0-py2.7.egg/plone/dexterity/content.py", line 411, in __getattr__
    raise AttributeError(name)


FAILED:  plone.app.portlets.tests.test_navigation_portlet.TestRenderer.testNavTreeMarksParentMetaTypesNotToQuery

Error Message:
file

Stack Trace:
file

  File "/srv/python2.7/lib/python2.7/unittest/case.py", line 320, in run
    self.setUp()
  File "/home/jenkins/.buildout/eggs/cp27m/plone.app.portlets-4.4.6-py2.7.egg/plone/app/portlets/tests/base.py", line 22, in setUp
    self.afterSetUp()
  File "/home/jenkins/.buildout/eggs/cp27m/plone.app.portlets-4.4.6-py2.7.egg/plone/app/portlets/tests/test_navigation_portlet.py", line 96, in afterSetUp
    self.populateSite()
  File "/home/jenkins/.buildout/eggs/cp27m/plone.app.portlets-4.4.6-py2.7.egg/plone/app/portlets/tests/test_navigation_portlet.py", line 140, in populateSite
    folder2.invokeFactory('File', 'file21')
  File "/home/jenkins/.buildout/eggs/cp27m/plone.dexterity-2.10.0-py2.7.egg/plone/dexterity/content.py", line 833, in invokeFactory
    type_name, id, RESPONSE, *args, **kw
  File "/home/jenkins/.buildout/eggs/cp27m/Products.CMFCore-2.4.8-py2.7.egg/Products/CMFCore/PortalFolder.py", line 300, in invokeFactory
    *args, **kw)
  File "/home/jenkins/.buildout/eggs/cp27m/Products.CMFCore-2.4.8-py2.7.egg/Products/CMFCore/TypesTool.py", line 809, in constructContent
    ob = info.constructInstance(container, id, *args, **kw)
  File "/home/jenkins/.buildout/eggs/cp27m/Products.CMFCore-2.4.8-py2.7.egg/Products/CMFCore/TypesTool.py", line 308, in constructInstance
    return self._constructInstance(container, id, *args, **kw)
  File "/home/jenkins/.buildout/eggs/cp27m/Products.CMFCore-2.4.8-py2.7.egg/Products/CMFCore/TypesTool.py", line 569, in _constructInstance
    notify(ObjectCreatedEvent(obj))
  File "/home/jenkins/.buildout/eggs/cp27m/zope.event-4.5.0-py2.7.egg/zope/event/__init__.py", line 32, in notify
    subscriber(event)
  File "/home/jenkins/.buildout/eggs/cp27m/zope.component-4.6.2-py2.7.egg/zope/component/event.py", line 27, in dispatch
    component_subscribers(event, None)
  File "/home/jenkins/.buildout/eggs/cp27m/zope.component-4.6.2-py2.7.egg/zope/component/_api.py", line 134, in subscribers
    return sitemanager.subscribers(objects, interface)
  File "/home/jenkins/.buildout/eggs/cp27m/zope.interface-5.2.0-py2.7-linux-x86_64.egg/zope/interface/registry.py", line 448, in subscribers
    return self.adapters.subscribers(objects, provided)
  File "/home/jenkins/.buildout/eggs/cp27m/zope.interface-5.2.0-py2.7-linux-x86_64.egg/zope/interface/adapter.py", line 619, in subscribers
    subscription(*objects)
  File "/home/jenkins/.buildout/eggs/cp27m/zope.component-4.6.2-py2.7.egg/zope/component/event.py", line 36, in objectEventNotify
    component_subscribers((event.object, event), None)
  File "/home/jenkins/.buildout/eggs/cp27m/zope.component-4.6.2-py2.7.egg/zope/component/_api.py", line 134, in subscribers
    return sitemanager.subscribers(objects, interface)
  File "/home/jenkins/.buildout/eggs/cp27m/zope.interface-5.2.0-py2.7-linux-x86_64.egg/zope/interface/registry.py", line 448, in subscribers
    return self.adapters.subscribers(objects, provided)
  File "/home/jenkins/.buildout/eggs/cp27m/zope.interface-5.2.0-py2.7-linux-x86_64.egg/zope/interface/adapter.py", line 619, in subscribers
    subscription(*objects)
  File "/home/jenkins/.buildout/eggs/cp27m/plone.app.contenttypes-2.2.1-py2.7.egg/plone/app/contenttypes/subscribers.py", line 16, in set_title_description
    datafield = obj.file
  File "/home/jenkins/.buildout/eggs/cp27m/plone.dexterity-2.10.0-py2.7.egg/plone/dexterity/content.py", line 411, in __getattr__
    raise AttributeError(name)


FAILED:  plone.app.portlets.tests.test_navigation_portlet.TestRenderer.testNoRootSet

Error Message:
file

Stack Trace:
file

  File "/srv/python2.7/lib/python2.7/unittest/case.py", line 320, in run
    self.setUp()
  File "/home/jenkins/.buildout/eggs/cp27m/plone.app.portlets-4.4.6-py2.7.egg/plone/app/portlets/tests/base.py", line 22, in setUp
    self.afterSetUp()
  File "/home/jenkins/.buildout/eggs/cp27m/plone.app.portlets-4.4.6-py2.7.egg/plone/app/portlets/tests/test_navigation_portlet.py", line 96, in afterSetUp
    self.populateSite()
  File "/home/jenkins/.buildout/eggs/cp27m/plone.app.portlets-4.4.6-py2.7.egg/plone/app/portlets/tests/test_navigation_portlet.py", line 140, in populateSite
    folder2.invokeFactory('File', 'file21')
  File "/home/jenkins/.buildout/eggs/cp27m/plone.dexterity-2.10.0-py2.7.egg/plone/dexterity/content.py", line 833, in invokeFactory
    type_name, id, RESPONSE, *args, **kw
  File "/home/jenkins/.buildout/eggs/cp27m/Products.CMFCore-2.4.8-py2.7.egg/Products/CMFCore/PortalFolder.py", line 300, in invokeFactory
    *args, **kw)
  File "/home/jenkins/.buildout/eggs/cp27m/Products.CMFCore-2.4.8-py2.7.egg/Products/CMFCore/TypesTool.py", line 809, in constructContent
    ob = info.constructInstance(container, id, *args, **kw)
  File "/home/jenkins/.buildout/eggs/cp27m/Products.CMFCore-2.4.8-py2.7.egg/Products/CMFCore/TypesTool.py", line 308, in constructInstance
    return self._constructInstance(container, id, *args, **kw)
  File "/home/jenkins/.buildout/eggs/cp27m/Products.CMFCore-2.4.8-py2.7.egg/Products/CMFCore/TypesTool.py", line 569, in _constructInstance
    notify(ObjectCreatedEvent(obj))
  File "/home/jenkins/.buildout/eggs/cp27m/zope.event-4.5.0-py2.7.egg/zope/event/__init__.py", line 32, in notify
    subscriber(event)
  File "/home/jenkins/.buildout/eggs/cp27m/zope.component-4.6.2-py2.7.egg/zope/component/event.py", line 27, in dispatch
    component_subscribers(event, None)
  File "/home/jenkins/.buildout/eggs/cp27m/zope.component-4.6.2-py2.7.egg/zope/component/_api.py", line 134, in subscribers
    return sitemanager.subscribers(objects, interface)
  File "/home/jenkins/.buildout/eggs/cp27m/zope.interface-5.2.0-py2.7-linux-x86_64.egg/zope/interface/registry.py", line 448, in subscribers
    return self.adapters.subscribers(objects, provided)
  File "/home/jenkins/.buildout/eggs/cp27m/zope.interface-5.2.0-py2.7-linux-x86_64.egg/zope/interface/adapter.py", line 619, in subscribers
    subscription(*objects)
  File "/home/jenkins/.buildout/eggs/cp27m/zope.component-4.6.2-py2.7.egg/zope/component/event.py", line 36, in objectEventNotify
    component_subscribers((event.object, event), None)
  File "/home/jenkins/.buildout/eggs/cp27m/zope.component-4.6.2-py2.7.egg/zope/component/_api.py", line 134, in subscribers
    return sitemanager.subscribers(objects, interface)
  File "/home/jenkins/.buildout/eggs/cp27m/zope.interface-5.2.0-py2.7-linux-x86_64.egg/zope/interface/registry.py", line 448, in subscribers
    return self.adapters.subscribers(objects, provided)
  File "/home/jenkins/.buildout/eggs/cp27m/zope.interface-5.2.0-py2.7-linux-x86_64.egg/zope/interface/adapter.py", line 619, in subscribers
    subscription(*objects)
  File "/home/jenkins/.buildout/eggs/cp27m/plone.app.contenttypes-2.2.1-py2.7.egg/plone/app/contenttypes/subscribers.py", line 16, in set_title_description
    datafield = obj.file
  File "/home/jenkins/.buildout/eggs/cp27m/plone.dexterity-2.10.0-py2.7.egg/plone/dexterity/content.py", line 411, in __getattr__
    raise AttributeError(name)


FAILED:  plone.app.portlets.tests.test_navigation_portlet.TestRenderer.testNonStructuralFolderHidesChildren

Error Message:
file

Stack Trace:
file

  File "/srv/python2.7/lib/python2.7/unittest/case.py", line 320, in run
    self.setUp()
  File "/home/jenkins/.buildout/eggs/cp27m/plone.app.portlets-4.4.6-py2.7.egg/plone/app/portlets/tests/base.py", line 22, in setUp
    self.afterSetUp()
  File "/home/jenkins/.buildout/eggs/cp27m/plone.app.portlets-4.4.6-py2.7.egg/plone/app/portlets/tests/test_navigation_portlet.py", line 96, in afterSetUp
    self.populateSite()
  File "/home/jenkins/.buildout/eggs/cp27m/plone.app.portlets-4.4.6-py2.7.egg/plone/app/portlets/tests/test_navigation_portlet.py", line 140, in populateSite
    folder2.invokeFactory('File', 'file21')
  File "/home/jenkins/.buildout/eggs/cp27m/plone.dexterity-2.10.0-py2.7.egg/plone/dexterity/content.py", line 833, in invokeFactory
    type_name, id, RESPONSE, *args, **kw
  File "/home/jenkins/.buildout/eggs/cp27m/Products.CMFCore-2.4.8-py2.7.egg/Products/CMFCore/PortalFolder.py", line 300, in invokeFactory
    *args, **kw)
  File "/home/jenkins/.buildout/eggs/cp27m/Products.CMFCore-2.4.8-py2.7.egg/Products/CMFCore/TypesTool.py", line 809, in constructContent
    ob = info.constructInstance(container, id, *args, **kw)
  File "/home/jenkins/.buildout/eggs/cp27m/Products.CMFCore-2.4.8-py2.7.egg/Products/CMFCore/TypesTool.py", line 308, in constructInstance
    return self._constructInstance(container, id, *args, **kw)
  File "/home/jenkins/.buildout/eggs/cp27m/Products.CMFCore-2.4.8-py2.7.egg/Products/CMFCore/TypesTool.py", line 569, in _constructInstance
    notify(ObjectCreatedEvent(obj))
  File "/home/jenkins/.buildout/eggs/cp27m/zope.event-4.5.0-py2.7.egg/zope/event/__init__.py", line 32, in notify
    subscriber(event)
  File "/home/jenkins/.buildout/eggs/cp27m/zope.component-4.6.2-py2.7.egg/zope/component/event.py", line 27, in dispatch
    component_subscribers(event, None)
  File "/home/jenkins/.buildout/eggs/cp27m/zope.component-4.6.2-py2.7.egg/zope/component/_api.py", line 134, in subscribers
    return sitemanager.subscribers(objects, interface)
  File "/home/jenkins/.buildout/eggs/cp27m/zope.interface-5.2.0-py2.7-linux-x86_64.egg/zope/interface/registry.py", line 448, in subscribers
    return self.adapters.subscribers(objects, provided)
  File "/home/jenkins/.buildout/eggs/cp27m/zope.interface-5.2.0-py2.7-linux-x86_64.egg/zope/interface/adapter.py", line 619, in subscribers
    subscription(*objects)
  File "/home/jenkins/.buildout/eggs/cp27m/zope.component-4.6.2-py2.7.egg/zope/component/event.py", line 36, in objectEventNotify
    component_subscribers((event.object, event), None)
  File "/home/jenkins/.buildout/eggs/cp27m/zope.component-4.6.2-py2.7.egg/zope/component/_api.py", line 134, in subscribers
    return sitemanager.subscribers(objects, interface)
  File "/home/jenkins/.buildout/eggs/cp27m/zope.interface-5.2.0-py2.7-linux-x86_64.egg/zope/interface/registry.py", line 448, in subscribers
    return self.adapters.subscribers(objects, provided)
  File "/home/jenkins/.buildout/eggs/cp27m/zope.interface-5.2.0-py2.7-linux-x86_64.egg/zope/interface/adapter.py", line 619, in subscribers
    subscription(*objects)
  File "/home/jenkins/.buildout/eggs/cp27m/plone.app.contenttypes-2.2.1-py2.7.egg/plone/app/contenttypes/subscribers.py", line 16, in set_title_description
    datafield = obj.file
  File "/home/jenkins/.buildout/eggs/cp27m/plone.dexterity-2.10.0-py2.7.egg/plone/dexterity/content.py", line 411, in __getattr__
    raise AttributeError(name)


FAILED:  plone.app.portlets.tests.test_navigation_portlet.TestRenderer.testOutsideRoot

Error Message:
file

Stack Trace:
file

  File "/srv/python2.7/lib/python2.7/unittest/case.py", line 320, in run
    self.setUp()
  File "/home/jenkins/.buildout/eggs/cp27m/plone.app.portlets-4.4.6-py2.7.egg/plone/app/portlets/tests/base.py", line 22, in setUp
    self.afterSetUp()
  File "/home/jenkins/.buildout/eggs/cp27m/plone.app.portlets-4.4.6-py2.7.egg/plone/app/portlets/tests/test_navigation_portlet.py", line 96, in afterSetUp
    self.populateSite()
  File "/home/jenkins/.buildout/eggs/cp27m/plone.app.portlets-4.4.6-py2.7.egg/plone/app/portlets/tests/test_navigation_portlet.py", line 140, in populateSite
    folder2.invokeFactory('File', 'file21')
  File "/home/jenkins/.buildout/eggs/cp27m/plone.dexterity-2.10.0-py2.7.egg/plone/dexterity/content.py", line 833, in invokeFactory
    type_name, id, RESPONSE, *args, **kw
  File "/home/jenkins/.buildout/eggs/cp27m/Products.CMFCore-2.4.8-py2.7.egg/Products/CMFCore/PortalFolder.py", line 300, in invokeFactory
    *args, **kw)
  File "/home/jenkins/.buildout/eggs/cp27m/Products.CMFCore-2.4.8-py2.7.egg/Products/CMFCore/TypesTool.py", line 809, in constructContent
    ob = info.constructInstance(container, id, *args, **kw)
  File "/home/jenkins/.buildout/eggs/cp27m/Products.CMFCore-2.4.8-py2.7.egg/Products/CMFCore/TypesTool.py", line 308, in constructInstance
    return self._constructInstance(container, id, *args, **kw)
  File "/home/jenkins/.buildout/eggs/cp27m/Products.CMFCore-2.4.8-py2.7.egg/Products/CMFCore/TypesTool.py", line 569, in _constructInstance
    notify(ObjectCreatedEvent(obj))
  File "/home/jenkins/.buildout/eggs/cp27m/zope.event-4.5.0-py2.7.egg/zope/event/__init__.py", line 32, in notify
    subscriber(event)
  File "/home/jenkins/.buildout/eggs/cp27m/zope.component-4.6.2-py2.7.egg/zope/component/event.py", line 27, in dispatch
    component_subscribers(event, None)
  File "/home/jenkins/.buildout/eggs/cp27m/zope.component-4.6.2-py2.7.egg/zope/component/_api.py", line 134, in subscribers
    return sitemanager.subscribers(objects, interface)
  File "/home/jenkins/.buildout/eggs/cp27m/zope.interface-5.2.0-py2.7-linux-x86_64.egg/zope/interface/registry.py", line 448, in subscribers
    return self.adapters.subscribers(objects, provided)
  File "/home/jenkins/.buildout/eggs/cp27m/zope.interface-5.2.0-py2.7-linux-x86_64.egg/zope/interface/adapter.py", line 619, in subscribers
    subscription(*objects)
  File "/home/jenkins/.buildout/eggs/cp27m/zope.component-4.6.2-py2.7.egg/zope/component/event.py", line 36, in objectEventNotify
    component_subscribers((event.object, event), None)
  File "/home/jenkins/.buildout/eggs/cp27m/zope.component-4.6.2-py2.7.egg/zope/component/_api.py", line 134, in subscribers
    return sitemanager.subscribers(objects, interface)
  File "/home/jenkins/.buildout/eggs/cp27m/zope.interface-5.2.0-py2.7-linux-x86_64.egg/zope/interface/registry.py", line 448, in subscribers
    return self.adapters.subscribers(objects, provided)
  File "/home/jenkins/.buildout/eggs/cp27m/zope.interface-5.2.0-py2.7-linux-x86_64.egg/zope/interface/adapter.py", line 619, in subscribers
    subscription(*objects)
  File "/home/jenkins/.buildout/eggs/cp27m/plone.app.contenttypes-2.2.1-py2.7.egg/plone/app/contenttypes/subscribers.py", line 16, in set_title_description
    datafield = obj.file
  File "/home/jenkins/.buildout/eggs/cp27m/plone.dexterity-2.10.0-py2.7.egg/plone/dexterity/content.py", line 411, in __getattr__
    raise AttributeError(name)


FAILED:  plone.app.portlets.tests.test_navigation_portlet.TestRenderer.testPortletNotDisplayedOnINavigationRoot

Error Message:
file

Stack Trace:
file

  File "/srv/python2.7/lib/python2.7/unittest/case.py", line 320, in run
    self.setUp()
  File "/home/jenkins/.buildout/eggs/cp27m/plone.app.portlets-4.4.6-py2.7.egg/plone/app/portlets/tests/base.py", line 22, in setUp
    self.afterSetUp()
  File "/home/jenkins/.buildout/eggs/cp27m/plone.app.portlets-4.4.6-py2.7.egg/plone/app/portlets/tests/test_navigation_portlet.py", line 96, in afterSetUp
    self.populateSite()
  File "/home/jenkins/.buildout/eggs/cp27m/plone.app.portlets-4.4.6-py2.7.egg/plone/app/portlets/tests/test_navigation_portlet.py", line 140, in populateSite
    folder2.invokeFactory('File', 'file21')
  File "/home/jenkins/.buildout/eggs/cp27m/plone.dexterity-2.10.0-py2.7.egg/plone/dexterity/content.py", line 833, in invokeFactory
    type_name, id, RESPONSE, *args, **kw
  File "/home/jenkins/.buildout/eggs/cp27m/Products.CMFCore-2.4.8-py2.7.egg/Products/CMFCore/PortalFolder.py", line 300, in invokeFactory
    *args, **kw)
  File "/home/jenkins/.buildout/eggs/cp27m/Products.CMFCore-2.4.8-py2.7.egg/Products/CMFCore/TypesTool.py", line 809, in constructContent
    ob = info.constructInstance(container, id, *args, **kw)
  File "/home/jenkins/.buildout/eggs/cp27m/Products.CMFCore-2.4.8-py2.7.egg/Products/CMFCore/TypesTool.py", line 308, in constructInstance
    return self._constructInstance(container, id, *args, **kw)
  File "/home/jenkins/.buildout/eggs/cp27m/Products.CMFCore-2.4.8-py2.7.egg/Products/CMFCore/TypesTool.py", line 569, in _constructInstance
    notify(ObjectCreatedEvent(obj))
  File "/home/jenkins/.buildout/eggs/cp27m/zope.event-4.5.0-py2.7.egg/zope/event/__init__.py", line 32, in notify
    subscriber(event)
  File "/home/jenkins/.buildout/eggs/cp27m/zope.component-4.6.2-py2.7.egg/zope/component/event.py", line 27, in dispatch
    component_subscribers(event, None)
  File "/home/jenkins/.buildout/eggs/cp27m/zope.component-4.6.2-py2.7.egg/zope/component/_api.py", line 134, in subscribers
    return sitemanager.subscribers(objects, interface)
  File "/home/jenkins/.buildout/eggs/cp27m/zope.interface-5.2.0-py2.7-linux-x86_64.egg/zope/interface/registry.py", line 448, in subscribers
    return self.adapters.subscribers(objects, provided)
  File "/home/jenkins/.buildout/eggs/cp27m/zope.interface-5.2.0-py2.7-linux-x86_64.egg/zope/interface/adapter.py", line 619, in subscribers
    subscription(*objects)
  File "/home/jenkins/.buildout/eggs/cp27m/zope.component-4.6.2-py2.7.egg/zope/component/event.py", line 36, in objectEventNotify
    component_subscribers((event.object, event), None)
  File "/home/jenkins/.buildout/eggs/cp27m/zope.component-4.6.2-py2.7.egg/zope/component/_api.py", line 134, in subscribers
    return sitemanager.subscribers(objects, interface)
  File "/home/jenkins/.buildout/eggs/cp27m/zope.interface-5.2.0-py2.7-linux-x86_64.egg/zope/interface/registry.py", line 448, in subscribers
    return self.adapters.subscribers(objects, provided)
  File "/home/jenkins/.buildout/eggs/cp27m/zope.interface-5.2.0-py2.7-linux-x86_64.egg/zope/interface/adapter.py", line 619, in subscribers
    subscription(*objects)
  File "/home/jenkins/.buildout/eggs/cp27m/plone.app.contenttypes-2.2.1-py2.7.egg/plone/app/contenttypes/subscribers.py", line 16, in set_title_description
    datafield = obj.file
  File "/home/jenkins/.buildout/eggs/cp27m/plone.dexterity-2.10.0-py2.7.egg/plone/dexterity/content.py", line 411, in __getattr__
    raise AttributeError(name)


FAILED:  plone.app.portlets.tests.test_navigation_portlet.TestRenderer.testPortletsTitle

Error Message:
file

Stack Trace:
file

  File "/srv/python2.7/lib/python2.7/unittest/case.py", line 320, in run
    self.setUp()
  File "/home/jenkins/.buildout/eggs/cp27m/plone.app.portlets-4.4.6-py2.7.egg/plone/app/portlets/tests/base.py", line 22, in setUp
    self.afterSetUp()
  File "/home/jenkins/.buildout/eggs/cp27m/plone.app.portlets-4.4.6-py2.7.egg/plone/app/portlets/tests/test_navigation_portlet.py", line 96, in afterSetUp
    self.populateSite()
  File "/home/jenkins/.buildout/eggs/cp27m/plone.app.portlets-4.4.6-py2.7.egg/plone/app/portlets/tests/test_navigation_portlet.py", line 140, in populateSite
    folder2.invokeFactory('File', 'file21')
  File "/home/jenkins/.buildout/eggs/cp27m/plone.dexterity-2.10.0-py2.7.egg/plone/dexterity/content.py", line 833, in invokeFactory
    type_name, id, RESPONSE, *args, **kw
  File "/home/jenkins/.buildout/eggs/cp27m/Products.CMFCore-2.4.8-py2.7.egg/Products/CMFCore/PortalFolder.py", line 300, in invokeFactory
    *args, **kw)
  File "/home/jenkins/.buildout/eggs/cp27m/Products.CMFCore-2.4.8-py2.7.egg/Products/CMFCore/TypesTool.py", line 809, in constructContent
    ob = info.constructInstance(container, id, *args, **kw)
  File "/home/jenkins/.buildout/eggs/cp27m/Products.CMFCore-2.4.8-py2.7.egg/Products/CMFCore/TypesTool.py", line 308, in constructInstance
    return self._constructInstance(container, id, *args, **kw)
  File "/home/jenkins/.buildout/eggs/cp27m/Products.CMFCore-2.4.8-py2.7.egg/Products/CMFCore/TypesTool.py", line 569, in _constructInstance
    notify(ObjectCreatedEvent(obj))
  File "/home/jenkins/.buildout/eggs/cp27m/zope.event-4.5.0-py2.7.egg/zope/event/__init__.py", line 32, in notify
    subscriber(event)
  File "/home/jenkins/.buildout/eggs/cp27m/zope.component-4.6.2-py2.7.egg/zope/component/event.py", line 27, in dispatch
    component_subscribers(event, None)
  File "/home/jenkins/.buildout/eggs/cp27m/zope.component-4.6.2-py2.7.egg/zope/component/_api.py", line 134, in subscribers
    return sitemanager.subscribers(objects, interface)
  File "/home/jenkins/.buildout/eggs/cp27m/zope.interface-5.2.0-py2.7-linux-x86_64.egg/zope/interface/registry.py", line 448, in subscribers
    return self.adapters.subscribers(objects, provided)
  File "/home/jenkins/.buildout/eggs/cp27m/zope.interface-5.2.0-py2.7-linux-x86_64.egg/zope/interface/adapter.py", line 619, in subscribers
    subscription(*objects)
  File "/home/jenkins/.buildout/eggs/cp27m/zope.component-4.6.2-py2.7.egg/zope/component/event.py", line 36, in objectEventNotify
    component_subscribers((event.object, event), None)
  File "/home/jenkins/.buildout/eggs/cp27m/zope.component-4.6.2-py2.7.egg/zope/component/_api.py", line 134, in subscribers
    return sitemanager.subscribers(objects, interface)
  File "/home/jenkins/.buildout/eggs/cp27m/zope.interface-5.2.0-py2.7-linux-x86_64.egg/zope/interface/registry.py", line 448, in subscribers
    return self.adapters.subscribers(objects, provided)
  File "/home/jenkins/.buildout/eggs/cp27m/zope.interface-5.2.0-py2.7-linux-x86_64.egg/zope/interface/adapter.py", line 619, in subscribers
    subscription(*objects)
  File "/home/jenkins/.buildout/eggs/cp27m/plone.app.contenttypes-2.2.1-py2.7.egg/plone/app/contenttypes/subscribers.py", line 16, in set_title_description
    datafield = obj.file
  File "/home/jenkins/.buildout/eggs/cp27m/plone.dexterity-2.10.0-py2.7.egg/plone/dexterity/content.py", line 411, in __getattr__
    raise AttributeError(name)


FAILED:  plone.app.portlets.tests.test_navigation_portlet.TestRenderer.testPrunedRootNode

Error Message:
file

Stack Trace:
file

  File "/srv/python2.7/lib/python2.7/unittest/case.py", line 320, in run
    self.setUp()
  File "/home/jenkins/.buildout/eggs/cp27m/plone.app.portlets-4.4.6-py2.7.egg/plone/app/portlets/tests/base.py", line 22, in setUp
    self.afterSetUp()
  File "/home/jenkins/.buildout/eggs/cp27m/plone.app.portlets-4.4.6-py2.7.egg/plone/app/portlets/tests/test_navigation_portlet.py", line 96, in afterSetUp
    self.populateSite()
  File "/home/jenkins/.buildout/eggs/cp27m/plone.app.portlets-4.4.6-py2.7.egg/plone/app/portlets/tests/test_navigation_portlet.py", line 140, in populateSite
    folder2.invokeFactory('File', 'file21')
  File "/home/jenkins/.buildout/eggs/cp27m/plone.dexterity-2.10.0-py2.7.egg/plone/dexterity/content.py", line 833, in invokeFactory
    type_name, id, RESPONSE, *args, **kw
  File "/home/jenkins/.buildout/eggs/cp27m/Products.CMFCore-2.4.8-py2.7.egg/Products/CMFCore/PortalFolder.py", line 300, in invokeFactory
    *args, **kw)
  File "/home/jenkins/.buildout/eggs/cp27m/Products.CMFCore-2.4.8-py2.7.egg/Products/CMFCore/TypesTool.py", line 809, in constructContent
    ob = info.constructInstance(container, id, *args, **kw)
  File "/home/jenkins/.buildout/eggs/cp27m/Products.CMFCore-2.4.8-py2.7.egg/Products/CMFCore/TypesTool.py", line 308, in constructInstance
    return self._constructInstance(container, id, *args, **kw)
  File "/home/jenkins/.buildout/eggs/cp27m/Products.CMFCore-2.4.8-py2.7.egg/Products/CMFCore/TypesTool.py", line 569, in _constructInstance
    notify(ObjectCreatedEvent(obj))
  File "/home/jenkins/.buildout/eggs/cp27m/zope.event-4.5.0-py2.7.egg/zope/event/__init__.py", line 32, in notify
    subscriber(event)
  File "/home/jenkins/.buildout/eggs/cp27m/zope.component-4.6.2-py2.7.egg/zope/component/event.py", line 27, in dispatch
    component_subscribers(event, None)
  File "/home/jenkins/.buildout/eggs/cp27m/zope.component-4.6.2-py2.7.egg/zope/component/_api.py", line 134, in subscribers
    return sitemanager.subscribers(objects, interface)
  File "/home/jenkins/.buildout/eggs/cp27m/zope.interface-5.2.0-py2.7-linux-x86_64.egg/zope/interface/registry.py", line 448, in subscribers
    return self.adapters.subscribers(objects, provided)
  File "/home/jenkins/.buildout/eggs/cp27m/zope.interface-5.2.0-py2.7-linux-x86_64.egg/zope/interface/adapter.py", line 619, in subscribers
    subscription(*objects)
  File "/home/jenkins/.buildout/eggs/cp27m/zope.component-4.6.2-py2.7.egg/zope/component/event.py", line 36, in objectEventNotify
    component_subscribers((event.object, event), None)
  File "/home/jenkins/.buildout/eggs/cp27m/zope.component-4.6.2-py2.7.egg/zope/component/_api.py", line 134, in subscribers
    return sitemanager.subscribers(objects, interface)
  File "/home/jenkins/.buildout/eggs/cp27m/zope.interface-5.2.0-py2.7-linux-x86_64.egg/zope/interface/registry.py", line 448, in subscribers
    return self.adapters.subscribers(objects, provided)
  File "/home/jenkins/.buildout/eggs/cp27m/zope.interface-5.2.0-py2.7-linux-x86_64.egg/zope/interface/adapter.py", line 619, in subscribers
    subscription(*objects)
  File "/home/jenkins/.buildout/eggs/cp27m/plone.app.contenttypes-2.2.1-py2.7.egg/plone/app/contenttypes/subscribers.py", line 16, in set_title_description
    datafield = obj.file
  File "/home/jenkins/.buildout/eggs/cp27m/plone.dexterity-2.10.0-py2.7.egg/plone/dexterity/content.py", line 411, in __getattr__
    raise AttributeError(name)


FAILED:  plone.app.portlets.tests.test_navigation_portlet.TestRenderer.testPrunedRootNodeShowsAllParents

Error Message:
file

Stack Trace:
file

  File "/srv/python2.7/lib/python2.7/unittest/case.py", line 320, in run
    self.setUp()
  File "/home/jenkins/.buildout/eggs/cp27m/plone.app.portlets-4.4.6-py2.7.egg/plone/app/portlets/tests/base.py", line 22, in setUp
    self.afterSetUp()
  File "/home/jenkins/.buildout/eggs/cp27m/plone.app.portlets-4.4.6-py2.7.egg/plone/app/portlets/tests/test_navigation_portlet.py", line 96, in afterSetUp
    self.populateSite()
  File "/home/jenkins/.buildout/eggs/cp27m/plone.app.portlets-4.4.6-py2.7.egg/plone/app/portlets/tests/test_navigation_portlet.py", line 140, in populateSite
    folder2.invokeFactory('File', 'file21')
  File "/home/jenkins/.buildout/eggs/cp27m/plone.dexterity-2.10.0-py2.7.egg/plone/dexterity/content.py", line 833, in invokeFactory
    type_name, id, RESPONSE, *args, **kw
  File "/home/jenkins/.buildout/eggs/cp27m/Products.CMFCore-2.4.8-py2.7.egg/Products/CMFCore/PortalFolder.py", line 300, in invokeFactory
    *args, **kw)
  File "/home/jenkins/.buildout/eggs/cp27m/Products.CMFCore-2.4.8-py2.7.egg/Products/CMFCore/TypesTool.py", line 809, in constructContent
    ob = info.constructInstance(container, id, *args, **kw)
  File "/home/jenkins/.buildout/eggs/cp27m/Products.CMFCore-2.4.8-py2.7.egg/Products/CMFCore/TypesTool.py", line 308, in constructInstance
    return self._constructInstance(container, id, *args, **kw)
  File "/home/jenkins/.buildout/eggs/cp27m/Products.CMFCore-2.4.8-py2.7.egg/Products/CMFCore/TypesTool.py", line 569, in _constructInstance
    notify(ObjectCreatedEvent(obj))
  File "/home/jenkins/.buildout/eggs/cp27m/zope.event-4.5.0-py2.7.egg/zope/event/__init__.py", line 32, in notify
    subscriber(event)
  File "/home/jenkins/.buildout/eggs/cp27m/zope.component-4.6.2-py2.7.egg/zope/component/event.py", line 27, in dispatch
    component_subscribers(event, None)
  File "/home/jenkins/.buildout/eggs/cp27m/zope.component-4.6.2-py2.7.egg/zope/component/_api.py", line 134, in subscribers
    return sitemanager.subscribers(objects, interface)
  File "/home/jenkins/.buildout/eggs/cp27m/zope.interface-5.2.0-py2.7-linux-x86_64.egg/zope/interface/registry.py", line 448, in subscribers
    return self.adapters.subscribers(objects, provided)
  File "/home/jenkins/.buildout/eggs/cp27m/zope.interface-5.2.0-py2.7-linux-x86_64.egg/zope/interface/adapter.py", line 619, in subscribers
    subscription(*objects)
  File "/home/jenkins/.buildout/eggs/cp27m/zope.component-4.6.2-py2.7.egg/zope/component/event.py", line 36, in objectEventNotify
    component_subscribers((event.object, event), None)
  File "/home/jenkins/.buildout/eggs/cp27m/zope.component-4.6.2-py2.7.egg/zope/component/_api.py", line 134, in subscribers
    return sitemanager.subscribers(objects, interface)
  File "/home/jenkins/.buildout/eggs/cp27m/zope.interface-5.2.0-py2.7-linux-x86_64.egg/zope/interface/registry.py", line 448, in subscribers
    return self.adapters.subscribers(objects, provided)
  File "/home/jenkins/.buildout/eggs/cp27m/zope.interface-5.2.0-py2.7-linux-x86_64.egg/zope/interface/adapter.py", line 619, in subscribers
    subscription(*objects)
  File "/home/jenkins/.buildout/eggs/cp27m/plone.app.contenttypes-2.2.1-py2.7.egg/plone/app/contenttypes/subscribers.py", line 16, in set_title_description
    datafield = obj.file
  File "/home/jenkins/.buildout/eggs/cp27m/plone.dexterity-2.10.0-py2.7.egg/plone/dexterity/content.py", line 411, in __getattr__
    raise AttributeError(name)


FAILED:  plone.app.portlets.tests.test_navigation_portlet.TestRenderer.testRootDoesNotExist

Error Message:
file

Stack Trace:
file

  File "/srv/python2.7/lib/python2.7/unittest/case.py", line 320, in run
    self.setUp()
  File "/home/jenkins/.buildout/eggs/cp27m/plone.app.portlets-4.4.6-py2.7.egg/plone/app/portlets/tests/base.py", line 22, in setUp
    self.afterSetUp()
  File "/home/jenkins/.buildout/eggs/cp27m/plone.app.portlets-4.4.6-py2.7.egg/plone/app/portlets/tests/test_navigation_portlet.py", line 96, in afterSetUp
    self.populateSite()
  File "/home/jenkins/.buildout/eggs/cp27m/plone.app.portlets-4.4.6-py2.7.egg/plone/app/portlets/tests/test_navigation_portlet.py", line 140, in populateSite
    folder2.invokeFactory('File', 'file21')
  File "/home/jenkins/.buildout/eggs/cp27m/plone.dexterity-2.10.0-py2.7.egg/plone/dexterity/content.py", line 833, in invokeFactory
    type_name, id, RESPONSE, *args, **kw
  File "/home/jenkins/.buildout/eggs/cp27m/Products.CMFCore-2.4.8-py2.7.egg/Products/CMFCore/PortalFolder.py", line 300, in invokeFactory
    *args, **kw)
  File "/home/jenkins/.buildout/eggs/cp27m/Products.CMFCore-2.4.8-py2.7.egg/Products/CMFCore/TypesTool.py", line 809, in constructContent
    ob = info.constructInstance(container, id, *args, **kw)
  File "/home/jenkins/.buildout/eggs/cp27m/Products.CMFCore-2.4.8-py2.7.egg/Products/CMFCore/TypesTool.py", line 308, in constructInstance
    return self._constructInstance(container, id, *args, **kw)
  File "/home/jenkins/.buildout/eggs/cp27m/Products.CMFCore-2.4.8-py2.7.egg/Products/CMFCore/TypesTool.py", line 569, in _constructInstance
    notify(ObjectCreatedEvent(obj))
  File "/home/jenkins/.buildout/eggs/cp27m/zope.event-4.5.0-py2.7.egg/zope/event/__init__.py", line 32, in notify
    subscriber(event)
  File "/home/jenkins/.buildout/eggs/cp27m/zope.component-4.6.2-py2.7.egg/zope/component/event.py", line 27, in dispatch
    component_subscribers(event, None)
  File "/home/jenkins/.buildout/eggs/cp27m/zope.component-4.6.2-py2.7.egg/zope/component/_api.py", line 134, in subscribers
    return sitemanager.subscribers(objects, interface)
  File "/home/jenkins/.buildout/eggs/cp27m/zope.interface-5.2.0-py2.7-linux-x86_64.egg/zope/interface/registry.py", line 448, in subscribers
    return self.adapters.subscribers(objects, provided)
  File "/home/jenkins/.buildout/eggs/cp27m/zope.interface-5.2.0-py2.7-linux-x86_64.egg/zope/interface/adapter.py", line 619, in subscribers
    subscription(*objects)
  File "/home/jenkins/.buildout/eggs/cp27m/zope.component-4.6.2-py2.7.egg/zope/component/event.py", line 36, in objectEventNotify
    component_subscribers((event.object, event), None)
  File "/home/jenkins/.buildout/eggs/cp27m/zope.component-4.6.2-py2.7.egg/zope/component/_api.py", line 134, in subscribers
    return sitemanager.subscribers(objects, interface)
  File "/home/jenkins/.buildout/eggs/cp27m/zope.interface-5.2.0-py2.7-linux-x86_64.egg/zope/interface/registry.py", line 448, in subscribers
    return self.adapters.subscribers(objects, provided)
  File "/home/jenkins/.buildout/eggs/cp27m/zope.interface-5.2.0-py2.7-linux-x86_64.egg/zope/interface/adapter.py", line 619, in subscribers
    subscription(*objects)
  File "/home/jenkins/.buildout/eggs/cp27m/plone.app.contenttypes-2.2.1-py2.7.egg/plone/app/contenttypes/subscribers.py", line 16, in set_title_description
    datafield = obj.file
  File "/home/jenkins/.buildout/eggs/cp27m/plone.dexterity-2.10.0-py2.7.egg/plone/dexterity/content.py", line 411, in __getattr__
    raise AttributeError(name)


FAILED:  plone.app.portlets.tests.test_navigation_portlet.TestRenderer.testRootIsCurrent

Error Message:
file

Stack Trace:
file

  File "/srv/python2.7/lib/python2.7/unittest/case.py", line 320, in run
    self.setUp()
  File "/home/jenkins/.buildout/eggs/cp27m/plone.app.portlets-4.4.6-py2.7.egg/plone/app/portlets/tests/base.py", line 22, in setUp
    self.afterSetUp()
  File "/home/jenkins/.buildout/eggs/cp27m/plone.app.portlets-4.4.6-py2.7.egg/plone/app/portlets/tests/test_navigation_portlet.py", line 96, in afterSetUp
    self.populateSite()
  File "/home/jenkins/.buildout/eggs/cp27m/plone.app.portlets-4.4.6-py2.7.egg/plone/app/portlets/tests/test_navigation_portlet.py", line 140, in populateSite
    folder2.invokeFactory('File', 'file21')
  File "/home/jenkins/.buildout/eggs/cp27m/plone.dexterity-2.10.0-py2.7.egg/plone/dexterity/content.py", line 833, in invokeFactory
    type_name, id, RESPONSE, *args, **kw
  File "/home/jenkins/.buildout/eggs/cp27m/Products.CMFCore-2.4.8-py2.7.egg/Products/CMFCore/PortalFolder.py", line 300, in invokeFactory
    *args, **kw)
  File "/home/jenkins/.buildout/eggs/cp27m/Products.CMFCore-2.4.8-py2.7.egg/Products/CMFCore/TypesTool.py", line 809, in constructContent
    ob = info.constructInstance(container, id, *args, **kw)
  File "/home/jenkins/.buildout/eggs/cp27m/Products.CMFCore-2.4.8-py2.7.egg/Products/CMFCore/TypesTool.py", line 308, in constructInstance
    return self._constructInstance(container, id, *args, **kw)
  File "/home/jenkins/.buildout/eggs/cp27m/Products.CMFCore-2.4.8-py2.7.egg/Products/CMFCore/TypesTool.py", line 569, in _constructInstance
    notify(ObjectCreatedEvent(obj))
  File "/home/jenkins/.buildout/eggs/cp27m/zope.event-4.5.0-py2.7.egg/zope/event/__init__.py", line 32, in notify
    subscriber(event)
  File "/home/jenkins/.buildout/eggs/cp27m/zope.component-4.6.2-py2.7.egg/zope/component/event.py", line 27, in dispatch
    component_subscribers(event, None)
  File "/home/jenkins/.buildout/eggs/cp27m/zope.component-4.6.2-py2.7.egg/zope/component/_api.py", line 134, in subscribers
    return sitemanager.subscribers(objects, interface)
  File "/home/jenkins/.buildout/eggs/cp27m/zope.interface-5.2.0-py2.7-linux-x86_64.egg/zope/interface/registry.py", line 448, in subscribers
    return self.adapters.subscribers(objects, provided)
  File "/home/jenkins/.buildout/eggs/cp27m/zope.interface-5.2.0-py2.7-linux-x86_64.egg/zope/interface/adapter.py", line 619, in subscribers
    subscription(*objects)
  File "/home/jenkins/.buildout/eggs/cp27m/zope.component-4.6.2-py2.7.egg/zope/component/event.py", line 36, in objectEventNotify
    component_subscribers((event.object, event), None)
  File "/home/jenkins/.buildout/eggs/cp27m/zope.component-4.6.2-py2.7.egg/zope/component/_api.py", line 134, in subscribers
    return sitemanager.subscribers(objects, interface)
  File "/home/jenkins/.buildout/eggs/cp27m/zope.interface-5.2.0-py2.7-linux-x86_64.egg/zope/interface/registry.py", line 448, in subscribers
    return self.adapters.subscribers(objects, provided)
  File "/home/jenkins/.buildout/eggs/cp27m/zope.interface-5.2.0-py2.7-linux-x86_64.egg/zope/interface/adapter.py", line 619, in subscribers
    subscription(*objects)
  File "/home/jenkins/.buildout/eggs/cp27m/plone.app.contenttypes-2.2.1-py2.7.egg/plone/app/contenttypes/subscribers.py", line 16, in set_title_description
    datafield = obj.file
  File "/home/jenkins/.buildout/eggs/cp27m/plone.dexterity-2.10.0-py2.7.egg/plone/dexterity/content.py", line 411, in __getattr__
    raise AttributeError(name)


FAILED:  plone.app.portlets.tests.test_navigation_portlet.TestRenderer.testRootIsCurrentWithFolderishDefaultPage

Error Message:
file

Stack Trace:
file

  File "/srv/python2.7/lib/python2.7/unittest/case.py", line 320, in run
    self.setUp()
  File "/home/jenkins/.buildout/eggs/cp27m/plone.app.portlets-4.4.6-py2.7.egg/plone/app/portlets/tests/base.py", line 22, in setUp
    self.afterSetUp()
  File "/home/jenkins/.buildout/eggs/cp27m/plone.app.portlets-4.4.6-py2.7.egg/plone/app/portlets/tests/test_navigation_portlet.py", line 96, in afterSetUp
    self.populateSite()
  File "/home/jenkins/.buildout/eggs/cp27m/plone.app.portlets-4.4.6-py2.7.egg/plone/app/portlets/tests/test_navigation_portlet.py", line 140, in populateSite
    folder2.invokeFactory('File', 'file21')
  File "/home/jenkins/.buildout/eggs/cp27m/plone.dexterity-2.10.0-py2.7.egg/plone/dexterity/content.py", line 833, in invokeFactory
    type_name, id, RESPONSE, *args, **kw
  File "/home/jenkins/.buildout/eggs/cp27m/Products.CMFCore-2.4.8-py2.7.egg/Products/CMFCore/PortalFolder.py", line 300, in invokeFactory
    *args, **kw)
  File "/home/jenkins/.buildout/eggs/cp27m/Products.CMFCore-2.4.8-py2.7.egg/Products/CMFCore/TypesTool.py", line 809, in constructContent
    ob = info.constructInstance(container, id, *args, **kw)
  File "/home/jenkins/.buildout/eggs/cp27m/Products.CMFCore-2.4.8-py2.7.egg/Products/CMFCore/TypesTool.py", line 308, in constructInstance
    return self._constructInstance(container, id, *args, **kw)
  File "/home/jenkins/.buildout/eggs/cp27m/Products.CMFCore-2.4.8-py2.7.egg/Products/CMFCore/TypesTool.py", line 569, in _constructInstance
    notify(ObjectCreatedEvent(obj))
  File "/home/jenkins/.buildout/eggs/cp27m/zope.event-4.5.0-py2.7.egg/zope/event/__init__.py", line 32, in notify
    subscriber(event)
  File "/home/jenkins/.buildout/eggs/cp27m/zope.component-4.6.2-py2.7.egg/zope/component/event.py", line 27, in dispatch
    component_subscribers(event, None)
  File "/home/jenkins/.buildout/eggs/cp27m/zope.component-4.6.2-py2.7.egg/zope/component/_api.py", line 134, in subscribers
    return sitemanager.subscribers(objects, interface)
  File "/home/jenkins/.buildout/eggs/cp27m/zope.interface-5.2.0-py2.7-linux-x86_64.egg/zope/interface/registry.py", line 448, in subscribers
    return self.adapters.subscribers(objects, provided)
  File "/home/jenkins/.buildout/eggs/cp27m/zope.interface-5.2.0-py2.7-linux-x86_64.egg/zope/interface/adapter.py", line 619, in subscribers
    subscription(*objects)
  File "/home/jenkins/.buildout/eggs/cp27m/zope.component-4.6.2-py2.7.egg/zope/component/event.py", line 36, in objectEventNotify
    component_subscribers((event.object, event), None)
  File "/home/jenkins/.buildout/eggs/cp27m/zope.component-4.6.2-py2.7.egg/zope/component/_api.py", line 134, in subscribers
    return sitemanager.subscribers(objects, interface)
  File "/home/jenkins/.buildout/eggs/cp27m/zope.interface-5.2.0-py2.7-linux-x86_64.egg/zope/interface/registry.py", line 448, in subscribers
    return self.adapters.subscribers(objects, provided)
  File "/home/jenkins/.buildout/eggs/cp27m/zope.interface-5.2.0-py2.7-linux-x86_64.egg/zope/interface/adapter.py", line 619, in subscribers
    subscription(*objects)
  File "/home/jenkins/.buildout/eggs/cp27m/plone.app.contenttypes-2.2.1-py2.7.egg/plone/app/contenttypes/subscribers.py", line 16, in set_title_description
    datafield = obj.file
  File "/home/jenkins/.buildout/eggs/cp27m/plone.dexterity-2.10.0-py2.7.egg/plone/dexterity/content.py", line 411, in __getattr__
    raise AttributeError(name)


FAILED:  plone.app.portlets.tests.test_navigation_portlet.TestRenderer.testRootIsNotPortal

Error Message:
file

Stack Trace:
file

  File "/srv/python2.7/lib/python2.7/unittest/case.py", line 320, in run
    self.setUp()
  File "/home/jenkins/.buildout/eggs/cp27m/plone.app.portlets-4.4.6-py2.7.egg/plone/app/portlets/tests/base.py", line 22, in setUp
    self.afterSetUp()
  File "/home/jenkins/.buildout/eggs/cp27m/plone.app.portlets-4.4.6-py2.7.egg/plone/app/portlets/tests/test_navigation_portlet.py", line 96, in afterSetUp
    self.populateSite()
  File "/home/jenkins/.buildout/eggs/cp27m/plone.app.portlets-4.4.6-py2.7.egg/plone/app/portlets/tests/test_navigation_portlet.py", line 140, in populateSite
    folder2.invokeFactory('File', 'file21')
  File "/home/jenkins/.buildout/eggs/cp27m/plone.dexterity-2.10.0-py2.7.egg/plone/dexterity/content.py", line 833, in invokeFactory
    type_name, id, RESPONSE, *args, **kw
  File "/home/jenkins/.buildout/eggs/cp27m/Products.CMFCore-2.4.8-py2.7.egg/Products/CMFCore/PortalFolder.py", line 300, in invokeFactory
    *args, **kw)
  File "/home/jenkins/.buildout/eggs/cp27m/Products.CMFCore-2.4.8-py2.7.egg/Products/CMFCore/TypesTool.py", line 809, in constructContent
    ob = info.constructInstance(container, id, *args, **kw)
  File "/home/jenkins/.buildout/eggs/cp27m/Products.CMFCore-2.4.8-py2.7.egg/Products/CMFCore/TypesTool.py", line 308, in constructInstance
    return self._constructInstance(container, id, *args, **kw)
  File "/home/jenkins/.buildout/eggs/cp27m/Products.CMFCore-2.4.8-py2.7.egg/Products/CMFCore/TypesTool.py", line 569, in _constructInstance
    notify(ObjectCreatedEvent(obj))
  File "/home/jenkins/.buildout/eggs/cp27m/zope.event-4.5.0-py2.7.egg/zope/event/__init__.py", line 32, in notify
    subscriber(event)
  File "/home/jenkins/.buildout/eggs/cp27m/zope.component-4.6.2-py2.7.egg/zope/component/event.py", line 27, in dispatch
    component_subscribers(event, None)
  File "/home/jenkins/.buildout/eggs/cp27m/zope.component-4.6.2-py2.7.egg/zope/component/_api.py", line 134, in subscribers
    return sitemanager.subscribers(objects, interface)
  File "/home/jenkins/.buildout/eggs/cp27m/zope.interface-5.2.0-py2.7-linux-x86_64.egg/zope/interface/registry.py", line 448, in subscribers
    return self.adapters.subscribers(objects, provided)
  File "/home/jenkins/.buildout/eggs/cp27m/zope.interface-5.2.0-py2.7-linux-x86_64.egg/zope/interface/adapter.py", line 619, in subscribers
    subscription(*objects)
  File "/home/jenkins/.buildout/eggs/cp27m/zope.component-4.6.2-py2.7.egg/zope/component/event.py", line 36, in objectEventNotify
    component_subscribers((event.object, event), None)
  File "/home/jenkins/.buildout/eggs/cp27m/zope.component-4.6.2-py2.7.egg/zope/component/_api.py", line 134, in subscribers
    return sitemanager.subscribers(objects, interface)
  File "/home/jenkins/.buildout/eggs/cp27m/zope.interface-5.2.0-py2.7-linux-x86_64.egg/zope/interface/registry.py", line 448, in subscribers
    return self.adapters.subscribers(objects, provided)
  File "/home/jenkins/.buildout/eggs/cp27m/zope.interface-5.2.0-py2.7-linux-x86_64.egg/zope/interface/adapter.py", line 619, in subscribers
    subscription(*objects)
  File "/home/jenkins/.buildout/eggs/cp27m/plone.app.contenttypes-2.2.1-py2.7.egg/plone/app/contenttypes/subscribers.py", line 16, in set_title_description
    datafield = obj.file
  File "/home/jenkins/.buildout/eggs/cp27m/plone.dexterity-2.10.0-py2.7.egg/plone/dexterity/content.py", line 411, in __getattr__
    raise AttributeError(name)


FAILED:  plone.app.portlets.tests.test_navigation_portlet.TestRenderer.testShowAllParentsOverridesBottomLevel

Error Message:
file

Stack Trace:
file

  File "/srv/python2.7/lib/python2.7/unittest/case.py", line 320, in run
    self.setUp()
  File "/home/jenkins/.buildout/eggs/cp27m/plone.app.portlets-4.4.6-py2.7.egg/plone/app/portlets/tests/base.py", line 22, in setUp
    self.afterSetUp()
  File "/home/jenkins/.buildout/eggs/cp27m/plone.app.portlets-4.4.6-py2.7.egg/plone/app/portlets/tests/test_navigation_portlet.py", line 96, in afterSetUp
    self.populateSite()
  File "/home/jenkins/.buildout/eggs/cp27m/plone.app.portlets-4.4.6-py2.7.egg/plone/app/portlets/tests/test_navigation_portlet.py", line 140, in populateSite
    folder2.invokeFactory('File', 'file21')
  File "/home/jenkins/.buildout/eggs/cp27m/plone.dexterity-2.10.0-py2.7.egg/plone/dexterity/content.py", line 833, in invokeFactory
    type_name, id, RESPONSE, *args, **kw
  File "/home/jenkins/.buildout/eggs/cp27m/Products.CMFCore-2.4.8-py2.7.egg/Products/CMFCore/PortalFolder.py", line 300, in invokeFactory
    *args, **kw)
  File "/home/jenkins/.buildout/eggs/cp27m/Products.CMFCore-2.4.8-py2.7.egg/Products/CMFCore/TypesTool.py", line 809, in constructContent
    ob = info.constructInstance(container, id, *args, **kw)
  File "/home/jenkins/.buildout/eggs/cp27m/Products.CMFCore-2.4.8-py2.7.egg/Products/CMFCore/TypesTool.py", line 308, in constructInstance
    return self._constructInstance(container, id, *args, **kw)
  File "/home/jenkins/.buildout/eggs/cp27m/Products.CMFCore-2.4.8-py2.7.egg/Products/CMFCore/TypesTool.py", line 569, in _constructInstance
    notify(ObjectCreatedEvent(obj))
  File "/home/jenkins/.buildout/eggs/cp27m/zope.event-4.5.0-py2.7.egg/zope/event/__init__.py", line 32, in notify
    subscriber(event)
  File "/home/jenkins/.buildout/eggs/cp27m/zope.component-4.6.2-py2.7.egg/zope/component/event.py", line 27, in dispatch
    component_subscribers(event, None)
  File "/home/jenkins/.buildout/eggs/cp27m/zope.component-4.6.2-py2.7.egg/zope/component/_api.py", line 134, in subscribers
    return sitemanager.subscribers(objects, interface)
  File "/home/jenkins/.buildout/eggs/cp27m/zope.interface-5.2.0-py2.7-linux-x86_64.egg/zope/interface/registry.py", line 448, in subscribers
    return self.adapters.subscribers(objects, provided)
  File "/home/jenkins/.buildout/eggs/cp27m/zope.interface-5.2.0-py2.7-linux-x86_64.egg/zope/interface/adapter.py", line 619, in subscribers
    subscription(*objects)
  File "/home/jenkins/.buildout/eggs/cp27m/zope.component-4.6.2-py2.7.egg/zope/component/event.py", line 36, in objectEventNotify
    component_subscribers((event.object, event), None)
  File "/home/jenkins/.buildout/eggs/cp27m/zope.component-4.6.2-py2.7.egg/zope/component/_api.py", line 134, in subscribers
    return sitemanager.subscribers(objects, interface)
  File "/home/jenkins/.buildout/eggs/cp27m/zope.interface-5.2.0-py2.7-linux-x86_64.egg/zope/interface/registry.py", line 448, in subscribers
    return self.adapters.subscribers(objects, provided)
  File "/home/jenkins/.buildout/eggs/cp27m/zope.interface-5.2.0-py2.7-linux-x86_64.egg/zope/interface/adapter.py", line 619, in subscribers
    subscription(*objects)
  File "/home/jenkins/.buildout/eggs/cp27m/plone.app.contenttypes-2.2.1-py2.7.egg/plone/app/contenttypes/subscribers.py", line 16, in set_title_description
    datafield = obj.file
  File "/home/jenkins/.buildout/eggs/cp27m/plone.dexterity-2.10.0-py2.7.egg/plone/dexterity/content.py", line 411, in __getattr__
    raise AttributeError(name)


FAILED:  plone.app.portlets.tests.test_navigation_portlet.TestRenderer.testShowAllParentsOverridesNavTreeExcludesItemsWithExcludeProperty

Error Message:
file

Stack Trace:
file

  File "/srv/python2.7/lib/python2.7/unittest/case.py", line 320, in run
    self.setUp()
  File "/home/jenkins/.buildout/eggs/cp27m/plone.app.portlets-4.4.6-py2.7.egg/plone/app/portlets/tests/base.py", line 22, in setUp
    self.afterSetUp()
  File "/home/jenkins/.buildout/eggs/cp27m/plone.app.portlets-4.4.6-py2.7.egg/plone/app/portlets/tests/test_navigation_portlet.py", line 96, in afterSetUp
    self.populateSite()
  File "/home/jenkins/.buildout/eggs/cp27m/plone.app.portlets-4.4.6-py2.7.egg/plone/app/portlets/tests/test_navigation_portlet.py", line 140, in populateSite
    folder2.invokeFactory('File', 'file21')
  File "/home/jenkins/.buildout/eggs/cp27m/plone.dexterity-2.10.0-py2.7.egg/plone/dexterity/content.py", line 833, in invokeFactory
    type_name, id, RESPONSE, *args, **kw
  File "/home/jenkins/.buildout/eggs/cp27m/Products.CMFCore-2.4.8-py2.7.egg/Products/CMFCore/PortalFolder.py", line 300, in invokeFactory
    *args, **kw)
  File "/home/jenkins/.buildout/eggs/cp27m/Products.CMFCore-2.4.8-py2.7.egg/Products/CMFCore/TypesTool.py", line 809, in constructContent
    ob = info.constructInstance(container, id, *args, **kw)
  File "/home/jenkins/.buildout/eggs/cp27m/Products.CMFCore-2.4.8-py2.7.egg/Products/CMFCore/TypesTool.py", line 308, in constructInstance
    return self._constructInstance(container, id, *args, **kw)
  File "/home/jenkins/.buildout/eggs/cp27m/Products.CMFCore-2.4.8-py2.7.egg/Products/CMFCore/TypesTool.py", line 569, in _constructInstance
    notify(ObjectCreatedEvent(obj))
  File "/home/jenkins/.buildout/eggs/cp27m/zope.event-4.5.0-py2.7.egg/zope/event/__init__.py", line 32, in notify
    subscriber(event)
  File "/home/jenkins/.buildout/eggs/cp27m/zope.component-4.6.2-py2.7.egg/zope/component/event.py", line 27, in dispatch
    component_subscribers(event, None)
  File "/home/jenkins/.buildout/eggs/cp27m/zope.component-4.6.2-py2.7.egg/zope/component/_api.py", line 134, in subscribers
    return sitemanager.subscribers(objects, interface)
  File "/home/jenkins/.buildout/eggs/cp27m/zope.interface-5.2.0-py2.7-linux-x86_64.egg/zope/interface/registry.py", line 448, in subscribers
    return self.adapters.subscribers(objects, provided)
  File "/home/jenkins/.buildout/eggs/cp27m/zope.interface-5.2.0-py2.7-linux-x86_64.egg/zope/interface/adapter.py", line 619, in subscribers
    subscription(*objects)
  File "/home/jenkins/.buildout/eggs/cp27m/zope.component-4.6.2-py2.7.egg/zope/component/event.py", line 36, in objectEventNotify
    component_subscribers((event.object, event), None)
  File "/home/jenkins/.buildout/eggs/cp27m/zope.component-4.6.2-py2.7.egg/zope/component/_api.py", line 134, in subscribers
    return sitemanager.subscribers(objects, interface)
  File "/home/jenkins/.buildout/eggs/cp27m/zope.interface-5.2.0-py2.7-linux-x86_64.egg/zope/interface/registry.py", line 448, in subscribers
    return self.adapters.subscribers(objects, provided)
  File "/home/jenkins/.buildout/eggs/cp27m/zope.interface-5.2.0-py2.7-linux-x86_64.egg/zope/interface/adapter.py", line 619, in subscribers
    subscription(*objects)
  File "/home/jenkins/.buildout/eggs/cp27m/plone.app.contenttypes-2.2.1-py2.7.egg/plone/app/contenttypes/subscribers.py", line 16, in set_title_description
    datafield = obj.file
  File "/home/jenkins/.buildout/eggs/cp27m/plone.dexterity-2.10.0-py2.7.egg/plone/dexterity/content.py", line 411, in __getattr__
    raise AttributeError(name)


FAILED:  plone.app.portlets.tests.test_navigation_portlet.TestRenderer.testStateFiltering

Error Message:
file

Stack Trace:
file

  File "/srv/python2.7/lib/python2.7/unittest/case.py", line 320, in run
    self.setUp()
  File "/home/jenkins/.buildout/eggs/cp27m/plone.app.portlets-4.4.6-py2.7.egg/plone/app/portlets/tests/base.py", line 22, in setUp
    self.afterSetUp()
  File "/home/jenkins/.buildout/eggs/cp27m/plone.app.portlets-4.4.6-py2.7.egg/plone/app/portlets/tests/test_navigation_portlet.py", line 96, in afterSetUp
    self.populateSite()
  File "/home/jenkins/.buildout/eggs/cp27m/plone.app.portlets-4.4.6-py2.7.egg/plone/app/portlets/tests/test_navigation_portlet.py", line 140, in populateSite
    folder2.invokeFactory('File', 'file21')
  File "/home/jenkins/.buildout/eggs/cp27m/plone.dexterity-2.10.0-py2.7.egg/plone/dexterity/content.py", line 833, in invokeFactory
    type_name, id, RESPONSE, *args, **kw
  File "/home/jenkins/.buildout/eggs/cp27m/Products.CMFCore-2.4.8-py2.7.egg/Products/CMFCore/PortalFolder.py", line 300, in invokeFactory
    *args, **kw)
  File "/home/jenkins/.buildout/eggs/cp27m/Products.CMFCore-2.4.8-py2.7.egg/Products/CMFCore/TypesTool.py", line 809, in constructContent
    ob = info.constructInstance(container, id, *args, **kw)
  File "/home/jenkins/.buildout/eggs/cp27m/Products.CMFCore-2.4.8-py2.7.egg/Products/CMFCore/TypesTool.py", line 308, in constructInstance
    return self._constructInstance(container, id, *args, **kw)
  File "/home/jenkins/.buildout/eggs/cp27m/Products.CMFCore-2.4.8-py2.7.egg/Products/CMFCore/TypesTool.py", line 569, in _constructInstance
    notify(ObjectCreatedEvent(obj))
  File "/home/jenkins/.buildout/eggs/cp27m/zope.event-4.5.0-py2.7.egg/zope/event/__init__.py", line 32, in notify
    subscriber(event)
  File "/home/jenkins/.buildout/eggs/cp27m/zope.component-4.6.2-py2.7.egg/zope/component/event.py", line 27, in dispatch
    component_subscribers(event, None)
  File "/home/jenkins/.buildout/eggs/cp27m/zope.component-4.6.2-py2.7.egg/zope/component/_api.py", line 134, in subscribers
    return sitemanager.subscribers(objects, interface)
  File "/home/jenkins/.buildout/eggs/cp27m/zope.interface-5.2.0-py2.7-linux-x86_64.egg/zope/interface/registry.py", line 448, in subscribers
    return self.adapters.subscribers(objects, provided)
  File "/home/jenkins/.buildout/eggs/cp27m/zope.interface-5.2.0-py2.7-linux-x86_64.egg/zope/interface/adapter.py", line 619, in subscribers
    subscription(*objects)
  File "/home/jenkins/.buildout/eggs/cp27m/zope.component-4.6.2-py2.7.egg/zope/component/event.py", line 36, in objectEventNotify
    component_subscribers((event.object, event), None)
  File "/home/jenkins/.buildout/eggs/cp27m/zope.component-4.6.2-py2.7.egg/zope/component/_api.py", line 134, in subscribers
    return sitemanager.subscribers(objects, interface)
  File "/home/jenkins/.buildout/eggs/cp27m/zope.interface-5.2.0-py2.7-linux-x86_64.egg/zope/interface/registry.py", line 448, in subscribers
    return self.adapters.subscribers(objects, provided)
  File "/home/jenkins/.buildout/eggs/cp27m/zope.interface-5.2.0-py2.7-linux-x86_64.egg/zope/interface/adapter.py", line 619, in subscribers
    subscription(*objects)
  File "/home/jenkins/.buildout/eggs/cp27m/plone.app.contenttypes-2.2.1-py2.7.egg/plone/app/contenttypes/subscribers.py", line 16, in set_title_description
    datafield = obj.file
  File "/home/jenkins/.buildout/eggs/cp27m/plone.dexterity-2.10.0-py2.7.egg/plone/dexterity/content.py", line 411, in __getattr__
    raise AttributeError(name)


FAILED:  plone.app.portlets.tests.test_navigation_portlet.TestRenderer.testTopLevel

Error Message:
file

Stack Trace:
file

  File "/srv/python2.7/lib/python2.7/unittest/case.py", line 320, in run
    self.setUp()
  File "/home/jenkins/.buildout/eggs/cp27m/plone.app.portlets-4.4.6-py2.7.egg/plone/app/portlets/tests/base.py", line 22, in setUp
    self.afterSetUp()
  File "/home/jenkins/.buildout/eggs/cp27m/plone.app.portlets-4.4.6-py2.7.egg/plone/app/portlets/tests/test_navigation_portlet.py", line 96, in afterSetUp
    self.populateSite()
  File "/home/jenkins/.buildout/eggs/cp27m/plone.app.portlets-4.4.6-py2.7.egg/plone/app/portlets/tests/test_navigation_portlet.py", line 140, in populateSite
    folder2.invokeFactory('File', 'file21')
  File "/home/jenkins/.buildout/eggs/cp27m/plone.dexterity-2.10.0-py2.7.egg/plone/dexterity/content.py", line 833, in invokeFactory
    type_name, id, RESPONSE, *args, **kw
  File "/home/jenkins/.buildout/eggs/cp27m/Products.CMFCore-2.4.8-py2.7.egg/Products/CMFCore/PortalFolder.py", line 300, in invokeFactory
    *args, **kw)
  File "/home/jenkins/.buildout/eggs/cp27m/Products.CMFCore-2.4.8-py2.7.egg/Products/CMFCore/TypesTool.py", line 809, in constructContent
    ob = info.constructInstance(container, id, *args, **kw)
  File "/home/jenkins/.buildout/eggs/cp27m/Products.CMFCore-2.4.8-py2.7.egg/Products/CMFCore/TypesTool.py", line 308, in constructInstance
    return self._constructInstance(container, id, *args, **kw)
  File "/home/jenkins/.buildout/eggs/cp27m/Products.CMFCore-2.4.8-py2.7.egg/Products/CMFCore/TypesTool.py", line 569, in _constructInstance
    notify(ObjectCreatedEvent(obj))
  File "/home/jenkins/.buildout/eggs/cp27m/zope.event-4.5.0-py2.7.egg/zope/event/__init__.py", line 32, in notify
    subscriber(event)
  File "/home/jenkins/.buildout/eggs/cp27m/zope.component-4.6.2-py2.7.egg/zope/component/event.py", line 27, in dispatch
    component_subscribers(event, None)
  File "/home/jenkins/.buildout/eggs/cp27m/zope.component-4.6.2-py2.7.egg/zope/component/_api.py", line 134, in subscribers
    return sitemanager.subscribers(objects, interface)
  File "/home/jenkins/.buildout/eggs/cp27m/zope.interface-5.2.0-py2.7-linux-x86_64.egg/zope/interface/registry.py", line 448, in subscribers
    return self.adapters.subscribers(objects, provided)
  File "/home/jenkins/.buildout/eggs/cp27m/zope.interface-5.2.0-py2.7-linux-x86_64.egg/zope/interface/adapter.py", line 619, in subscribers
    subscription(*objects)
  File "/home/jenkins/.buildout/eggs/cp27m/zope.component-4.6.2-py2.7.egg/zope/component/event.py", line 36, in objectEventNotify
    component_subscribers((event.object, event), None)
  File "/home/jenkins/.buildout/eggs/cp27m/zope.component-4.6.2-py2.7.egg/zope/component/_api.py", line 134, in subscribers
    return sitemanager.subscribers(objects, interface)
  File "/home/jenkins/.buildout/eggs/cp27m/zope.interface-5.2.0-py2.7-linux-x86_64.egg/zope/interface/registry.py", line 448, in subscribers
    return self.adapters.subscribers(objects, provided)
  File "/home/jenkins/.buildout/eggs/cp27m/zope.interface-5.2.0-py2.7-linux-x86_64.egg/zope/interface/adapter.py", line 619, in subscribers
    subscription(*objects)
  File "/home/jenkins/.buildout/eggs/cp27m/plone.app.contenttypes-2.2.1-py2.7.egg/plone/app/contenttypes/subscribers.py", line 16, in set_title_description
    datafield = obj.file
  File "/home/jenkins/.buildout/eggs/cp27m/plone.dexterity-2.10.0-py2.7.egg/plone/dexterity/content.py", line 411, in __getattr__
    raise AttributeError(name)


FAILED:  plone.app.portlets.tests.test_navigation_portlet.TestRenderer.testTopLevelTooDeep

Error Message:
file

Stack Trace:
file

  File "/srv/python2.7/lib/python2.7/unittest/case.py", line 320, in run
    self.setUp()
  File "/home/jenkins/.buildout/eggs/cp27m/plone.app.portlets-4.4.6-py2.7.egg/plone/app/portlets/tests/base.py", line 22, in setUp
    self.afterSetUp()
  File "/home/jenkins/.buildout/eggs/cp27m/plone.app.portlets-4.4.6-py2.7.egg/plone/app/portlets/tests/test_navigation_portlet.py", line 96, in afterSetUp
    self.populateSite()
  File "/home/jenkins/.buildout/eggs/cp27m/plone.app.portlets-4.4.6-py2.7.egg/plone/app/portlets/tests/test_navigation_portlet.py", line 140, in populateSite
    folder2.invokeFactory('File', 'file21')
  File "/home/jenkins/.buildout/eggs/cp27m/plone.dexterity-2.10.0-py2.7.egg/plone/dexterity/content.py", line 833, in invokeFactory
    type_name, id, RESPONSE, *args, **kw
  File "/home/jenkins/.buildout/eggs/cp27m/Products.CMFCore-2.4.8-py2.7.egg/Products/CMFCore/PortalFolder.py", line 300, in invokeFactory
    *args, **kw)
  File "/home/jenkins/.buildout/eggs/cp27m/Products.CMFCore-2.4.8-py2.7.egg/Products/CMFCore/TypesTool.py", line 809, in constructContent
    ob = info.constructInstance(container, id, *args, **kw)
  File "/home/jenkins/.buildout/eggs/cp27m/Products.CMFCore-2.4.8-py2.7.egg/Products/CMFCore/TypesTool.py", line 308, in constructInstance
    return self._constructInstance(container, id, *args, **kw)
  File "/home/jenkins/.buildout/eggs/cp27m/Products.CMFCore-2.4.8-py2.7.egg/Products/CMFCore/TypesTool.py", line 569, in _constructInstance
    notify(ObjectCreatedEvent(obj))
  File "/home/jenkins/.buildout/eggs/cp27m/zope.event-4.5.0-py2.7.egg/zope/event/__init__.py", line 32, in notify
    subscriber(event)
  File "/home/jenkins/.buildout/eggs/cp27m/zope.component-4.6.2-py2.7.egg/zope/component/event.py", line 27, in dispatch
    component_subscribers(event, None)
  File "/home/jenkins/.buildout/eggs/cp27m/zope.component-4.6.2-py2.7.egg/zope/component/_api.py", line 134, in subscribers
    return sitemanager.subscribers(objects, interface)
  File "/home/jenkins/.buildout/eggs/cp27m/zope.interface-5.2.0-py2.7-linux-x86_64.egg/zope/interface/registry.py", line 448, in subscribers
    return self.adapters.subscribers(objects, provided)
  File "/home/jenkins/.buildout/eggs/cp27m/zope.interface-5.2.0-py2.7-linux-x86_64.egg/zope/interface/adapter.py", line 619, in subscribers
    subscription(*objects)
  File "/home/jenkins/.buildout/eggs/cp27m/zope.component-4.6.2-py2.7.egg/zope/component/event.py", line 36, in objectEventNotify
    component_subscribers((event.object, event), None)
  File "/home/jenkins/.buildout/eggs/cp27m/zope.component-4.6.2-py2.7.egg/zope/component/_api.py", line 134, in subscribers
    return sitemanager.subscribers(objects, interface)
  File "/home/jenkins/.buildout/eggs/cp27m/zope.interface-5.2.0-py2.7-linux-x86_64.egg/zope/interface/registry.py", line 448, in subscribers
    return self.adapters.subscribers(objects, provided)
  File "/home/jenkins/.buildout/eggs/cp27m/zope.interface-5.2.0-py2.7-linux-x86_64.egg/zope/interface/adapter.py", line 619, in subscribers
    subscription(*objects)
  File "/home/jenkins/.buildout/eggs/cp27m/plone.app.contenttypes-2.2.1-py2.7.egg/plone/app/contenttypes/subscribers.py", line 16, in set_title_description
    datafield = obj.file
  File "/home/jenkins/.buildout/eggs/cp27m/plone.dexterity-2.10.0-py2.7.egg/plone/dexterity/content.py", line 411, in __getattr__
    raise AttributeError(name)


FAILED:  plone.app.portlets.tests.test_navigation_portlet.TestRenderer.testTopLevelWithContextAboveLevel

Error Message:
file

Stack Trace:
file

  File "/srv/python2.7/lib/python2.7/unittest/case.py", line 320, in run
    self.setUp()
  File "/home/jenkins/.buildout/eggs/cp27m/plone.app.portlets-4.4.6-py2.7.egg/plone/app/portlets/tests/base.py", line 22, in setUp
    self.afterSetUp()
  File "/home/jenkins/.buildout/eggs/cp27m/plone.app.portlets-4.4.6-py2.7.egg/plone/app/portlets/tests/test_navigation_portlet.py", line 96, in afterSetUp
    self.populateSite()
  File "/home/jenkins/.buildout/eggs/cp27m/plone.app.portlets-4.4.6-py2.7.egg/plone/app/portlets/tests/test_navigation_portlet.py", line 140, in populateSite
    folder2.invokeFactory('File', 'file21')
  File "/home/jenkins/.buildout/eggs/cp27m/plone.dexterity-2.10.0-py2.7.egg/plone/dexterity/content.py", line 833, in invokeFactory
    type_name, id, RESPONSE, *args, **kw
  File "/home/jenkins/.buildout/eggs/cp27m/Products.CMFCore-2.4.8-py2.7.egg/Products/CMFCore/PortalFolder.py", line 300, in invokeFactory
    *args, **kw)
  File "/home/jenkins/.buildout/eggs/cp27m/Products.CMFCore-2.4.8-py2.7.egg/Products/CMFCore/TypesTool.py", line 809, in constructContent
    ob = info.constructInstance(container, id, *args, **kw)
  File "/home/jenkins/.buildout/eggs/cp27m/Products.CMFCore-2.4.8-py2.7.egg/Products/CMFCore/TypesTool.py", line 308, in constructInstance
    return self._constructInstance(container, id, *args, **kw)
  File "/home/jenkins/.buildout/eggs/cp27m/Products.CMFCore-2.4.8-py2.7.egg/Products/CMFCore/TypesTool.py", line 569, in _constructInstance
    notify(ObjectCreatedEvent(obj))
  File "/home/jenkins/.buildout/eggs/cp27m/zope.event-4.5.0-py2.7.egg/zope/event/__init__.py", line 32, in notify
    subscriber(event)
  File "/home/jenkins/.buildout/eggs/cp27m/zope.component-4.6.2-py2.7.egg/zope/component/event.py", line 27, in dispatch
    component_subscribers(event, None)
  File "/home/jenkins/.buildout/eggs/cp27m/zope.component-4.6.2-py2.7.egg/zope/component/_api.py", line 134, in subscribers
    return sitemanager.subscribers(objects, interface)
  File "/home/jenkins/.buildout/eggs/cp27m/zope.interface-5.2.0-py2.7-linux-x86_64.egg/zope/interface/registry.py", line 448, in subscribers
    return self.adapters.subscribers(objects, provided)
  File "/home/jenkins/.buildout/eggs/cp27m/zope.interface-5.2.0-py2.7-linux-x86_64.egg/zope/interface/adapter.py", line 619, in subscribers
    subscription(*objects)
  File "/home/jenkins/.buildout/eggs/cp27m/zope.component-4.6.2-py2.7.egg/zope/component/event.py", line 36, in objectEventNotify
    component_subscribers((event.object, event), None)
  File "/home/jenkins/.buildout/eggs/cp27m/zope.component-4.6.2-py2.7.egg/zope/component/_api.py", line 134, in subscribers
    return sitemanager.subscribers(objects, interface)
  File "/home/jenkins/.buildout/eggs/cp27m/zope.interface-5.2.0-py2.7-linux-x86_64.egg/zope/interface/registry.py", line 448, in subscribers
    return self.adapters.subscribers(objects, provided)
  File "/home/jenkins/.buildout/eggs/cp27m/zope.interface-5.2.0-py2.7-linux-x86_64.egg/zope/interface/adapter.py", line 619, in subscribers
    subscription(*objects)
  File "/home/jenkins/.buildout/eggs/cp27m/plone.app.contenttypes-2.2.1-py2.7.egg/plone/app/contenttypes/subscribers.py", line 16, in set_title_description
    datafield = obj.file
  File "/home/jenkins/.buildout/eggs/cp27m/plone.dexterity-2.10.0-py2.7.egg/plone/dexterity/content.py", line 411, in __getattr__
    raise AttributeError(name)


FAILED:  plone.app.portlets.tests.test_navigation_portlet.TestRenderer.testTopLevelWithNavigationRoot

Error Message:
file

Stack Trace:
file

  File "/srv/python2.7/lib/python2.7/unittest/case.py", line 320, in run
    self.setUp()
  File "/home/jenkins/.buildout/eggs/cp27m/plone.app.portlets-4.4.6-py2.7.egg/plone/app/portlets/tests/base.py", line 22, in setUp
    self.afterSetUp()
  File "/home/jenkins/.buildout/eggs/cp27m/plone.app.portlets-4.4.6-py2.7.egg/plone/app/portlets/tests/test_navigation_portlet.py", line 96, in afterSetUp
    self.populateSite()
  File "/home/jenkins/.buildout/eggs/cp27m/plone.app.portlets-4.4.6-py2.7.egg/plone/app/portlets/tests/test_navigation_portlet.py", line 140, in populateSite
    folder2.invokeFactory('File', 'file21')
  File "/home/jenkins/.buildout/eggs/cp27m/plone.dexterity-2.10.0-py2.7.egg/plone/dexterity/content.py", line 833, in invokeFactory
    type_name, id, RESPONSE, *args, **kw
  File "/home/jenkins/.buildout/eggs/cp27m/Products.CMFCore-2.4.8-py2.7.egg/Products/CMFCore/PortalFolder.py", line 300, in invokeFactory
    *args, **kw)
  File "/home/jenkins/.buildout/eggs/cp27m/Products.CMFCore-2.4.8-py2.7.egg/Products/CMFCore/TypesTool.py", line 809, in constructContent
    ob = info.constructInstance(container, id, *args, **kw)
  File "/home/jenkins/.buildout/eggs/cp27m/Products.CMFCore-2.4.8-py2.7.egg/Products/CMFCore/TypesTool.py", line 308, in constructInstance
    return self._constructInstance(container, id, *args, **kw)
  File "/home/jenkins/.buildout/eggs/cp27m/Products.CMFCore-2.4.8-py2.7.egg/Products/CMFCore/TypesTool.py", line 569, in _constructInstance
    notify(ObjectCreatedEvent(obj))
  File "/home/jenkins/.buildout/eggs/cp27m/zope.event-4.5.0-py2.7.egg/zope/event/__init__.py", line 32, in notify
    subscriber(event)
  File "/home/jenkins/.buildout/eggs/cp27m/zope.component-4.6.2-py2.7.egg/zope/component/event.py", line 27, in dispatch
    component_subscribers(event, None)
  File "/home/jenkins/.buildout/eggs/cp27m/zope.component-4.6.2-py2.7.egg/zope/component/_api.py", line 134, in subscribers
    return sitemanager.subscribers(objects, interface)
  File "/home/jenkins/.buildout/eggs/cp27m/zope.interface-5.2.0-py2.7-linux-x86_64.egg/zope/interface/registry.py", line 448, in subscribers
    return self.adapters.subscribers(objects, provided)
  File "/home/jenkins/.buildout/eggs/cp27m/zope.interface-5.2.0-py2.7-linux-x86_64.egg/zope/interface/adapter.py", line 619, in subscribers
    subscription(*objects)
  File "/home/jenkins/.buildout/eggs/cp27m/zope.component-4.6.2-py2.7.egg/zope/component/event.py", line 36, in objectEventNotify
    component_subscribers((event.object, event), None)
  File "/home/jenkins/.buildout/eggs/cp27m/zope.component-4.6.2-py2.7.egg/zope/component/_api.py", line 134, in subscribers
    return sitemanager.subscribers(objects, interface)
  File "/home/jenkins/.buildout/eggs/cp27m/zope.interface-5.2.0-py2.7-linux-x86_64.egg/zope/interface/registry.py", line 448, in subscribers
    return self.adapters.subscribers(objects, provided)
  File "/home/jenkins/.buildout/eggs/cp27m/zope.interface-5.2.0-py2.7-linux-x86_64.egg/zope/interface/adapter.py", line 619, in subscribers
    subscription(*objects)
  File "/home/jenkins/.buildout/eggs/cp27m/plone.app.contenttypes-2.2.1-py2.7.egg/plone/app/contenttypes/subscribers.py", line 16, in set_title_description
    datafield = obj.file
  File "/home/jenkins/.buildout/eggs/cp27m/plone.dexterity-2.10.0-py2.7.egg/plone/dexterity/content.py", line 411, in __getattr__
    raise AttributeError(name)


More information about the Testbot mailing list