[Testbot] Plone 5.2 - Python 2.7 - Build # 1384 - Failure!

jenkins at plone.org jenkins at plone.org
Fri Apr 30 18:39:07 UTC 2021


Plone 5.2 - Python 2.7 - Build # 1384 - Failure:

Check console output at https://jenkins.plone.org/job/plone-5.2-python-2.7/1384/ to view the results.


Plone 5.2 - Python 2.7 - Build # 1384 - Failure:

Check console output at https://jenkins.plone.org/job/plone-5.2-python-2.7/1384/ to view the results.

Test Results:

3 tests failed.
FAILED:  Products.CMFPlone.tests.testSearch.TestSection.test_default_search_order_alphabetic

Error Message:
Lists differ: ['my-page1', 'my-page2', 'my-p... != ['my-page0', 'my-page1', 'my-p...

Stack Trace:
Lists differ: ['my-page1', 'my-page2', 'my-p... != ['my-page0', 'my-page1', 'my-p...

First differing element 0:
'my-page1'
'my-page0'

- ['my-page1',
?          ^

+ ['my-page0',
?          ^

+  'my-page1',
   'my-page2',
   'my-page3',
   'my-page4',
   'my-page5',
   'my-page6',
   'my-page7',
   'my-page8',
-  'my-page9',
?            ^

+  'my-page9']
?            ^

-  'my-page10']

  File "/srv/python2.7/lib/python2.7/unittest/case.py", line 329, in run
    testMethod()
  File "/home/jenkins/workspace/plone-5.2-python-2.7/src/Products.CMFPlone/Products/CMFPlone/tests/testSearch.py", line 218, in test_default_search_order_alphabetic
    self.assertEqual(ids, expected)
  File "/srv/python2.7/lib/python2.7/unittest/case.py", line 513, in assertEqual
    assertion_func(first, second, msg=msg)
  File "/srv/python2.7/lib/python2.7/unittest/case.py", line 743, in assertListEqual
    self.assertSequenceEqual(list1, list2, msg, seq_type=list)
  File "/srv/python2.7/lib/python2.7/unittest/case.py", line 725, in assertSequenceEqual
    self.fail(msg)
  File "/srv/python2.7/lib/python2.7/unittest/case.py", line 410, in fail
    raise self.failureException(msg)


FAILED:  Products.CMFPlone.tests.testSearch.TestSection.test_default_search_order_date

Error Message:
Lists differ: ['my-page0', 'my-page11', 'my-... != ['my-page11', 'my-page10', 'my...

Stack Trace:
Lists differ: ['my-page0', 'my-page11', 'my-... != ['my-page11', 'my-page10', 'my...

First differing element 0:
'my-page0'
'my-page11'

- ['my-page0',
-  'my-page11',
? ^

+ ['my-page11',
? ^

   'my-page10',
   'my-page9',
   'my-page8',
   'my-page7',
   'my-page6',
   'my-page4',
   'my-page3',
-  'my-page2']
?            ^

+  'my-page2',
?            ^

+  'my-page1']

  File "/srv/python2.7/lib/python2.7/unittest/case.py", line 329, in run
    testMethod()
  File "/home/jenkins/workspace/plone-5.2-python-2.7/src/Products.CMFPlone/Products/CMFPlone/tests/testSearch.py", line 200, in test_default_search_order_date
    self.assertEqual(ids, expected)
  File "/srv/python2.7/lib/python2.7/unittest/case.py", line 513, in assertEqual
    assertion_func(first, second, msg=msg)
  File "/srv/python2.7/lib/python2.7/unittest/case.py", line 743, in assertListEqual
    self.assertSequenceEqual(list1, list2, msg, seq_type=list)
  File "/srv/python2.7/lib/python2.7/unittest/case.py", line 725, in assertSequenceEqual
    self.fail(msg)
  File "/srv/python2.7/lib/python2.7/unittest/case.py", line 410, in fail
    raise self.failureException(msg)


FAILED:  Products.CMFPlone.tests.testSearch.TestSection.test_default_search_order_relevance

Error Message:
Lists differ: ['my-page0', 'my-page11', 'my-... != ['my-page11', 'my-page10', 'my...

Stack Trace:
Lists differ: ['my-page0', 'my-page11', 'my-... != ['my-page11', 'my-page10', 'my...

First differing element 0:
'my-page0'
'my-page11'

- ['my-page0',
-  'my-page11',
? ^

+ ['my-page11',
? ^

   'my-page10',
   'my-page9',
   'my-page8',
   'my-page7',
   'my-page6',
   'my-page5',
   'my-page4',
-  'my-page3']
?            ^

+  'my-page3',
?            ^

+  'my-page2']

  File "/srv/python2.7/lib/python2.7/unittest/case.py", line 329, in run
    testMethod()
  File "/home/jenkins/workspace/plone-5.2-python-2.7/src/Products.CMFPlone/Products/CMFPlone/tests/testSearch.py", line 177, in test_default_search_order_relevance
    self.assertEqual(ids, expected)
  File "/srv/python2.7/lib/python2.7/unittest/case.py", line 513, in assertEqual
    assertion_func(first, second, msg=msg)
  File "/srv/python2.7/lib/python2.7/unittest/case.py", line 743, in assertListEqual
    self.assertSequenceEqual(list1, list2, msg, seq_type=list)
  File "/srv/python2.7/lib/python2.7/unittest/case.py", line 725, in assertSequenceEqual
    self.fail(msg)
  File "/srv/python2.7/lib/python2.7/unittest/case.py", line 410, in fail
    raise self.failureException(msg)


More information about the Testbot mailing list