[Testbot] Plone 6.0 - Python 3.8 - Build # 131 - Failure!

jenkins at plone.org jenkins at plone.org
Thu Oct 8 15:06:46 UTC 2020


Plone 6.0 - Python 3.8 - Build # 131 - Failure:

Check console output at https://jenkins.plone.org/job/plone-6.0-python-3.8/131/ to view the results.


Plone 6.0 - Python 3.8 - Build # 131 - Failure:

Check console output at https://jenkins.plone.org/job/plone-6.0-python-3.8/131/ to view the results.

Test Results:

9 tests failed.
FAILED:  plone.app.dexterity.tests.editing.rst

Error Message:
Failed doctest test for editing.rst

Stack Trace:
Failed doctest test for editing.rst
  File "/home/jenkins/.buildout/eggs/cp38/plone.app.dexterity-2.6.6-py3.8.egg/plone/app/dexterity/tests/editing.rst", line 0

----------------------------------------------------------------------
File "/home/jenkins/.buildout/eggs/cp38/plone.app.dexterity-2.6.6-py3.8.egg/plone/app/dexterity/tests/editing.rst", line 120, in editing.rst
Failed example:
    for name, factory in sorted(component.getUtilitiesFor(
        interfaces.IFieldFactory)):
        if hasattr(factory, 'protected') and factory.protected(None):
            continue
        browser.open(schemaeditor_url)
        browser.getLink('Add new field').click()
        browser.getControl('Title').value = name
        field_id = normalizer.normalize(name).replace('-', '_')
        browser.getControl('Short Name').value = field_id
        browser.getControl('Field type').getControl(
            value=factory.title).selected = True
        browser.getControl('Add').click()
        assert browser.url == "http://nohost/plone/dexterity-types/plonista/@@add-field", (
            "Couldn't successfully add %r" % name)
        assert field_id in schema, '%r not in %r' % (
            field_id, schema)
        assert factory.fieldcls._type is None or isinstance(
            schema[field_id], factory.fieldcls
            ), '%r is not an instance of %r' % (
                schema[field_id], factory.fieldcls)
        browser.open(schemaeditor_url)
        browser.getLink(url=field_id).click()
        browser.getControl('Save').click()
Exception raised:
    Traceback (most recent call last):
      File "/srv/python3.8/lib/python3.8/doctest.py", line 1329, in __run
        exec(compile(example.source, filename, "single",
      File "<doctest editing.rst[50]>", line 15, in <module>
        assert field_id in schema, '%r not in %r' % (
    AssertionError: 'plone_namedfile_field_namedblobfile' not in <InterfaceClass plone.dexterity.schema.generated.plone_5_1602169355_2_8875632_0_plonista>


  File "/srv/python3.8/lib/python3.8/unittest/case.py", line 60, in testPartExecutor
    yield
  File "/srv/python3.8/lib/python3.8/unittest/case.py", line 676, in run
    self._callTestMethod(testMethod)
  File "/srv/python3.8/lib/python3.8/unittest/case.py", line 633, in _callTestMethod
    method()
  File "/srv/python3.8/lib/python3.8/doctest.py", line 2197, in runTest
    raise self.failureException(self.format_failure(new.getvalue()))


FAILED:  plone.app.contenttypes.tests.test_collection.PloneAppCollectionIntegrationTest.test_schema

Error Message:
'plone_5_1602168800_2_816043_0_Collection' != 'plone_0_Collection'

Stack Trace:
'plone_5_1602168800_2_816043_0_Collection' != 'plone_0_Collection'
- plone_5_1602168800_2_816043_0_Collection
+ plone_0_Collection


  File "/srv/python3.8/lib/python3.8/unittest/case.py", line 60, in testPartExecutor
    yield
  File "/srv/python3.8/lib/python3.8/unittest/case.py", line 676, in run
    self._callTestMethod(testMethod)
  File "/srv/python3.8/lib/python3.8/unittest/case.py", line 633, in _callTestMethod
    method()
  File "/home/jenkins/.buildout/eggs/cp38/plone.app.contenttypes-2.2.0-py3.8.egg/plone/app/contenttypes/tests/test_collection.py", line 115, in test_schema
    self.assertEqual(schema.getName(), 'plone_0_Collection')
  File "/srv/python3.8/lib/python3.8/unittest/case.py", line 912, in assertEqual
    assertion_func(first, second, msg=msg)
  File "/srv/python3.8/lib/python3.8/unittest/case.py", line 1292, in assertMultiLineEqual
    self.fail(self._formatMessage(msg, standardMsg))
  File "/srv/python3.8/lib/python3.8/unittest/case.py", line 753, in fail
    raise self.failureException(msg)


FAILED:  plone.app.contenttypes.tests.test_document.DocumentIntegrationTest.test_schema

Error Message:
'plone_5_1602168800_2_816043_0_Document' != 'plone_0_Document'

Stack Trace:
'plone_5_1602168800_2_816043_0_Document' != 'plone_0_Document'
- plone_5_1602168800_2_816043_0_Document
+ plone_0_Document


  File "/srv/python3.8/lib/python3.8/unittest/case.py", line 60, in testPartExecutor
    yield
  File "/srv/python3.8/lib/python3.8/unittest/case.py", line 676, in run
    self._callTestMethod(testMethod)
  File "/srv/python3.8/lib/python3.8/unittest/case.py", line 633, in _callTestMethod
    method()
  File "/home/jenkins/.buildout/eggs/cp38/plone.app.contenttypes-2.2.0-py3.8.egg/plone/app/contenttypes/tests/test_document.py", line 35, in test_schema
    self.assertEqual(schema.getName(), 'plone_0_Document')
  File "/srv/python3.8/lib/python3.8/unittest/case.py", line 912, in assertEqual
    assertion_func(first, second, msg=msg)
  File "/srv/python3.8/lib/python3.8/unittest/case.py", line 1292, in assertMultiLineEqual
    self.fail(self._formatMessage(msg, standardMsg))
  File "/srv/python3.8/lib/python3.8/unittest/case.py", line 753, in fail
    raise self.failureException(msg)


FAILED:  plone.app.contenttypes.tests.test_event.EventIntegrationTest.test_schema

Error Message:
'plone_5_1602168800_2_816043_0_Event' != 'plone_0_Event'

Stack Trace:
'plone_5_1602168800_2_816043_0_Event' != 'plone_0_Event'
- plone_5_1602168800_2_816043_0_Event
+ plone_0_Event


  File "/srv/python3.8/lib/python3.8/unittest/case.py", line 60, in testPartExecutor
    yield
  File "/srv/python3.8/lib/python3.8/unittest/case.py", line 676, in run
    self._callTestMethod(testMethod)
  File "/srv/python3.8/lib/python3.8/unittest/case.py", line 633, in _callTestMethod
    method()
  File "/home/jenkins/.buildout/eggs/cp38/plone.app.contenttypes-2.2.0-py3.8.egg/plone/app/contenttypes/tests/test_event.py", line 36, in test_schema
    self.assertEqual(schema.getName(), 'plone_0_Event')
  File "/srv/python3.8/lib/python3.8/unittest/case.py", line 912, in assertEqual
    assertion_func(first, second, msg=msg)
  File "/srv/python3.8/lib/python3.8/unittest/case.py", line 1292, in assertMultiLineEqual
    self.fail(self._formatMessage(msg, standardMsg))
  File "/srv/python3.8/lib/python3.8/unittest/case.py", line 753, in fail
    raise self.failureException(msg)


FAILED:  plone.app.contenttypes.tests.test_file.FileIntegrationTest.test_schema

Error Message:
'plone_5_1602168800_2_816043_0_File' != 'plone_0_File'

Stack Trace:
'plone_5_1602168800_2_816043_0_File' != 'plone_0_File'
- plone_5_1602168800_2_816043_0_File
+ plone_0_File


  File "/srv/python3.8/lib/python3.8/unittest/case.py", line 60, in testPartExecutor
    yield
  File "/srv/python3.8/lib/python3.8/unittest/case.py", line 676, in run
    self._callTestMethod(testMethod)
  File "/srv/python3.8/lib/python3.8/unittest/case.py", line 633, in _callTestMethod
    method()
  File "/home/jenkins/.buildout/eggs/cp38/plone.app.contenttypes-2.2.0-py3.8.egg/plone/app/contenttypes/tests/test_file.py", line 39, in test_schema
    self.assertEqual(schema.getName(), 'plone_0_File')
  File "/srv/python3.8/lib/python3.8/unittest/case.py", line 912, in assertEqual
    assertion_func(first, second, msg=msg)
  File "/srv/python3.8/lib/python3.8/unittest/case.py", line 1292, in assertMultiLineEqual
    self.fail(self._formatMessage(msg, standardMsg))
  File "/srv/python3.8/lib/python3.8/unittest/case.py", line 753, in fail
    raise self.failureException(msg)


FAILED:  plone.app.contenttypes.tests.test_folder.FolderIntegrationTest.test_schema

Error Message:
'plone_5_1602168800_2_816043_0_Folder' != 'plone_0_Folder'

Stack Trace:
'plone_5_1602168800_2_816043_0_Folder' != 'plone_0_Folder'
- plone_5_1602168800_2_816043_0_Folder
+ plone_0_Folder


  File "/srv/python3.8/lib/python3.8/unittest/case.py", line 60, in testPartExecutor
    yield
  File "/srv/python3.8/lib/python3.8/unittest/case.py", line 676, in run
    self._callTestMethod(testMethod)
  File "/srv/python3.8/lib/python3.8/unittest/case.py", line 633, in _callTestMethod
    method()
  File "/home/jenkins/.buildout/eggs/cp38/plone.app.contenttypes-2.2.0-py3.8.egg/plone/app/contenttypes/tests/test_folder.py", line 34, in test_schema
    self.assertEqual(schema.getName(), 'plone_0_Folder')
  File "/srv/python3.8/lib/python3.8/unittest/case.py", line 912, in assertEqual
    assertion_func(first, second, msg=msg)
  File "/srv/python3.8/lib/python3.8/unittest/case.py", line 1292, in assertMultiLineEqual
    self.fail(self._formatMessage(msg, standardMsg))
  File "/srv/python3.8/lib/python3.8/unittest/case.py", line 753, in fail
    raise self.failureException(msg)


FAILED:  plone.app.contenttypes.tests.test_image.ImageIntegrationTest.test_schema

Error Message:
'plone_5_1602168800_2_816043_0_Image' != 'plone_0_Image'

Stack Trace:
'plone_5_1602168800_2_816043_0_Image' != 'plone_0_Image'
- plone_5_1602168800_2_816043_0_Image
+ plone_0_Image


  File "/srv/python3.8/lib/python3.8/unittest/case.py", line 60, in testPartExecutor
    yield
  File "/srv/python3.8/lib/python3.8/unittest/case.py", line 676, in run
    self._callTestMethod(testMethod)
  File "/srv/python3.8/lib/python3.8/unittest/case.py", line 633, in _callTestMethod
    method()
  File "/home/jenkins/.buildout/eggs/cp38/plone.app.contenttypes-2.2.0-py3.8.egg/plone/app/contenttypes/tests/test_image.py", line 48, in test_schema
    self.assertEqual(schema.getName(), 'plone_0_Image')
  File "/srv/python3.8/lib/python3.8/unittest/case.py", line 912, in assertEqual
    assertion_func(first, second, msg=msg)
  File "/srv/python3.8/lib/python3.8/unittest/case.py", line 1292, in assertMultiLineEqual
    self.fail(self._formatMessage(msg, standardMsg))
  File "/srv/python3.8/lib/python3.8/unittest/case.py", line 753, in fail
    raise self.failureException(msg)


FAILED:  plone.app.contenttypes.tests.test_link.LinkIntegrationTest.test_schema

Error Message:
'plone_5_1602168800_2_816043_0_Link' != 'plone_0_Link'

Stack Trace:
'plone_5_1602168800_2_816043_0_Link' != 'plone_0_Link'
- plone_5_1602168800_2_816043_0_Link
+ plone_0_Link


  File "/srv/python3.8/lib/python3.8/unittest/case.py", line 60, in testPartExecutor
    yield
  File "/srv/python3.8/lib/python3.8/unittest/case.py", line 676, in run
    self._callTestMethod(testMethod)
  File "/srv/python3.8/lib/python3.8/unittest/case.py", line 633, in _callTestMethod
    method()
  File "/home/jenkins/.buildout/eggs/cp38/plone.app.contenttypes-2.2.0-py3.8.egg/plone/app/contenttypes/tests/test_link.py", line 44, in test_schema
    self.assertEqual(schema.getName(), 'plone_0_Link')
  File "/srv/python3.8/lib/python3.8/unittest/case.py", line 912, in assertEqual
    assertion_func(first, second, msg=msg)
  File "/srv/python3.8/lib/python3.8/unittest/case.py", line 1292, in assertMultiLineEqual
    self.fail(self._formatMessage(msg, standardMsg))
  File "/srv/python3.8/lib/python3.8/unittest/case.py", line 753, in fail
    raise self.failureException(msg)


FAILED:  plone.app.contenttypes.tests.test_news_item.NewsItemIntegrationTest.test_schema

Error Message:
'plone_5_1602168800_2_816043_0_News_1_Item' != 'plone_0_News_1_Item'

Stack Trace:
'plone_5_1602168800_2_816043_0_News_1_Item' != 'plone_0_News_1_Item'
- plone_5_1602168800_2_816043_0_News_1_Item
+ plone_0_News_1_Item


  File "/srv/python3.8/lib/python3.8/unittest/case.py", line 60, in testPartExecutor
    yield
  File "/srv/python3.8/lib/python3.8/unittest/case.py", line 676, in run
    self._callTestMethod(testMethod)
  File "/srv/python3.8/lib/python3.8/unittest/case.py", line 633, in _callTestMethod
    method()
  File "/home/jenkins/.buildout/eggs/cp38/plone.app.contenttypes-2.2.0-py3.8.egg/plone/app/contenttypes/tests/test_news_item.py", line 43, in test_schema
    self.assertEqual(schema.getName(), 'plone_0_News_1_Item')
  File "/srv/python3.8/lib/python3.8/unittest/case.py", line 912, in assertEqual
    assertion_func(first, second, msg=msg)
  File "/srv/python3.8/lib/python3.8/unittest/case.py", line 1292, in assertMultiLineEqual
    self.fail(self._formatMessage(msg, standardMsg))
  File "/srv/python3.8/lib/python3.8/unittest/case.py", line 753, in fail
    raise self.failureException(msg)


More information about the Testbot mailing list