[Testbot] Plone 5.2 - Python 2.7 - Build # 1162 - Failure!

jenkins at plone.org jenkins at plone.org
Wed Nov 11 22:25:14 UTC 2020


Plone 5.2 - Python 2.7 - Build # 1162 - Failure:

Check console output at https://jenkins.plone.org/job/plone-5.2-python-2.7/1162/ to view the results.


Plone 5.2 - Python 2.7 - Build # 1162 - Failure:

Check console output at https://jenkins.plone.org/job/plone-5.2-python-2.7/1162/ to view the results.

Test Results:

14 tests failed.
FAILED:  plone.restapi.tests.test_services_groups.TestGroupsEndpoint.test_add_group

Error Message:
201 != 500

Stack Trace:
201 != 500

  File "/srv/python2.7/lib/python2.7/unittest/case.py", line 329, in run
    testMethod()
  File "/home/jenkins/workspace/plone-5.2-python-2.7/src/plone.restapi/src/plone/restapi/tests/test_services_groups.py", line 91, in test_add_group
    self.assertEqual(201, response.status_code)
  File "/srv/python2.7/lib/python2.7/unittest/case.py", line 513, in assertEqual
    assertion_func(first, second, msg=msg)
  File "/srv/python2.7/lib/python2.7/unittest/case.py", line 506, in _baseAssertEqual
    raise self.failureException(msg)


FAILED:  plone.restapi.tests.test_services_users.TestUsersEndpoint.test_add_anon_user_sends_properties_are_saved

Error Message:
201 != 500

Stack Trace:
201 != 500

  File "/srv/python2.7/lib/python2.7/unittest/case.py", line 329, in run
    testMethod()
  File "/home/jenkins/workspace/plone-5.2-python-2.7/src/plone.restapi/src/plone/restapi/tests/test_services_users.py", line 248, in test_add_anon_user_sends_properties_are_saved
    self.assertEqual(201, response.status_code)
  File "/srv/python2.7/lib/python2.7/unittest/case.py", line 513, in assertEqual
    assertion_func(first, second, msg=msg)
  File "/srv/python2.7/lib/python2.7/unittest/case.py", line 506, in _baseAssertEqual
    raise self.failureException(msg)


FAILED:  plone.restapi.tests.test_services_users.TestUsersEndpoint.test_add_user

Error Message:
201 != 500

Stack Trace:
201 != 500

  File "/srv/python2.7/lib/python2.7/unittest/case.py", line 329, in run
    testMethod()
  File "/home/jenkins/workspace/plone-5.2-python-2.7/src/plone.restapi/src/plone/restapi/tests/test_services_users.py", line 118, in test_add_user
    self.assertEqual(201, response.status_code)
  File "/srv/python2.7/lib/python2.7/unittest/case.py", line 513, in assertEqual
    assertion_func(first, second, msg=msg)
  File "/srv/python2.7/lib/python2.7/unittest/case.py", line 506, in _baseAssertEqual
    raise self.failureException(msg)


FAILED:  plone.restapi.tests.test_services_users.TestUsersEndpoint.test_add_user_email_with_email_login_enabled

Error Message:
201 != 500

Stack Trace:
201 != 500

  File "/srv/python2.7/lib/python2.7/unittest/case.py", line 329, in run
    testMethod()
  File "/home/jenkins/workspace/plone-5.2-python-2.7/src/plone.restapi/src/plone/restapi/tests/test_services_users.py", line 162, in test_add_user_email_with_email_login_enabled
    self.assertEqual(201, response.status_code)
  File "/srv/python2.7/lib/python2.7/unittest/case.py", line 513, in assertEqual
    assertion_func(first, second, msg=msg)
  File "/srv/python2.7/lib/python2.7/unittest/case.py", line 506, in _baseAssertEqual
    raise self.failureException(msg)


FAILED:  plone.restapi.tests.test_services_users.TestUsersEndpoint.test_add_user_no_roles_sets_member_as_sensible_default

Error Message:
201 != 500

Stack Trace:
201 != 500

  File "/srv/python2.7/lib/python2.7/unittest/case.py", line 329, in run
    testMethod()
  File "/home/jenkins/workspace/plone-5.2-python-2.7/src/plone.restapi/src/plone/restapi/tests/test_services_users.py", line 917, in test_add_user_no_roles_sets_member_as_sensible_default
    self.assertEqual(201, response.status_code)
  File "/srv/python2.7/lib/python2.7/unittest/case.py", line 513, in assertEqual
    assertion_func(first, second, msg=msg)
  File "/srv/python2.7/lib/python2.7/unittest/case.py", line 506, in _baseAssertEqual
    raise self.failureException(msg)


FAILED:  plone.restapi.tests.test_services_users.TestUsersEndpoint.test_add_user_send_properties

Error Message:
201 != 500

Stack Trace:
201 != 500

  File "/srv/python2.7/lib/python2.7/unittest/case.py", line 329, in run
    testMethod()
  File "/home/jenkins/workspace/plone-5.2-python-2.7/src/plone.restapi/src/plone/restapi/tests/test_services_users.py", line 229, in test_add_user_send_properties
    self.assertEqual(201, response.status_code)
  File "/srv/python2.7/lib/python2.7/unittest/case.py", line 513, in assertEqual
    assertion_func(first, second, msg=msg)
  File "/srv/python2.7/lib/python2.7/unittest/case.py", line 506, in _baseAssertEqual
    raise self.failureException(msg)


FAILED:  plone.restapi.tests.test_services_users.TestUsersEndpoint.test_add_user_with_email_login_enabled

Error Message:
201 != 500

Stack Trace:
201 != 500

  File "/srv/python2.7/lib/python2.7/unittest/case.py", line 329, in run
    testMethod()
  File "/home/jenkins/workspace/plone-5.2-python-2.7/src/plone.restapi/src/plone/restapi/tests/test_services_users.py", line 193, in test_add_user_with_email_login_enabled
    self.assertEqual(201, response.status_code)
  File "/srv/python2.7/lib/python2.7/unittest/case.py", line 513, in assertEqual
    assertion_func(first, second, msg=msg)
  File "/srv/python2.7/lib/python2.7/unittest/case.py", line 506, in _baseAssertEqual
    raise self.failureException(msg)


FAILED:  plone.restapi.tests.test_services_users.TestUsersEndpoint.test_add_user_with_sendPasswordRest_sends_email

Error Message:
201 != 500

Stack Trace:
201 != 500

  File "/srv/python2.7/lib/python2.7/unittest/case.py", line 329, in run
    testMethod()
  File "/home/jenkins/workspace/plone-5.2-python-2.7/src/plone.restapi/src/plone/restapi/tests/test_services_users.py", line 210, in test_add_user_with_sendPasswordRest_sends_email
    self.assertEqual(201, response.status_code)
  File "/srv/python2.7/lib/python2.7/unittest/case.py", line 513, in assertEqual
    assertion_func(first, second, msg=msg)
  File "/srv/python2.7/lib/python2.7/unittest/case.py", line 506, in _baseAssertEqual
    raise self.failureException(msg)


FAILED:  plone.restapi.tests.test_services_users.TestUsersEndpoint.test_anonymous_can_set_password_with_enable_user_pwd_choice

Error Message:
201 != 500

Stack Trace:
201 != 500

  File "/srv/python2.7/lib/python2.7/unittest/case.py", line 329, in run
    testMethod()
  File "/home/jenkins/workspace/plone-5.2-python-2.7/src/plone.restapi/src/plone/restapi/tests/test_services_users.py", line 866, in test_anonymous_can_set_password_with_enable_user_pwd_choice
    self.assertEqual(201, response.status_code)
  File "/srv/python2.7/lib/python2.7/unittest/case.py", line 513, in assertEqual
    assertion_func(first, second, msg=msg)
  File "/srv/python2.7/lib/python2.7/unittest/case.py", line 506, in _baseAssertEqual
    raise self.failureException(msg)


FAILED:  plone.restapi.tests.test_services_users.TestUsersEndpoint.test_anonymous_requires_enable_self_reg

Error Message:
201 != 500

Stack Trace:
201 != 500

  File "/srv/python2.7/lib/python2.7/unittest/case.py", line 329, in run
    testMethod()
  File "/home/jenkins/workspace/plone-5.2-python-2.7/src/plone.restapi/src/plone/restapi/tests/test_services_users.py", line 815, in test_anonymous_requires_enable_self_reg
    self.assertEqual(201, response.status_code)
  File "/srv/python2.7/lib/python2.7/unittest/case.py", line 513, in assertEqual
    assertion_func(first, second, msg=msg)
  File "/srv/python2.7/lib/python2.7/unittest/case.py", line 506, in _baseAssertEqual
    raise self.failureException(msg)


FAILED:  plone.restapi.tests.test_services_users.TestUsersEndpoint.test_anonymous_with_enable_user_pwd_choice_doent_send_email

Error Message:
201 != 500

Stack Trace:
201 != 500

  File "/srv/python2.7/lib/python2.7/unittest/case.py", line 329, in run
    testMethod()
  File "/home/jenkins/workspace/plone-5.2-python-2.7/src/plone.restapi/src/plone/restapi/tests/test_services_users.py", line 885, in test_anonymous_with_enable_user_pwd_choice_doent_send_email
    self.assertEqual(201, response.status_code)
  File "/srv/python2.7/lib/python2.7/unittest/case.py", line 513, in assertEqual
    assertion_func(first, second, msg=msg)
  File "/srv/python2.7/lib/python2.7/unittest/case.py", line 506, in _baseAssertEqual
    raise self.failureException(msg)


FAILED:  plone.restapi.tests.test_services_users.TestUsersEndpoint.test_anonymous_with_enable_user_sets_only_member_role

Error Message:
Expecting value: line 1 column 1 (char 0)

Stack Trace:
Expecting value: line 1 column 1 (char 0)

  File "/srv/python2.7/lib/python2.7/unittest/case.py", line 329, in run
    testMethod()
  File "/home/jenkins/workspace/plone-5.2-python-2.7/src/plone.restapi/src/plone/restapi/tests/test_services_users.py", line 902, in test_anonymous_with_enable_user_sets_only_member_role
    response = response.json()
  File "/home/jenkins/.buildout/eggs/cp27m/requests-2.24.0-py2.7.egg/requests/models.py", line 898, in json
    return complexjson.loads(self.text, **kwargs)
  File "/home/jenkins/.buildout/eggs/cp27m/simplejson-3.17.0-py2.7-linux-x86_64.egg/simplejson/__init__.py", line 525, in loads
    return _default_decoder.decode(s)
  File "/home/jenkins/.buildout/eggs/cp27m/simplejson-3.17.0-py2.7-linux-x86_64.egg/simplejson/decoder.py", line 370, in decode
    obj, end = self.raw_decode(s)
  File "/home/jenkins/.buildout/eggs/cp27m/simplejson-3.17.0-py2.7-linux-x86_64.egg/simplejson/decoder.py", line 400, in raw_decode
    return self.scan_once(s, idx=_w(s, idx).end())


FAILED:  plone.restapi.tests.test_services_users.TestUsersEndpoint.test_anonymous_without_enable_user_pwd_choice_sends_mail

Error Message:
201 != 500

Stack Trace:
201 != 500

  File "/srv/python2.7/lib/python2.7/unittest/case.py", line 329, in run
    testMethod()
  File "/home/jenkins/workspace/plone-5.2-python-2.7/src/plone.restapi/src/plone/restapi/tests/test_services_users.py", line 828, in test_anonymous_without_enable_user_pwd_choice_sends_mail
    self.assertEqual(201, response.status_code)
  File "/srv/python2.7/lib/python2.7/unittest/case.py", line 513, in assertEqual
    assertion_func(first, second, msg=msg)
  File "/srv/python2.7/lib/python2.7/unittest/case.py", line 506, in _baseAssertEqual
    raise self.failureException(msg)


FAILED:  plone.restapi.tests.test_services_users.TestUsersEndpoint.test_reset_and_login_email_using_mail

Error Message:
201 != 500

Stack Trace:
201 != 500

  File "/srv/python2.7/lib/python2.7/unittest/case.py", line 329, in run
    testMethod()
  File "/home/jenkins/workspace/plone-5.2-python-2.7/src/plone.restapi/src/plone/restapi/tests/test_services_users.py", line 764, in test_reset_and_login_email_using_mail
    self.assertEqual(201, response.status_code)
  File "/srv/python2.7/lib/python2.7/unittest/case.py", line 513, in assertEqual
    assertion_func(first, second, msg=msg)
  File "/srv/python2.7/lib/python2.7/unittest/case.py", line 506, in _baseAssertEqual
    raise self.failureException(msg)


More information about the Testbot mailing list