[Testbot] Plone 5.1 - Python 2.7 - Build # 234 - Failure!

jenkins at plone.org jenkins at plone.org
Wed May 27 06:36:02 UTC 2020


Plone 5.1 - Python 2.7 - Build # 234 - Failure:

Check console output at https://jenkins.plone.org/job/plone-5.1-python-2.7/234/ to view the results.


Plone 5.1 - Python 2.7 - Build # 234 - Failure:

Check console output at https://jenkins.plone.org/job/plone-5.1-python-2.7/234/ to view the results.

Test Results:

3 tests failed.
FAILED:  Products.CMFPlone.tests.testMigrationTool.TestMigrationTool.testDoUpgrades

Error Message:
([WrongType('style', <type 'unicode'>, '')], 'value')

Stack Trace:
([WrongType('style', <type 'unicode'>, '')], 'value')

  File "/srv/python2.7/lib/python2.7/unittest/case.py", line 329, in run
    testMethod()
  File "/home/jenkins/workspace/plone-5.1-python-2.7/src/Products.CMFPlone/Products/CMFPlone/tests/testMigrationTool.py", line 59, in testDoUpgrades
    self.setup.manage_doUpgrades(request=request)
  File "/home/jenkins/.buildout/eggs/cp27m/Products.GenericSetup-1.8.11-py2.7.egg/Products/GenericSetup/tool.py", line 1092, in manage_doUpgrades
    step.doStep(self)
  File "/home/jenkins/.buildout/eggs/cp27m/Products.GenericSetup-1.8.11-py2.7.egg/Products/GenericSetup/upgrade.py", line 166, in doStep
    self.handler(tool)
  File "/home/jenkins/workspace/plone-5.1-python-2.7/src/plone.app.upgrade/plone/app/upgrade/v51/final.py", line 70, in to517
    loadMigrationProfile(context, 'profile-plone.app.upgrade.v51:to517')
  File "/home/jenkins/workspace/plone-5.1-python-2.7/src/plone.app.upgrade/plone/app/upgrade/utils.py", line 203, in loadMigrationProfile
    context.runAllImportStepsFromProfile(profile, purge_old=False)
  File "/home/jenkins/.buildout/eggs/cp27m/Products.GenericSetup-1.8.11-py2.7.egg/Products/GenericSetup/tool.py", line 391, in runAllImportStepsFromProfile
    dependency_strategy=dependency_strategy)
  File "/home/jenkins/.buildout/eggs/cp27m/Products.GenericSetup-1.8.11-py2.7.egg/Products/GenericSetup/tool.py", line 1472, in _runImportStepsFromContext
    message = self._doRunImportStep(step, context)
  File "/home/jenkins/.buildout/eggs/cp27m/Products.GenericSetup-1.8.11-py2.7.egg/Products/GenericSetup/tool.py", line 1284, in _doRunImportStep
    return handler(context)
  File "/home/jenkins/.buildout/eggs/cp27m/plone.app.registry-1.7.6-py2.7.egg/plone/app/registry/exportimport/handler.py", line 79, in importRegistry
    importer.importDocument(body)
  File "/home/jenkins/.buildout/eggs/cp27m/plone.app.registry-1.7.6-py2.7.egg/plone/app/registry/exportimport/handler.py", line 127, in importDocument
    self.importRecords(node)
  File "/home/jenkins/.buildout/eggs/cp27m/plone.app.registry-1.7.6-py2.7.egg/plone/app/registry/exportimport/handler.py", line 414, in importRecords
    self.importRecord(field)
  File "/home/jenkins/.buildout/eggs/cp27m/plone.app.registry-1.7.6-py2.7.egg/plone/app/registry/exportimport/handler.py", line 331, in importRecord
    existing_record.value = value
  File "/home/jenkins/.buildout/eggs/cp27m/plone.registry-1.1.6-py2.7.egg/plone/registry/record.py", line 82, in _set_value
    field.validate(value)
  File "/home/jenkins/.buildout/eggs/cp27m/zope.schema-4.5.0-py2.7.egg/zope/schema/_bootstrapfields.py", line 183, in validate
    self._validate(value)
  File "/home/jenkins/.buildout/eggs/cp27m/zope.schema-4.5.0-py2.7.egg/zope/schema/_field.py", line 527, in _validate
    raise WrongContainedType(errors, self.__name__)


FAILED:  plone.app.testing.layers.rst

Error Message:
Failed doctest test for layers.rst

Stack Trace:
Failed doctest test for layers.rst
  File "/home/jenkins/.buildout/eggs/cp27m/plone.app.testing-5.0.9-py2.7.egg/plone/app/testing/layers.rst", line 0

----------------------------------------------------------------------
File "/home/jenkins/.buildout/eggs/cp27m/plone.app.testing-5.0.9-py2.7.egg/plone/app/testing/layers.rst", line 183, in layers.rst
Failed example:
    getSiteManager()
Expected:
    <BaseGlobalComponents test-stack-2>
Got:
    <BaseGlobalComponents test-stack-3>
----------------------------------------------------------------------
File "/home/jenkins/.buildout/eggs/cp27m/plone.app.testing-5.0.9-py2.7.egg/plone/app/testing/layers.rst", line 263, in layers.rst
Failed example:
    getSiteManager()
Expected:
    <BaseGlobalComponents test-stack-2>
Got:
    <BaseGlobalComponents test-stack-3>


  File "/srv/python2.7/lib/python2.7/unittest/case.py", line 329, in run
    testMethod()
  File "/srv/python2.7/lib/python2.7/doctest.py", line 2224, in runTest
    raise self.failureException(self.format_failure(new.getvalue()))


FAILED:  plone.app.upgrade.tests.test_upgrade.TestUpgrade.testDoUpgrades

Error Message:
([WrongType('style', <type 'unicode'>, '')], 'value')

Stack Trace:
([WrongType('style', <type 'unicode'>, '')], 'value')

  File "/srv/python2.7/lib/python2.7/unittest/case.py", line 329, in run
    testMethod()
  File "/home/jenkins/workspace/plone-5.1-python-2.7/src/plone.app.upgrade/plone/app/upgrade/tests/test_upgrade.py", line 58, in testDoUpgrades
    self.setup.manage_doUpgrades(request=request)
  File "/home/jenkins/.buildout/eggs/cp27m/Products.GenericSetup-1.8.11-py2.7.egg/Products/GenericSetup/tool.py", line 1092, in manage_doUpgrades
    step.doStep(self)
  File "/home/jenkins/.buildout/eggs/cp27m/Products.GenericSetup-1.8.11-py2.7.egg/Products/GenericSetup/upgrade.py", line 166, in doStep
    self.handler(tool)
  File "/home/jenkins/workspace/plone-5.1-python-2.7/src/plone.app.upgrade/plone/app/upgrade/v51/final.py", line 70, in to517
    loadMigrationProfile(context, 'profile-plone.app.upgrade.v51:to517')
  File "/home/jenkins/workspace/plone-5.1-python-2.7/src/plone.app.upgrade/plone/app/upgrade/utils.py", line 203, in loadMigrationProfile
    context.runAllImportStepsFromProfile(profile, purge_old=False)
  File "/home/jenkins/.buildout/eggs/cp27m/Products.GenericSetup-1.8.11-py2.7.egg/Products/GenericSetup/tool.py", line 391, in runAllImportStepsFromProfile
    dependency_strategy=dependency_strategy)
  File "/home/jenkins/.buildout/eggs/cp27m/Products.GenericSetup-1.8.11-py2.7.egg/Products/GenericSetup/tool.py", line 1472, in _runImportStepsFromContext
    message = self._doRunImportStep(step, context)
  File "/home/jenkins/.buildout/eggs/cp27m/Products.GenericSetup-1.8.11-py2.7.egg/Products/GenericSetup/tool.py", line 1284, in _doRunImportStep
    return handler(context)
  File "/home/jenkins/.buildout/eggs/cp27m/plone.app.registry-1.7.6-py2.7.egg/plone/app/registry/exportimport/handler.py", line 79, in importRegistry
    importer.importDocument(body)
  File "/home/jenkins/.buildout/eggs/cp27m/plone.app.registry-1.7.6-py2.7.egg/plone/app/registry/exportimport/handler.py", line 127, in importDocument
    self.importRecords(node)
  File "/home/jenkins/.buildout/eggs/cp27m/plone.app.registry-1.7.6-py2.7.egg/plone/app/registry/exportimport/handler.py", line 414, in importRecords
    self.importRecord(field)
  File "/home/jenkins/.buildout/eggs/cp27m/plone.app.registry-1.7.6-py2.7.egg/plone/app/registry/exportimport/handler.py", line 331, in importRecord
    existing_record.value = value
  File "/home/jenkins/.buildout/eggs/cp27m/plone.registry-1.1.6-py2.7.egg/plone/registry/record.py", line 82, in _set_value
    field.validate(value)
  File "/home/jenkins/.buildout/eggs/cp27m/zope.schema-4.5.0-py2.7.egg/zope/schema/_bootstrapfields.py", line 183, in validate
    self._validate(value)
  File "/home/jenkins/.buildout/eggs/cp27m/zope.schema-4.5.0-py2.7.egg/zope/schema/_field.py", line 527, in _validate
    raise WrongContainedType(errors, self.__name__)


More information about the Testbot mailing list