[Testbot] Plone 5.2 - Python 2.7 - Build # 865 - Still Failing!

jenkins at plone.org jenkins at plone.org
Fri Jun 26 11:02:35 UTC 2020


Plone 5.2 - Python 2.7 - Build # 865 - Still Failing:

Check console output at https://jenkins.plone.org/job/plone-5.2-python-2.7/865/ to view the results.


Plone 5.2 - Python 2.7 - Build # 865 - Still Failing:

Check console output at https://jenkins.plone.org/job/plone-5.2-python-2.7/865/ to view the results.

Test Results:

3 tests failed.
FAILED:  plone.restapi.tests.test_dxfield_serializer.TestDexterityFieldSerializing.test_namedblobimage_field_serialization_returns_dict

Error Message:
{u'scales': {u'mini': {u'download': u'http://nohost/plone/doc1/@@images/uuid_1.p [truncated]... != {u'scales': {u'mini': {u'download': u'http://nohost/plone/doc1/@@images/uuid_1.p [truncated]...

Stack Trace:
{u'scales': {u'mini': {u'download': u'http://nohost/plone/doc1/@@images/uuid_1.p [truncated]... != {u'scales': {u'mini': {u'download': u'http://nohost/plone/doc1/@@images/uuid_1.p [truncated]...
  {u'content-type': u'image/gif',
-  u'download': u'http://nohost/plone/doc1/@@images/uuid_1.png',
?                                                          --

+  u'download': u'http://nohost/plone/doc1/@@images/uuid_1.gif',
?                                                           ++

   u'filename': u'1024x768.gif',
   u'height': 768,
   u'scales': {u'icon': {u'download': u'http://nohost/plone/doc1/@@images/uuid_1.png',
                         u'height': 24,
                         u'width': 32},
               u'large': {u'download': u'http://nohost/plone/doc1/@@images/uuid_1.png',
                          u'height': 576,
                          u'width': 768},
               u'listing': {u'download': u'http://nohost/plone/doc1/@@images/uuid_1.png',
                            u'height': 12,
                            u'width': 16},
               u'mini': {u'download': u'http://nohost/plone/doc1/@@images/uuid_1.png',
                         u'height': 150,
                         u'width': 200},
               u'preview': {u'download': u'http://nohost/plone/doc1/@@images/uuid_1.png',
                            u'height': 300,
                            u'width': 400},
               u'thumb': {u'download': u'http://nohost/plone/doc1/@@images/uuid_1.png',
                          u'height': 96,
                          u'width': 128},
               u'tile': {u'download': u'http://nohost/plone/doc1/@@images/uuid_1.png',
                         u'height': 48,
                         u'width': 64}},
   u'size': 1514,
   u'width': 1024}

  File "/srv/python2.7/lib/python2.7/unittest/case.py", line 329, in run
    testMethod()
  File "/home/jenkins/.buildout/eggs/cp27m/plone.restapi-6.13.4-py2.7.egg/plone/restapi/tests/test_dxfield_serializer.py", line 365, in test_namedblobimage_field_serialization_returns_dict
    value,
  File "/srv/python2.7/lib/python2.7/unittest/case.py", line 513, in assertEqual
    assertion_func(first, second, msg=msg)
  File "/srv/python2.7/lib/python2.7/unittest/case.py", line 836, in assertDictEqual
    self.fail(self._formatMessage(msg, standardMsg))
  File "/srv/python2.7/lib/python2.7/unittest/case.py", line 410, in fail
    raise self.failureException(msg)


FAILED:  plone.restapi.tests.test_dxfield_serializer.TestDexterityFieldSerializing.test_namedimage_field_serialization_doesnt_choke_on_corrupt_image

Error Message:
{u'scales': {}, u'height': -1, u'width': -1, u'download': None, u'filename': u'1 [truncated]... != {u'scales': {}, u'height': -1, u'width': -1, u'download': u'http://nohost/plone/ [truncated]...

Stack Trace:
{u'scales': {}, u'height': -1, u'width': -1, u'download': None, u'filename': u'1 [truncated]... != {u'scales': {}, u'height': -1, u'width': -1, u'download': u'http://nohost/plone/ [truncated]...
  {u'content-type': u'image/gif',
-  u'download': None,
+  u'download': u'http://nohost/plone/doc1/@@images/uuid_1.gif',
   u'filename': u'1024x768.gif',
   u'height': -1,
   u'scales': {},
   u'size': 18,
   u'width': -1}

  File "/srv/python2.7/lib/python2.7/unittest/case.py", line 329, in run
    testMethod()
  File "/home/jenkins/.buildout/eggs/cp27m/plone.restapi-6.13.4-py2.7.egg/plone/restapi/tests/test_dxfield_serializer.py", line 302, in test_namedimage_field_serialization_doesnt_choke_on_corrupt_image
    value,
  File "/srv/python2.7/lib/python2.7/unittest/case.py", line 513, in assertEqual
    assertion_func(first, second, msg=msg)
  File "/srv/python2.7/lib/python2.7/unittest/case.py", line 836, in assertDictEqual
    self.fail(self._formatMessage(msg, standardMsg))
  File "/srv/python2.7/lib/python2.7/unittest/case.py", line 410, in fail
    raise self.failureException(msg)


FAILED:  plone.restapi.tests.test_dxfield_serializer.TestDexterityFieldSerializing.test_namedimage_field_serialization_returns_dict

Error Message:
{u'scales': {u'mini': {u'download': u'http://nohost/plone/doc1/@@images/uuid_1.p [truncated]... != {u'scales': {u'mini': {u'download': u'http://nohost/plone/doc1/@@images/uuid_1.p [truncated]...

Stack Trace:
{u'scales': {u'mini': {u'download': u'http://nohost/plone/doc1/@@images/uuid_1.p [truncated]... != {u'scales': {u'mini': {u'download': u'http://nohost/plone/doc1/@@images/uuid_1.p [truncated]...
  {u'content-type': u'image/gif',
-  u'download': u'http://nohost/plone/doc1/@@images/uuid_1.png',
?                                                          --

+  u'download': u'http://nohost/plone/doc1/@@images/uuid_1.gif',
?                                                           ++

   u'filename': u'1024x768.gif',
   u'height': 768,
   u'scales': {u'icon': {u'download': u'http://nohost/plone/doc1/@@images/uuid_1.png',
                         u'height': 24,
                         u'width': 32},
               u'large': {u'download': u'http://nohost/plone/doc1/@@images/uuid_1.png',
                          u'height': 576,
                          u'width': 768},
               u'listing': {u'download': u'http://nohost/plone/doc1/@@images/uuid_1.png',
                            u'height': 12,
                            u'width': 16},
               u'mini': {u'download': u'http://nohost/plone/doc1/@@images/uuid_1.png',
                         u'height': 150,
                         u'width': 200},
               u'preview': {u'download': u'http://nohost/plone/doc1/@@images/uuid_1.png',
                            u'height': 300,
                            u'width': 400},
               u'thumb': {u'download': u'http://nohost/plone/doc1/@@images/uuid_1.png',
                          u'height': 96,
                          u'width': 128},
               u'tile': {u'download': u'http://nohost/plone/doc1/@@images/uuid_1.png',
                         u'height': 48,
                         u'width': 64}},
   u'size': 1514,
   u'width': 1024}

  File "/srv/python2.7/lib/python2.7/unittest/case.py", line 329, in run
    testMethod()
  File "/home/jenkins/.buildout/eggs/cp27m/plone.restapi-6.13.4-py2.7.egg/plone/restapi/tests/test_dxfield_serializer.py", line 279, in test_namedimage_field_serialization_returns_dict
    value,
  File "/srv/python2.7/lib/python2.7/unittest/case.py", line 513, in assertEqual
    assertion_func(first, second, msg=msg)
  File "/srv/python2.7/lib/python2.7/unittest/case.py", line 836, in assertDictEqual
    self.fail(self._formatMessage(msg, standardMsg))
  File "/srv/python2.7/lib/python2.7/unittest/case.py", line 410, in fail
    raise self.failureException(msg)


More information about the Testbot mailing list