[Testbot] Plone 5.2 - Python 3.8 - Build # 593 - Still Failing!

jenkins at plone.org jenkins at plone.org
Fri Jun 26 10:39:52 UTC 2020


Plone 5.2 - Python 3.8 - Build # 593 - Still Failing:

Check console output at https://jenkins.plone.org/job/plone-5.2-python-3.8/593/ to view the results.


Plone 5.2 - Python 3.8 - Build # 593 - Still Failing:

Check console output at https://jenkins.plone.org/job/plone-5.2-python-3.8/593/ to view the results.

Test Results:

3 tests failed.
FAILED:  plone.restapi.tests.test_dxfield_serializer.TestDexterityFieldSerializing.test_namedblobimage_field_serialization_returns_dict

Error Message:
{'fil[116 chars]id_1.png', 'width': 1024, 'height': 768, 'scal[695 chars]76}}} != {'fil[116 chars]id_1.gif', 'width': 1024, 'height': 768, 'scal[695 chars]12}}}

Stack Trace:
{'fil[116 chars]id_1.png', 'width': 1024, 'height': 768, 'scal[695 chars]76}}} != {'fil[116 chars]id_1.gif', 'width': 1024, 'height': 768, 'scal[695 chars]12}}}
  {'content-type': 'image/gif',
-  'download': 'http://nohost/plone/doc1/@@images/uuid_1.png',
?                                                        --

+  'download': 'http://nohost/plone/doc1/@@images/uuid_1.gif',
?                                                         ++

   'filename': '1024x768.gif',
   'height': 768,
   'scales': {'icon': {'download': 'http://nohost/plone/doc1/@@images/uuid_1.png',
                       'height': 24,
                       'width': 32},
              'large': {'download': 'http://nohost/plone/doc1/@@images/uuid_1.png',
                        'height': 576,
                        'width': 768},
              'listing': {'download': 'http://nohost/plone/doc1/@@images/uuid_1.png',
                          'height': 12,
                          'width': 16},
              'mini': {'download': 'http://nohost/plone/doc1/@@images/uuid_1.png',
                       'height': 150,
                       'width': 200},
              'preview': {'download': 'http://nohost/plone/doc1/@@images/uuid_1.png',
                          'height': 300,
                          'width': 400},
              'thumb': {'download': 'http://nohost/plone/doc1/@@images/uuid_1.png',
                        'height': 96,
                        'width': 128},
              'tile': {'download': 'http://nohost/plone/doc1/@@images/uuid_1.png',
                       'height': 48,
                       'width': 64}},
   'size': 1514,
   'width': 1024}

  File "/srv/python3.8/lib/python3.8/unittest/case.py", line 60, in testPartExecutor
    yield
  File "/srv/python3.8/lib/python3.8/unittest/case.py", line 676, in run
    self._callTestMethod(testMethod)
  File "/srv/python3.8/lib/python3.8/unittest/case.py", line 633, in _callTestMethod
    method()
  File "/home/jenkins/.buildout/eggs/cp38/plone.restapi-6.13.4-py3.8.egg/plone/restapi/tests/test_dxfield_serializer.py", line 355, in test_namedblobimage_field_serialization_returns_dict
    self.assertEqual(
  File "/srv/python3.8/lib/python3.8/unittest/case.py", line 912, in assertEqual
    assertion_func(first, second, msg=msg)
  File "/srv/python3.8/lib/python3.8/unittest/case.py", line 1211, in assertDictEqual
    self.fail(self._formatMessage(msg, standardMsg))
  File "/srv/python3.8/lib/python3.8/unittest/case.py", line 753, in fail
    raise self.failureException(msg)


FAILED:  plone.restapi.tests.test_dxfield_serializer.TestDexterityFieldSerializing.test_namedimage_field_serialization_doesnt_choke_on_corrupt_image

Error Message:
{'content-type': 'image/gif', 'download': N[80 chars]: -1} != {'filename': '1024x768.gif', 'content-type'[122 chars]: {}}

Stack Trace:
{'content-type': 'image/gif', 'download': N[80 chars]: -1} != {'filename': '1024x768.gif', 'content-type'[122 chars]: {}}
  {'content-type': 'image/gif',
-  'download': None,
+  'download': 'http://nohost/plone/doc1/@@images/uuid_1.gif',
   'filename': '1024x768.gif',
   'height': -1,
   'scales': {},
   'size': 18,
   'width': -1}

  File "/srv/python3.8/lib/python3.8/unittest/case.py", line 60, in testPartExecutor
    yield
  File "/srv/python3.8/lib/python3.8/unittest/case.py", line 676, in run
    self._callTestMethod(testMethod)
  File "/srv/python3.8/lib/python3.8/unittest/case.py", line 633, in _callTestMethod
    method()
  File "/home/jenkins/.buildout/eggs/cp38/plone.restapi-6.13.4-py3.8.egg/plone/restapi/tests/test_dxfield_serializer.py", line 292, in test_namedimage_field_serialization_doesnt_choke_on_corrupt_image
    self.assertEqual(
  File "/srv/python3.8/lib/python3.8/unittest/case.py", line 912, in assertEqual
    assertion_func(first, second, msg=msg)
  File "/srv/python3.8/lib/python3.8/unittest/case.py", line 1211, in assertDictEqual
    self.fail(self._formatMessage(msg, standardMsg))
  File "/srv/python3.8/lib/python3.8/unittest/case.py", line 753, in fail
    raise self.failureException(msg)


FAILED:  plone.restapi.tests.test_dxfield_serializer.TestDexterityFieldSerializing.test_namedimage_field_serialization_returns_dict

Error Message:
{'fil[116 chars]id_1.png', 'width': 1024, 'height': 768, 'scal[695 chars]76}}} != {'fil[116 chars]id_1.gif', 'width': 1024, 'height': 768, 'scal[695 chars]12}}}

Stack Trace:
{'fil[116 chars]id_1.png', 'width': 1024, 'height': 768, 'scal[695 chars]76}}} != {'fil[116 chars]id_1.gif', 'width': 1024, 'height': 768, 'scal[695 chars]12}}}
  {'content-type': 'image/gif',
-  'download': 'http://nohost/plone/doc1/@@images/uuid_1.png',
?                                                        --

+  'download': 'http://nohost/plone/doc1/@@images/uuid_1.gif',
?                                                         ++

   'filename': '1024x768.gif',
   'height': 768,
   'scales': {'icon': {'download': 'http://nohost/plone/doc1/@@images/uuid_1.png',
                       'height': 24,
                       'width': 32},
              'large': {'download': 'http://nohost/plone/doc1/@@images/uuid_1.png',
                        'height': 576,
                        'width': 768},
              'listing': {'download': 'http://nohost/plone/doc1/@@images/uuid_1.png',
                          'height': 12,
                          'width': 16},
              'mini': {'download': 'http://nohost/plone/doc1/@@images/uuid_1.png',
                       'height': 150,
                       'width': 200},
              'preview': {'download': 'http://nohost/plone/doc1/@@images/uuid_1.png',
                          'height': 300,
                          'width': 400},
              'thumb': {'download': 'http://nohost/plone/doc1/@@images/uuid_1.png',
                        'height': 96,
                        'width': 128},
              'tile': {'download': 'http://nohost/plone/doc1/@@images/uuid_1.png',
                       'height': 48,
                       'width': 64}},
   'size': 1514,
   'width': 1024}

  File "/srv/python3.8/lib/python3.8/unittest/case.py", line 60, in testPartExecutor
    yield
  File "/srv/python3.8/lib/python3.8/unittest/case.py", line 676, in run
    self._callTestMethod(testMethod)
  File "/srv/python3.8/lib/python3.8/unittest/case.py", line 633, in _callTestMethod
    method()
  File "/home/jenkins/.buildout/eggs/cp38/plone.restapi-6.13.4-py3.8.egg/plone/restapi/tests/test_dxfield_serializer.py", line 269, in test_namedimage_field_serialization_returns_dict
    self.assertEqual(
  File "/srv/python3.8/lib/python3.8/unittest/case.py", line 912, in assertEqual
    assertion_func(first, second, msg=msg)
  File "/srv/python3.8/lib/python3.8/unittest/case.py", line 1211, in assertDictEqual
    self.fail(self._formatMessage(msg, standardMsg))
  File "/srv/python3.8/lib/python3.8/unittest/case.py", line 753, in fail
    raise self.failureException(msg)


More information about the Testbot mailing list