[Testbot] Plone 6.0 - Python 3.6 - Build # 84 - Still Failing!

jenkins at plone.org jenkins at plone.org
Fri Jun 26 08:43:22 UTC 2020


Plone 6.0 - Python 3.6 - Build # 84 - Still Failing:

Check console output at https://jenkins.plone.org/job/plone-6.0-python-3.6/84/ to view the results.


Plone 6.0 - Python 3.6 - Build # 84 - Still Failing:

Check console output at https://jenkins.plone.org/job/plone-6.0-python-3.6/84/ to view the results.

Test Results:

1 tests failed.
FAILED:  plone.formwidget.namedfile.widget.rst

Error Message:
Failed doctest test for widget.rst

Stack Trace:
Failed doctest test for widget.rst
  File "/home/jenkins/.buildout/eggs/cp36m/plone.formwidget.namedfile-2.1.0-py3.6.egg/plone/formwidget/namedfile/widget.rst", line 0

----------------------------------------------------------------------
File "/home/jenkins/.buildout/eggs/cp36m/plone.formwidget.namedfile-2.1.0-py3.6.egg/plone/formwidget/namedfile/widget.rst", line 408, in widget.rst
Failed example:
    view() == image_data
Exception raised:
    Traceback (most recent call last):
      File "/srv/python3.6/lib/python3.6/doctest.py", line 1330, in __run
        compileflags, 1), test.globs)
      File "<doctest widget.rst[143]>", line 1, in <module>
        view() == image_data
      File "/home/jenkins/.buildout/eggs/cp36m/plone.formwidget.namedfile-2.1.0-py3.6.egg/plone/formwidget/namedfile/widget.py", line 418, in __call__
        request_range = self.handle_request_range(file_)
    AttributeError: 'Download' object has no attribute 'handle_request_range'
----------------------------------------------------------------------
File "/home/jenkins/.buildout/eggs/cp36m/plone.formwidget.namedfile-2.1.0-py3.6.egg/plone/formwidget/namedfile/widget.rst", line 415, in widget.rst
Failed example:
    view()
Exception raised:
    Traceback (most recent call last):
      File "/srv/python3.6/lib/python3.6/doctest.py", line 1330, in __run
        compileflags, 1), test.globs)
      File "<doctest widget.rst[147]>", line 1, in <module>
        view()
      File "/home/jenkins/.buildout/eggs/cp36m/plone.formwidget.namedfile-2.1.0-py3.6.egg/plone/formwidget/namedfile/widget.py", line 418, in __call__
        request_range = self.handle_request_range(file_)
    AttributeError: 'Download' object has no attribute 'handle_request_range'
----------------------------------------------------------------------
File "/home/jenkins/.buildout/eggs/cp36m/plone.formwidget.namedfile-2.1.0-py3.6.egg/plone/formwidget/namedfile/widget.rst", line 426, in widget.rst
Failed example:
    view()
Exception raised:
    Traceback (most recent call last):
      File "/srv/python3.6/lib/python3.6/doctest.py", line 1330, in __run
        compileflags, 1), test.globs)
      File "<doctest widget.rst[152]>", line 1, in <module>
        view()
      File "/home/jenkins/.buildout/eggs/cp36m/plone.formwidget.namedfile-2.1.0-py3.6.egg/plone/formwidget/namedfile/widget.py", line 418, in __call__
        request_range = self.handle_request_range(file_)
    AttributeError: 'Download' object has no attribute 'handle_request_range'
----------------------------------------------------------------------
File "/home/jenkins/.buildout/eggs/cp36m/plone.formwidget.namedfile-2.1.0-py3.6.egg/plone/formwidget/namedfile/widget.rst", line 935, in widget.rst
Failed example:
    view()
Exception raised:
    Traceback (most recent call last):
      File "/srv/python3.6/lib/python3.6/doctest.py", line 1330, in __run
        compileflags, 1), test.globs)
      File "<doctest widget.rst[327]>", line 1, in <module>
        view()
      File "/home/jenkins/.buildout/eggs/cp36m/plone.formwidget.namedfile-2.1.0-py3.6.egg/plone/formwidget/namedfile/widget.py", line 418, in __call__
        request_range = self.handle_request_range(file_)
    AttributeError: 'Download' object has no attribute 'handle_request_range'
----------------------------------------------------------------------
File "/home/jenkins/.buildout/eggs/cp36m/plone.formwidget.namedfile-2.1.0-py3.6.egg/plone/formwidget/namedfile/widget.rst", line 942, in widget.rst
Failed example:
    view()
Exception raised:
    Traceback (most recent call last):
      File "/srv/python3.6/lib/python3.6/doctest.py", line 1330, in __run
        compileflags, 1), test.globs)
      File "<doctest widget.rst[330]>", line 1, in <module>
        view()
      File "/home/jenkins/.buildout/eggs/cp36m/plone.formwidget.namedfile-2.1.0-py3.6.egg/plone/formwidget/namedfile/widget.py", line 418, in __call__
        request_range = self.handle_request_range(file_)
    AttributeError: 'Download' object has no attribute 'handle_request_range'
----------------------------------------------------------------------
File "/home/jenkins/.buildout/eggs/cp36m/plone.formwidget.namedfile-2.1.0-py3.6.egg/plone/formwidget/namedfile/widget.rst", line 956, in widget.rst
Failed example:
    view()
Exception raised:
    Traceback (most recent call last):
      File "/srv/python3.6/lib/python3.6/doctest.py", line 1330, in __run
        compileflags, 1), test.globs)
      File "<doctest widget.rst[334]>", line 1, in <module>
        view()
      File "/home/jenkins/.buildout/eggs/cp36m/plone.formwidget.namedfile-2.1.0-py3.6.egg/plone/formwidget/namedfile/widget.py", line 418, in __call__
        request_range = self.handle_request_range(file_)
    AttributeError: 'Download' object has no attribute 'handle_request_range'
----------------------------------------------------------------------
File "/home/jenkins/.buildout/eggs/cp36m/plone.formwidget.namedfile-2.1.0-py3.6.egg/plone/formwidget/namedfile/widget.rst", line 960, in widget.rst
Failed example:
    request.response.getHeader('Accept-Ranges')
Expected:
    'bytes'
Got nothing
----------------------------------------------------------------------
File "/home/jenkins/.buildout/eggs/cp36m/plone.formwidget.namedfile-2.1.0-py3.6.egg/plone/formwidget/namedfile/widget.rst", line 967, in widget.rst
Failed example:
    view()
Exception raised:
    Traceback (most recent call last):
      File "/srv/python3.6/lib/python3.6/doctest.py", line 1330, in __run
        compileflags, 1), test.globs)
      File "<doctest widget.rst[339]>", line 1, in <module>
        view()
      File "/home/jenkins/.buildout/eggs/cp36m/plone.formwidget.namedfile-2.1.0-py3.6.egg/plone/formwidget/namedfile/widget.py", line 418, in __call__
        request_range = self.handle_request_range(file_)
    AttributeError: 'Download' object has no attribute 'handle_request_range'
----------------------------------------------------------------------
File "/home/jenkins/.buildout/eggs/cp36m/plone.formwidget.namedfile-2.1.0-py3.6.egg/plone/formwidget/namedfile/widget.rst", line 969, in widget.rst
Failed example:
    request.response.getStatus()
Expected:
    206
Got:
    599
----------------------------------------------------------------------
File "/home/jenkins/.buildout/eggs/cp36m/plone.formwidget.namedfile-2.1.0-py3.6.egg/plone/formwidget/namedfile/widget.rst", line 975, in widget.rst
Failed example:
    request.response.getHeader('Content-Length')
Expected:
    '4'
Got:
    '8'
----------------------------------------------------------------------
File "/home/jenkins/.buildout/eggs/cp36m/plone.formwidget.namedfile-2.1.0-py3.6.egg/plone/formwidget/namedfile/widget.rst", line 977, in widget.rst
Failed example:
    request.response.getHeader('Content-Range')
Expected:
    'bytes 0-3/8'
Got nothing


  File "/srv/python3.6/lib/python3.6/unittest/case.py", line 59, in testPartExecutor
    yield
  File "/srv/python3.6/lib/python3.6/unittest/case.py", line 605, in run
    testMethod()
  File "/srv/python3.6/lib/python3.6/doctest.py", line 2199, in runTest
    raise self.failureException(self.format_failure(new.getvalue()))


More information about the Testbot mailing list