[Testbot] Plone 4.3 - Python 2.7 - Build # 71 - Failure!

jenkins at plone.org jenkins at plone.org
Fri Jun 5 17:13:12 UTC 2020


Plone 4.3 - Python 2.7 - Build # 71 - Failure:

Check console output at https://jenkins.plone.org/job/plone-4.3-python-2.7/71/ to view the results.


Plone 4.3 - Python 2.7 - Build # 71 - Failure:

Check console output at https://jenkins.plone.org/job/plone-4.3-python-2.7/71/ to view the results.

Test Results:

1 tests failed.
FAILED:  Products.CMFPlone.tests.test_robot.RobotTestCase.Scenario Livesearch in current folder only

Error Message:
Keyword 'Element Should Be Visible' failed after retrying for 5 seconds. The last error was: UnexpectedAlertPresentException: Alert Text: None

Stack Trace:
Keyword 'Element Should Be Visible' failed after retrying for 5 seconds. The last error was: UnexpectedAlertPresentException: Alert Text: None
Message: unexpected alert open: {Alert text : }
  (Session info: chrome=83.0.4103.61)
  (Driver info: chromedriver=83.0.4103.61 (94f915a8d7c408b09cc7352161ad592299f384d2-refs/branch-heads/4103@{#561}),platform=Linux 4.15.0-47-generic x86_64)


  File "/home/jenkins/.buildout/eggs/unittest2-0.5.1-py2.7.egg/unittest2/case.py", line 340, in run
    testMethod()
  File "/home/jenkins/.buildout/eggs/robotsuite-1.7.0-py2.7.egg/robotsuite/__init__.py", line 461, in runTest
    assert last_status == 'PASS', last_message


More information about the Testbot mailing list