[Testbot] Plone 5.2 - Python 2.7 - Build # 559 - Still Failing!

jenkins at plone.org jenkins at plone.org
Mon Feb 17 18:09:46 UTC 2020


Plone 5.2 - Python 2.7 - Build # 559 - Still Failing:

Check console output at https://jenkins.plone.org/job/plone-5.2-python-2.7/559/ to view the results.


Plone 5.2 - Python 2.7 - Build # 559 - Still Failing:

Check console output at https://jenkins.plone.org/job/plone-5.2-python-2.7/559/ to view the results.

Test Results:

4 tests failed.
FAILED:  Products.CMFPlone.tests.testMigrationTool.TestMigrationTool.testDoUpgrades

Error Message:
Tuples differ: ('5208',) != (u'5209',)

Stack Trace:
Tuples differ: ('5208',) != (u'5209',)

First differing element 0:
'5208'
u'5209'

- ('5208',)
?      ^

+ (u'5209',)
?  +    ^


  File "/srv/python2.7/lib/python2.7/unittest/case.py", line 329, in run
    testMethod()
  File "/home/jenkins/workspace/plone-5.2-python-2.7/src/Products.CMFPlone/Products/CMFPlone/tests/testMigrationTool.py", line 65, in testDoUpgrades
    self.assertEqual(last, current)
  File "/srv/python2.7/lib/python2.7/unittest/case.py", line 513, in assertEqual
    assertion_func(first, second, msg=msg)
  File "/srv/python2.7/lib/python2.7/unittest/case.py", line 754, in assertTupleEqual
    self.assertSequenceEqual(tuple1, tuple2, msg, seq_type=tuple)
  File "/srv/python2.7/lib/python2.7/unittest/case.py", line 725, in assertSequenceEqual
    self.fail(msg)
  File "/srv/python2.7/lib/python2.7/unittest/case.py", line 410, in fail
    raise self.failureException(msg)


FAILED:  Products.CMFPlone.tests.testMigrationTool.TestMigrationTool.testUpgrade

Error Message:
Tuples differ: ('5208',) != (u'5209',)

Stack Trace:
Tuples differ: ('5208',) != (u'5209',)

First differing element 0:
'5208'
u'5209'

- ('5208',)
?      ^

+ (u'5209',)
?  +    ^


  File "/srv/python2.7/lib/python2.7/unittest/case.py", line 329, in run
    testMethod()
  File "/home/jenkins/workspace/plone-5.2-python-2.7/src/Products.CMFPlone/Products/CMFPlone/tests/testMigrationTool.py", line 80, in testUpgrade
    self.assertEqual(last, current)
  File "/srv/python2.7/lib/python2.7/unittest/case.py", line 513, in assertEqual
    assertion_func(first, second, msg=msg)
  File "/srv/python2.7/lib/python2.7/unittest/case.py", line 754, in assertTupleEqual
    self.assertSequenceEqual(tuple1, tuple2, msg, seq_type=tuple)
  File "/srv/python2.7/lib/python2.7/unittest/case.py", line 725, in assertSequenceEqual
    self.fail(msg)
  File "/srv/python2.7/lib/python2.7/unittest/case.py", line 410, in fail
    raise self.failureException(msg)


FAILED:  Products.CMFPlone.tests.testMigrationTool.TestMigrationWithExtraUpgrades.testUpgrade

Error Message:
Tuples differ: ('5208',) != (u'5209',)

Stack Trace:
Tuples differ: ('5208',) != (u'5209',)

First differing element 0:
'5208'
u'5209'

- ('5208',)
?      ^

+ (u'5209',)
?  +    ^


  File "/srv/python2.7/lib/python2.7/unittest/case.py", line 329, in run
    testMethod()
  File "/home/jenkins/workspace/plone-5.2-python-2.7/src/Products.CMFPlone/Products/CMFPlone/tests/testMigrationTool.py", line 141, in testUpgrade
    self.assertEqual(last, current)
  File "/srv/python2.7/lib/python2.7/unittest/case.py", line 513, in assertEqual
    assertion_func(first, second, msg=msg)
  File "/srv/python2.7/lib/python2.7/unittest/case.py", line 754, in assertTupleEqual
    self.assertSequenceEqual(tuple1, tuple2, msg, seq_type=tuple)
  File "/srv/python2.7/lib/python2.7/unittest/case.py", line 725, in assertSequenceEqual
    self.fail(msg)
  File "/srv/python2.7/lib/python2.7/unittest/case.py", line 410, in fail
    raise self.failureException(msg)


FAILED:  plone.app.upgrade.tests.test_upgrade.TestUpgrade.testDoUpgrades

Error Message:
Tuples differ: ('5208',) != (u'5209',)

Stack Trace:
Tuples differ: ('5208',) != (u'5209',)

First differing element 0:
'5208'
u'5209'

- ('5208',)
?      ^

+ (u'5209',)
?  +    ^


  File "/srv/python2.7/lib/python2.7/unittest/case.py", line 329, in run
    testMethod()
  File "/home/jenkins/workspace/plone-5.2-python-2.7/src/plone.app.upgrade/plone/app/upgrade/tests/test_upgrade.py", line 64, in testDoUpgrades
    self.assertEqual(last, current)
  File "/srv/python2.7/lib/python2.7/unittest/case.py", line 513, in assertEqual
    assertion_func(first, second, msg=msg)
  File "/srv/python2.7/lib/python2.7/unittest/case.py", line 754, in assertTupleEqual
    self.assertSequenceEqual(tuple1, tuple2, msg, seq_type=tuple)
  File "/srv/python2.7/lib/python2.7/unittest/case.py", line 725, in assertSequenceEqual
    self.fail(msg)
  File "/srv/python2.7/lib/python2.7/unittest/case.py", line 410, in fail
    raise self.failureException(msg)


More information about the Testbot mailing list