[Testbot] Plone 5.2 - Python 3.8 - Build # 280 - Failure!

jenkins at plone.org jenkins at plone.org
Mon Feb 17 16:05:12 UTC 2020


Plone 5.2 - Python 3.8 - Build # 280 - Failure:

Check console output at https://jenkins.plone.org/job/plone-5.2-python-3.8/280/ to view the results.


Plone 5.2 - Python 3.8 - Build # 280 - Failure:

Check console output at https://jenkins.plone.org/job/plone-5.2-python-3.8/280/ to view the results.

Test Results:

4 tests failed.
FAILED:  Products.CMFPlone.tests.testMigrationTool.TestMigrationTool.testDoUpgrades

Error Message:
Tuples differ: ('5208',) != ('5209',)

Stack Trace:
Tuples differ: ('5208',) != ('5209',)

First differing element 0:
'5208'
'5209'

- ('5208',)
?      ^

+ ('5209',)
?      ^


  File "/srv/python3.8/lib/python3.8/unittest/case.py", line 60, in testPartExecutor
    yield
  File "/srv/python3.8/lib/python3.8/unittest/case.py", line 676, in run
    self._callTestMethod(testMethod)
  File "/srv/python3.8/lib/python3.8/unittest/case.py", line 633, in _callTestMethod
    method()
  File "/home/jenkins/workspace/plone-5.2-python-3.8/src/Products.CMFPlone/Products/CMFPlone/tests/testMigrationTool.py", line 65, in testDoUpgrades
    self.assertEqual(last, current)
  File "/srv/python3.8/lib/python3.8/unittest/case.py", line 912, in assertEqual
    assertion_func(first, second, msg=msg)
  File "/srv/python3.8/lib/python3.8/unittest/case.py", line 1129, in assertTupleEqual
    self.assertSequenceEqual(tuple1, tuple2, msg, seq_type=tuple)
  File "/srv/python3.8/lib/python3.8/unittest/case.py", line 1100, in assertSequenceEqual
    self.fail(msg)
  File "/srv/python3.8/lib/python3.8/unittest/case.py", line 753, in fail
    raise self.failureException(msg)


FAILED:  Products.CMFPlone.tests.testMigrationTool.TestMigrationTool.testUpgrade

Error Message:
Tuples differ: ('5208',) != ('5209',)

Stack Trace:
Tuples differ: ('5208',) != ('5209',)

First differing element 0:
'5208'
'5209'

- ('5208',)
?      ^

+ ('5209',)
?      ^


  File "/srv/python3.8/lib/python3.8/unittest/case.py", line 60, in testPartExecutor
    yield
  File "/srv/python3.8/lib/python3.8/unittest/case.py", line 676, in run
    self._callTestMethod(testMethod)
  File "/srv/python3.8/lib/python3.8/unittest/case.py", line 633, in _callTestMethod
    method()
  File "/home/jenkins/workspace/plone-5.2-python-3.8/src/Products.CMFPlone/Products/CMFPlone/tests/testMigrationTool.py", line 80, in testUpgrade
    self.assertEqual(last, current)
  File "/srv/python3.8/lib/python3.8/unittest/case.py", line 912, in assertEqual
    assertion_func(first, second, msg=msg)
  File "/srv/python3.8/lib/python3.8/unittest/case.py", line 1129, in assertTupleEqual
    self.assertSequenceEqual(tuple1, tuple2, msg, seq_type=tuple)
  File "/srv/python3.8/lib/python3.8/unittest/case.py", line 1100, in assertSequenceEqual
    self.fail(msg)
  File "/srv/python3.8/lib/python3.8/unittest/case.py", line 753, in fail
    raise self.failureException(msg)


FAILED:  Products.CMFPlone.tests.testMigrationTool.TestMigrationWithExtraUpgrades.testUpgrade

Error Message:
Tuples differ: ('5208',) != ('5209',)

Stack Trace:
Tuples differ: ('5208',) != ('5209',)

First differing element 0:
'5208'
'5209'

- ('5208',)
?      ^

+ ('5209',)
?      ^


  File "/srv/python3.8/lib/python3.8/unittest/case.py", line 60, in testPartExecutor
    yield
  File "/srv/python3.8/lib/python3.8/unittest/case.py", line 676, in run
    self._callTestMethod(testMethod)
  File "/srv/python3.8/lib/python3.8/unittest/case.py", line 633, in _callTestMethod
    method()
  File "/home/jenkins/workspace/plone-5.2-python-3.8/src/Products.CMFPlone/Products/CMFPlone/tests/testMigrationTool.py", line 141, in testUpgrade
    self.assertEqual(last, current)
  File "/srv/python3.8/lib/python3.8/unittest/case.py", line 912, in assertEqual
    assertion_func(first, second, msg=msg)
  File "/srv/python3.8/lib/python3.8/unittest/case.py", line 1129, in assertTupleEqual
    self.assertSequenceEqual(tuple1, tuple2, msg, seq_type=tuple)
  File "/srv/python3.8/lib/python3.8/unittest/case.py", line 1100, in assertSequenceEqual
    self.fail(msg)
  File "/srv/python3.8/lib/python3.8/unittest/case.py", line 753, in fail
    raise self.failureException(msg)


FAILED:  plone.app.upgrade.tests.test_upgrade.TestUpgrade.testDoUpgrades

Error Message:
Tuples differ: ('5208',) != ('5209',)

Stack Trace:
Tuples differ: ('5208',) != ('5209',)

First differing element 0:
'5208'
'5209'

- ('5208',)
?      ^

+ ('5209',)
?      ^


  File "/srv/python3.8/lib/python3.8/unittest/case.py", line 60, in testPartExecutor
    yield
  File "/srv/python3.8/lib/python3.8/unittest/case.py", line 676, in run
    self._callTestMethod(testMethod)
  File "/srv/python3.8/lib/python3.8/unittest/case.py", line 633, in _callTestMethod
    method()
  File "/home/jenkins/workspace/plone-5.2-python-3.8/src/plone.app.upgrade/plone/app/upgrade/tests/test_upgrade.py", line 64, in testDoUpgrades
    self.assertEqual(last, current)
  File "/srv/python3.8/lib/python3.8/unittest/case.py", line 912, in assertEqual
    assertion_func(first, second, msg=msg)
  File "/srv/python3.8/lib/python3.8/unittest/case.py", line 1129, in assertTupleEqual
    self.assertSequenceEqual(tuple1, tuple2, msg, seq_type=tuple)
  File "/srv/python3.8/lib/python3.8/unittest/case.py", line 1100, in assertSequenceEqual
    self.fail(msg)
  File "/srv/python3.8/lib/python3.8/unittest/case.py", line 753, in fail
    raise self.failureException(msg)


More information about the Testbot mailing list