[Testbot] Plone 5.2 - Python 3.7 - Build # 507 - Failure!

jenkins at plone.org jenkins at plone.org
Mon Feb 17 15:55:02 UTC 2020


Plone 5.2 - Python 3.7 - Build # 507 - Failure:

Check console output at https://jenkins.plone.org/job/plone-5.2-python-3.7/507/ to view the results.


Plone 5.2 - Python 3.7 - Build # 507 - Failure:

Check console output at https://jenkins.plone.org/job/plone-5.2-python-3.7/507/ to view the results.

Test Results:

4 tests failed.
FAILED:  Products.CMFPlone.tests.testMigrationTool.TestMigrationTool.testDoUpgrades

Error Message:
Tuples differ: ('5208',) != ('5209',)

Stack Trace:
Tuples differ: ('5208',) != ('5209',)

First differing element 0:
'5208'
'5209'

- ('5208',)
?      ^

+ ('5209',)
?      ^


  File "/srv/python3.7/lib/python3.7/unittest/case.py", line 59, in testPartExecutor
    yield
  File "/srv/python3.7/lib/python3.7/unittest/case.py", line 628, in run
    testMethod()
  File "/home/jenkins/workspace/plone-5.2-python-3.7/src/Products.CMFPlone/Products/CMFPlone/tests/testMigrationTool.py", line 65, in testDoUpgrades
    self.assertEqual(last, current)
  File "/srv/python3.7/lib/python3.7/unittest/case.py", line 852, in assertEqual
    assertion_func(first, second, msg=msg)
  File "/srv/python3.7/lib/python3.7/unittest/case.py", line 1069, in assertTupleEqual
    self.assertSequenceEqual(tuple1, tuple2, msg, seq_type=tuple)
  File "/srv/python3.7/lib/python3.7/unittest/case.py", line 1040, in assertSequenceEqual
    self.fail(msg)
  File "/srv/python3.7/lib/python3.7/unittest/case.py", line 693, in fail
    raise self.failureException(msg)


FAILED:  Products.CMFPlone.tests.testMigrationTool.TestMigrationTool.testUpgrade

Error Message:
Tuples differ: ('5208',) != ('5209',)

Stack Trace:
Tuples differ: ('5208',) != ('5209',)

First differing element 0:
'5208'
'5209'

- ('5208',)
?      ^

+ ('5209',)
?      ^


  File "/srv/python3.7/lib/python3.7/unittest/case.py", line 59, in testPartExecutor
    yield
  File "/srv/python3.7/lib/python3.7/unittest/case.py", line 628, in run
    testMethod()
  File "/home/jenkins/workspace/plone-5.2-python-3.7/src/Products.CMFPlone/Products/CMFPlone/tests/testMigrationTool.py", line 80, in testUpgrade
    self.assertEqual(last, current)
  File "/srv/python3.7/lib/python3.7/unittest/case.py", line 852, in assertEqual
    assertion_func(first, second, msg=msg)
  File "/srv/python3.7/lib/python3.7/unittest/case.py", line 1069, in assertTupleEqual
    self.assertSequenceEqual(tuple1, tuple2, msg, seq_type=tuple)
  File "/srv/python3.7/lib/python3.7/unittest/case.py", line 1040, in assertSequenceEqual
    self.fail(msg)
  File "/srv/python3.7/lib/python3.7/unittest/case.py", line 693, in fail
    raise self.failureException(msg)


FAILED:  Products.CMFPlone.tests.testMigrationTool.TestMigrationWithExtraUpgrades.testUpgrade

Error Message:
Tuples differ: ('5208',) != ('5209',)

Stack Trace:
Tuples differ: ('5208',) != ('5209',)

First differing element 0:
'5208'
'5209'

- ('5208',)
?      ^

+ ('5209',)
?      ^


  File "/srv/python3.7/lib/python3.7/unittest/case.py", line 59, in testPartExecutor
    yield
  File "/srv/python3.7/lib/python3.7/unittest/case.py", line 628, in run
    testMethod()
  File "/home/jenkins/workspace/plone-5.2-python-3.7/src/Products.CMFPlone/Products/CMFPlone/tests/testMigrationTool.py", line 141, in testUpgrade
    self.assertEqual(last, current)
  File "/srv/python3.7/lib/python3.7/unittest/case.py", line 852, in assertEqual
    assertion_func(first, second, msg=msg)
  File "/srv/python3.7/lib/python3.7/unittest/case.py", line 1069, in assertTupleEqual
    self.assertSequenceEqual(tuple1, tuple2, msg, seq_type=tuple)
  File "/srv/python3.7/lib/python3.7/unittest/case.py", line 1040, in assertSequenceEqual
    self.fail(msg)
  File "/srv/python3.7/lib/python3.7/unittest/case.py", line 693, in fail
    raise self.failureException(msg)


FAILED:  plone.app.upgrade.tests.test_upgrade.TestUpgrade.testDoUpgrades

Error Message:
Tuples differ: ('5208',) != ('5209',)

Stack Trace:
Tuples differ: ('5208',) != ('5209',)

First differing element 0:
'5208'
'5209'

- ('5208',)
?      ^

+ ('5209',)
?      ^


  File "/srv/python3.7/lib/python3.7/unittest/case.py", line 59, in testPartExecutor
    yield
  File "/srv/python3.7/lib/python3.7/unittest/case.py", line 628, in run
    testMethod()
  File "/home/jenkins/workspace/plone-5.2-python-3.7/src/plone.app.upgrade/plone/app/upgrade/tests/test_upgrade.py", line 64, in testDoUpgrades
    self.assertEqual(last, current)
  File "/srv/python3.7/lib/python3.7/unittest/case.py", line 852, in assertEqual
    assertion_func(first, second, msg=msg)
  File "/srv/python3.7/lib/python3.7/unittest/case.py", line 1069, in assertTupleEqual
    self.assertSequenceEqual(tuple1, tuple2, msg, seq_type=tuple)
  File "/srv/python3.7/lib/python3.7/unittest/case.py", line 1040, in assertSequenceEqual
    self.fail(msg)
  File "/srv/python3.7/lib/python3.7/unittest/case.py", line 693, in fail
    raise self.failureException(msg)


More information about the Testbot mailing list