[Testbot] Plone 5.2 - Python 3.8 - Build # 269 - Failure!

jenkins at plone.org jenkins at plone.org
Fri Feb 14 09:31:23 UTC 2020


Plone 5.2 - Python 3.8 - Build # 269 - Failure:

Check console output at https://jenkins.plone.org/job/plone-5.2-python-3.8/269/ to view the results.


Plone 5.2 - Python 3.8 - Build # 269 - Failure:

Check console output at https://jenkins.plone.org/job/plone-5.2-python-3.8/269/ to view the results.

Test Results:

3 tests failed.
FAILED:  Products.GenericSetup.tests.test_tool.SetupToolTests.test_runAllImportStepsFromProfile_with_default_strategy

Error Message:
Lists differ: ['/tmp/STT_test'] != ['/tmp/STT_test3', '/tmp/STT_test']

Stack Trace:
Lists differ: ['/tmp/STT_test'] != ['/tmp/STT_test3', '/tmp/STT_test']

First differing element 0:
'/tmp/STT_test'
'/tmp/STT_test3'

Second list contains 1 additional elements.
First extra element 1:
'/tmp/STT_test'

- ['/tmp/STT_test']
+ ['/tmp/STT_test3', '/tmp/STT_test']

  File "/srv/python3.8/lib/python3.8/unittest/case.py", line 60, in testPartExecutor
    yield
  File "/srv/python3.8/lib/python3.8/unittest/case.py", line 676, in run
    self._callTestMethod(testMethod)
  File "/srv/python3.8/lib/python3.8/unittest/case.py", line 633, in _callTestMethod
    method()
  File "/home/jenkins/workspace/plone-5.2-python-3.8/src/Products.GenericSetup/Products/GenericSetup/tests/test_tool.py", line 635, in test_runAllImportStepsFromProfile_with_default_strategy
    self.assertEqual(tool._imported,
  File "/srv/python3.8/lib/python3.8/unittest/case.py", line 912, in assertEqual
    assertion_func(first, second, msg=msg)
  File "/srv/python3.8/lib/python3.8/unittest/case.py", line 1118, in assertListEqual
    self.assertSequenceEqual(list1, list2, msg, seq_type=list)
  File "/srv/python3.8/lib/python3.8/unittest/case.py", line 1100, in assertSequenceEqual
    self.fail(msg)
  File "/srv/python3.8/lib/python3.8/unittest/case.py", line 753, in fail
    raise self.failureException(msg)


FAILED:  Products.GenericSetup.tests.test_tool.SetupToolTests.test_runAllImportStepsFromProfile_with_new_strategy

Error Message:
Lists differ: ['/tmp/STT_test'] != ['/tmp/STT_test3', '/tmp/STT_test']

Stack Trace:
Lists differ: ['/tmp/STT_test'] != ['/tmp/STT_test3', '/tmp/STT_test']

First differing element 0:
'/tmp/STT_test'
'/tmp/STT_test3'

Second list contains 1 additional elements.
First extra element 1:
'/tmp/STT_test'

- ['/tmp/STT_test']
+ ['/tmp/STT_test3', '/tmp/STT_test']

  File "/srv/python3.8/lib/python3.8/unittest/case.py", line 60, in testPartExecutor
    yield
  File "/srv/python3.8/lib/python3.8/unittest/case.py", line 676, in run
    self._callTestMethod(testMethod)
  File "/srv/python3.8/lib/python3.8/unittest/case.py", line 633, in _callTestMethod
    method()
  File "/home/jenkins/workspace/plone-5.2-python-3.8/src/Products.GenericSetup/Products/GenericSetup/tests/test_tool.py", line 675, in test_runAllImportStepsFromProfile_with_new_strategy
    self.assertEqual(tool._imported,
  File "/srv/python3.8/lib/python3.8/unittest/case.py", line 912, in assertEqual
    assertion_func(first, second, msg=msg)
  File "/srv/python3.8/lib/python3.8/unittest/case.py", line 1118, in assertListEqual
    self.assertSequenceEqual(list1, list2, msg, seq_type=list)
  File "/srv/python3.8/lib/python3.8/unittest/case.py", line 1100, in assertSequenceEqual
    self.fail(msg)
  File "/srv/python3.8/lib/python3.8/unittest/case.py", line 753, in fail
    raise self.failureException(msg)


FAILED:  Products.GenericSetup.tests.test_tool.SetupToolTests.test_runAllImportStepsFromProfile_with_reapply_strategy

Error Message:
Lists differ: ['/tmp/STT_test'] != ['/tmp/STT_test2', '/tmp/STT_test3', '/tmp/STT_test']

Stack Trace:
Lists differ: ['/tmp/STT_test'] != ['/tmp/STT_test2', '/tmp/STT_test3', '/tmp/STT_test']

First differing element 0:
'/tmp/STT_test'
'/tmp/STT_test2'

Second list contains 2 additional elements.
First extra element 1:
'/tmp/STT_test3'

- ['/tmp/STT_test']
+ ['/tmp/STT_test2', '/tmp/STT_test3', '/tmp/STT_test']

  File "/srv/python3.8/lib/python3.8/unittest/case.py", line 60, in testPartExecutor
    yield
  File "/srv/python3.8/lib/python3.8/unittest/case.py", line 676, in run
    self._callTestMethod(testMethod)
  File "/srv/python3.8/lib/python3.8/unittest/case.py", line 633, in _callTestMethod
    method()
  File "/home/jenkins/workspace/plone-5.2-python-3.8/src/Products.GenericSetup/Products/GenericSetup/tests/test_tool.py", line 656, in test_runAllImportStepsFromProfile_with_reapply_strategy
    self.assertEqual(tool._imported,
  File "/srv/python3.8/lib/python3.8/unittest/case.py", line 912, in assertEqual
    assertion_func(first, second, msg=msg)
  File "/srv/python3.8/lib/python3.8/unittest/case.py", line 1118, in assertListEqual
    self.assertSequenceEqual(list1, list2, msg, seq_type=list)
  File "/srv/python3.8/lib/python3.8/unittest/case.py", line 1100, in assertSequenceEqual
    self.fail(msg)
  File "/srv/python3.8/lib/python3.8/unittest/case.py", line 753, in fail
    raise self.failureException(msg)


More information about the Testbot mailing list