[Testbot] Plone 6.0 - Python 3.6 - Build # 24 - Still Failing!

jenkins at plone.org jenkins at plone.org
Tue Feb 11 22:26:59 UTC 2020


Plone 6.0 - Python 3.6 - Build # 24 - Still Failing:

Check console output at https://jenkins.plone.org/job/plone-6.0-python-3.6/24/ to view the results.


Plone 6.0 - Python 3.6 - Build # 24 - Still Failing:

Check console output at https://jenkins.plone.org/job/plone-6.0-python-3.6/24/ to view the results.

Test Results:

29 tests failed.
FAILED:  Products.CMFEditions.tests.test_ATContentTypes.Startup

Error Message:
No module named 'App.class_init'

Stack Trace:
No module named 'App.class_init'

  File "/home/jenkins/.buildout/eggs/cp36m/Products.CMFEditions-3.3.3-py3.6.egg/Products/CMFEditions/__init__.py", line 31, in <module>
    from Products.CMFEditions import historyidhandlertool
  File "/home/jenkins/.buildout/eggs/cp36m/Products.CMFEditions-3.3.3-py3.6.egg/Products/CMFEditions/historyidhandlertool.py", line 22, in <module>
    from Products.CMFUid.UniqueIdHandlerTool import UniqueIdHandlerTool
  File "/home/jenkins/.buildout/eggs/cp36m/Products.CMFUid-3.0.1-py3.6.egg/Products/CMFUid/UniqueIdHandlerTool.py", line 24, in <module>
    from App.class_init import InitializeClass


FAILED:  Products.CMFEditions.tests.test_ATReferences.Startup

Error Message:
No module named 'App.class_init'

Stack Trace:
No module named 'App.class_init'

  File "/home/jenkins/.buildout/eggs/cp36m/Products.CMFEditions-3.3.3-py3.6.egg/Products/CMFEditions/__init__.py", line 31, in <module>
    from Products.CMFEditions import historyidhandlertool
  File "/home/jenkins/.buildout/eggs/cp36m/Products.CMFEditions-3.3.3-py3.6.egg/Products/CMFEditions/historyidhandlertool.py", line 22, in <module>
    from Products.CMFUid.UniqueIdHandlerTool import UniqueIdHandlerTool
  File "/home/jenkins/.buildout/eggs/cp36m/Products.CMFUid-3.0.1-py3.6.egg/Products/CMFUid/UniqueIdHandlerTool.py", line 24, in <module>
    from App.class_init import InitializeClass


FAILED:  Products.CMFEditions.tests.test_ArchivistTool.Startup

Error Message:
No module named 'App.class_init'

Stack Trace:
No module named 'App.class_init'

  File "/home/jenkins/.buildout/eggs/cp36m/Products.CMFEditions-3.3.3-py3.6.egg/Products/CMFEditions/__init__.py", line 31, in <module>
    from Products.CMFEditions import historyidhandlertool
  File "/home/jenkins/.buildout/eggs/cp36m/Products.CMFEditions-3.3.3-py3.6.egg/Products/CMFEditions/historyidhandlertool.py", line 22, in <module>
    from Products.CMFUid.UniqueIdHandlerTool import UniqueIdHandlerTool
  File "/home/jenkins/.buildout/eggs/cp36m/Products.CMFUid-3.0.1-py3.6.egg/Products/CMFUid/UniqueIdHandlerTool.py", line 24, in <module>
    from App.class_init import InitializeClass


FAILED:  Products.CMFEditions.tests.test_ContentTypes.Startup

Error Message:
No module named 'App.class_init'

Stack Trace:
No module named 'App.class_init'

  File "/home/jenkins/.buildout/eggs/cp36m/Products.CMFEditions-3.3.3-py3.6.egg/Products/CMFEditions/__init__.py", line 31, in <module>
    from Products.CMFEditions import historyidhandlertool
  File "/home/jenkins/.buildout/eggs/cp36m/Products.CMFEditions-3.3.3-py3.6.egg/Products/CMFEditions/historyidhandlertool.py", line 22, in <module>
    from Products.CMFUid.UniqueIdHandlerTool import UniqueIdHandlerTool
  File "/home/jenkins/.buildout/eggs/cp36m/Products.CMFUid-3.0.1-py3.6.egg/Products/CMFUid/UniqueIdHandlerTool.py", line 24, in <module>
    from App.class_init import InitializeClass


FAILED:  Products.CMFEditions.tests.test_CopyModifyMergeRepositoryTool.Startup

Error Message:
No module named 'App.class_init'

Stack Trace:
No module named 'App.class_init'

  File "/home/jenkins/.buildout/eggs/cp36m/Products.CMFEditions-3.3.3-py3.6.egg/Products/CMFEditions/__init__.py", line 31, in <module>
    from Products.CMFEditions import historyidhandlertool
  File "/home/jenkins/.buildout/eggs/cp36m/Products.CMFEditions-3.3.3-py3.6.egg/Products/CMFEditions/historyidhandlertool.py", line 22, in <module>
    from Products.CMFUid.UniqueIdHandlerTool import UniqueIdHandlerTool
  File "/home/jenkins/.buildout/eggs/cp36m/Products.CMFUid-3.0.1-py3.6.egg/Products/CMFUid/UniqueIdHandlerTool.py", line 24, in <module>
    from App.class_init import InitializeClass


FAILED:  Products.CMFEditions.tests.test_IntegrationTests.Startup

Error Message:
No module named 'App.class_init'

Stack Trace:
No module named 'App.class_init'

  File "/home/jenkins/.buildout/eggs/cp36m/Products.CMFEditions-3.3.3-py3.6.egg/Products/CMFEditions/__init__.py", line 31, in <module>
    from Products.CMFEditions import historyidhandlertool
  File "/home/jenkins/.buildout/eggs/cp36m/Products.CMFEditions-3.3.3-py3.6.egg/Products/CMFEditions/historyidhandlertool.py", line 22, in <module>
    from Products.CMFUid.UniqueIdHandlerTool import UniqueIdHandlerTool
  File "/home/jenkins/.buildout/eggs/cp36m/Products.CMFUid-3.0.1-py3.6.egg/Products/CMFUid/UniqueIdHandlerTool.py", line 24, in <module>
    from App.class_init import InitializeClass


FAILED:  Products.CMFEditions.tests.test_KeepLastNVersionsTool.Startup

Error Message:
No module named 'App.class_init'

Stack Trace:
No module named 'App.class_init'

  File "/home/jenkins/.buildout/eggs/cp36m/Products.CMFEditions-3.3.3-py3.6.egg/Products/CMFEditions/__init__.py", line 31, in <module>
    from Products.CMFEditions import historyidhandlertool
  File "/home/jenkins/.buildout/eggs/cp36m/Products.CMFEditions-3.3.3-py3.6.egg/Products/CMFEditions/historyidhandlertool.py", line 22, in <module>
    from Products.CMFUid.UniqueIdHandlerTool import UniqueIdHandlerTool
  File "/home/jenkins/.buildout/eggs/cp36m/Products.CMFUid-3.0.1-py3.6.egg/Products/CMFUid/UniqueIdHandlerTool.py", line 24, in <module>
    from App.class_init import InitializeClass


FAILED:  Products.CMFEditions.tests.test_ModifierRegistryTool.Startup

Error Message:
No module named 'App.class_init'

Stack Trace:
No module named 'App.class_init'

  File "/home/jenkins/.buildout/eggs/cp36m/Products.CMFEditions-3.3.3-py3.6.egg/Products/CMFEditions/__init__.py", line 31, in <module>
    from Products.CMFEditions import historyidhandlertool
  File "/home/jenkins/.buildout/eggs/cp36m/Products.CMFEditions-3.3.3-py3.6.egg/Products/CMFEditions/historyidhandlertool.py", line 22, in <module>
    from Products.CMFUid.UniqueIdHandlerTool import UniqueIdHandlerTool
  File "/home/jenkins/.buildout/eggs/cp36m/Products.CMFUid-3.0.1-py3.6.egg/Products/CMFUid/UniqueIdHandlerTool.py", line 24, in <module>
    from App.class_init import InitializeClass


FAILED:  Products.CMFEditions.tests.test_ZVCStorageTool.Startup

Error Message:
No module named 'App.class_init'

Stack Trace:
No module named 'App.class_init'

  File "/home/jenkins/.buildout/eggs/cp36m/Products.CMFEditions-3.3.3-py3.6.egg/Products/CMFEditions/__init__.py", line 31, in <module>
    from Products.CMFEditions import historyidhandlertool
  File "/home/jenkins/.buildout/eggs/cp36m/Products.CMFEditions-3.3.3-py3.6.egg/Products/CMFEditions/historyidhandlertool.py", line 22, in <module>
    from Products.CMFUid.UniqueIdHandlerTool import UniqueIdHandlerTool
  File "/home/jenkins/.buildout/eggs/cp36m/Products.CMFUid-3.0.1-py3.6.egg/Products/CMFUid/UniqueIdHandlerTool.py", line 24, in <module>
    from App.class_init import InitializeClass


FAILED:  Products.CMFEditions.tests.test_doctests.Startup

Error Message:
No module named 'App.class_init'

Stack Trace:
No module named 'App.class_init'

  File "/home/jenkins/.buildout/eggs/cp36m/Products.CMFEditions-3.3.3-py3.6.egg/Products/CMFEditions/__init__.py", line 31, in <module>
    from Products.CMFEditions import historyidhandlertool
  File "/home/jenkins/.buildout/eggs/cp36m/Products.CMFEditions-3.3.3-py3.6.egg/Products/CMFEditions/historyidhandlertool.py", line 22, in <module>
    from Products.CMFUid.UniqueIdHandlerTool import UniqueIdHandlerTool
  File "/home/jenkins/.buildout/eggs/cp36m/Products.CMFUid-3.0.1-py3.6.egg/Products/CMFUid/UniqueIdHandlerTool.py", line 24, in <module>
    from App.class_init import InitializeClass


FAILED:  Products.CMFEditions.tests.test_versions_history_form.Startup

Error Message:
No module named 'App.class_init'

Stack Trace:
No module named 'App.class_init'

  File "/home/jenkins/.buildout/eggs/cp36m/Products.CMFEditions-3.3.3-py3.6.egg/Products/CMFEditions/__init__.py", line 31, in <module>
    from Products.CMFEditions import historyidhandlertool
  File "/home/jenkins/.buildout/eggs/cp36m/Products.CMFEditions-3.3.3-py3.6.egg/Products/CMFEditions/historyidhandlertool.py", line 22, in <module>
    from Products.CMFUid.UniqueIdHandlerTool import UniqueIdHandlerTool
  File "/home/jenkins/.buildout/eggs/cp36m/Products.CMFUid-3.0.1-py3.6.egg/Products/CMFUid/UniqueIdHandlerTool.py", line 24, in <module>
    from App.class_init import InitializeClass


FAILED:  Products.CMFFormController.tests.testCopyRename.Startup

Error Message:
No module named 'App.class_init'

Stack Trace:
No module named 'App.class_init'

  File "/home/jenkins/.buildout/eggs/cp36m/Products.CMFFormController-4.1.0-py3.6.egg/Products/CMFFormController/__init__.py", line 6, in <module>
    from . import ControllerPageTemplate, FSControllerPageTemplate
  File "/home/jenkins/.buildout/eggs/cp36m/Products.CMFFormController-4.1.0-py3.6.egg/Products/CMFFormController/ControllerPageTemplate.py", line 1, in <module>
    from .BaseControllerPageTemplate import BaseControllerPageTemplate
  File "/home/jenkins/.buildout/eggs/cp36m/Products.CMFFormController-4.1.0-py3.6.egg/Products/CMFFormController/BaseControllerPageTemplate.py", line 1, in <module>
    from .ControllerBase import ControllerBase
  File "/home/jenkins/.buildout/eggs/cp36m/Products.CMFFormController-4.1.0-py3.6.egg/Products/CMFFormController/ControllerBase.py", line 1, in <module>
    from .FormAction import FormAction, FormActionContainer
  File "/home/jenkins/.buildout/eggs/cp36m/Products.CMFFormController-4.1.0-py3.6.egg/Products/CMFFormController/FormAction.py", line 6, in <module>
    from App.class_init import InitializeClass


FAILED:  Products.CMFFormController.tests.testRedirectTo.Startup

Error Message:
No module named 'App.class_init'

Stack Trace:
No module named 'App.class_init'

  File "/home/jenkins/.buildout/eggs/cp36m/Products.CMFFormController-4.1.0-py3.6.egg/Products/CMFFormController/__init__.py", line 6, in <module>
    from . import ControllerPageTemplate, FSControllerPageTemplate
  File "/home/jenkins/.buildout/eggs/cp36m/Products.CMFFormController-4.1.0-py3.6.egg/Products/CMFFormController/ControllerPageTemplate.py", line 1, in <module>
    from .BaseControllerPageTemplate import BaseControllerPageTemplate
  File "/home/jenkins/.buildout/eggs/cp36m/Products.CMFFormController-4.1.0-py3.6.egg/Products/CMFFormController/BaseControllerPageTemplate.py", line 1, in <module>
    from .ControllerBase import ControllerBase
  File "/home/jenkins/.buildout/eggs/cp36m/Products.CMFFormController-4.1.0-py3.6.egg/Products/CMFFormController/ControllerBase.py", line 1, in <module>
    from .FormAction import FormAction, FormActionContainer
  File "/home/jenkins/.buildout/eggs/cp36m/Products.CMFFormController-4.1.0-py3.6.egg/Products/CMFFormController/FormAction.py", line 6, in <module>
    from App.class_init import InitializeClass


FAILED:  Products.CMFFormController.tests.test_exportimport.Startup

Error Message:
No module named 'App.class_init'

Stack Trace:
No module named 'App.class_init'

  File "/home/jenkins/.buildout/eggs/cp36m/Products.CMFFormController-4.1.0-py3.6.egg/Products/CMFFormController/__init__.py", line 6, in <module>
    from . import ControllerPageTemplate, FSControllerPageTemplate
  File "/home/jenkins/.buildout/eggs/cp36m/Products.CMFFormController-4.1.0-py3.6.egg/Products/CMFFormController/ControllerPageTemplate.py", line 1, in <module>
    from .BaseControllerPageTemplate import BaseControllerPageTemplate
  File "/home/jenkins/.buildout/eggs/cp36m/Products.CMFFormController-4.1.0-py3.6.egg/Products/CMFFormController/BaseControllerPageTemplate.py", line 1, in <module>
    from .ControllerBase import ControllerBase
  File "/home/jenkins/.buildout/eggs/cp36m/Products.CMFFormController-4.1.0-py3.6.egg/Products/CMFFormController/ControllerBase.py", line 1, in <module>
    from .FormAction import FormAction, FormActionContainer
  File "/home/jenkins/.buildout/eggs/cp36m/Products.CMFFormController-4.1.0-py3.6.egg/Products/CMFFormController/FormAction.py", line 6, in <module>
    from App.class_init import InitializeClass


FAILED:  Products.CMFPlacefulWorkflow.tests.testCMFPlacefulWorkflow.Startup

Error Message:
No module named 'App.class_init'

Stack Trace:
No module named 'App.class_init'

  File "/home/jenkins/.buildout/eggs/cp36m/Products.CMFPlacefulWorkflow-2.0.0-py3.6.egg/Products/CMFPlacefulWorkflow/__init__.py", line 24, in <module>
    from Products.CMFPlacefulWorkflow import DefaultWorkflowPolicy
  File "/home/jenkins/.buildout/eggs/cp36m/Products.CMFPlacefulWorkflow-2.0.0-py3.6.egg/Products/CMFPlacefulWorkflow/DefaultWorkflowPolicy.py", line 25, in <module>
    from App.class_init import InitializeClass


FAILED:  Products.CMFPlacefulWorkflow.tests.test_configlet.Startup

Error Message:
No module named 'App.class_init'

Stack Trace:
No module named 'App.class_init'

  File "/home/jenkins/.buildout/eggs/cp36m/Products.CMFPlacefulWorkflow-2.0.0-py3.6.egg/Products/CMFPlacefulWorkflow/__init__.py", line 24, in <module>
    from Products.CMFPlacefulWorkflow import DefaultWorkflowPolicy
  File "/home/jenkins/.buildout/eggs/cp36m/Products.CMFPlacefulWorkflow-2.0.0-py3.6.egg/Products/CMFPlacefulWorkflow/DefaultWorkflowPolicy.py", line 25, in <module>
    from App.class_init import InitializeClass


FAILED:  Products.CMFPlacefulWorkflow.tests.test_doctests.Startup

Error Message:
No module named 'App.class_init'

Stack Trace:
No module named 'App.class_init'

  File "/home/jenkins/.buildout/eggs/cp36m/Products.CMFPlacefulWorkflow-2.0.0-py3.6.egg/Products/CMFPlacefulWorkflow/__init__.py", line 24, in <module>
    from Products.CMFPlacefulWorkflow import DefaultWorkflowPolicy
  File "/home/jenkins/.buildout/eggs/cp36m/Products.CMFPlacefulWorkflow-2.0.0-py3.6.egg/Products/CMFPlacefulWorkflow/DefaultWorkflowPolicy.py", line 25, in <module>
    from App.class_init import InitializeClass


FAILED:  plone.app.layout.viewlets.tests.test_content.Startup

Error Message:
No module named 'App.class_init'

Stack Trace:
No module named 'App.class_init'

  File "/home/jenkins/workspace/plone-6.0-python-3.6/src/plone.app.layout/plone/app/layout/viewlets/tests/test_content.py", line 3, in <module>
    from plone.app.layout.viewlets.content import ContentRelatedItems
  File "/home/jenkins/workspace/plone-6.0-python-3.6/src/plone.app.layout/plone/app/layout/viewlets/content.py", line 17, in <module>
    from Products.CMFEditions.Permissions import AccessPreviousVersions
  File "/home/jenkins/.buildout/eggs/cp36m/Products.CMFEditions-3.3.3-py3.6.egg/Products/CMFEditions/__init__.py", line 31, in <module>
    from Products.CMFEditions import historyidhandlertool
  File "/home/jenkins/.buildout/eggs/cp36m/Products.CMFEditions-3.3.3-py3.6.egg/Products/CMFEditions/historyidhandlertool.py", line 22, in <module>
    from Products.CMFUid.UniqueIdHandlerTool import UniqueIdHandlerTool
  File "/home/jenkins/.buildout/eggs/cp36m/Products.CMFUid-3.0.1-py3.6.egg/Products/CMFUid/UniqueIdHandlerTool.py", line 24, in <module>
    from App.class_init import InitializeClass


FAILED:  plone.app.portlets.tests.test_navigation_portlet.Startup

Error Message:
No module named 'App.class_init'

Stack Trace:
No module named 'App.class_init'

  File "/home/jenkins/.buildout/eggs/cp36m/plone.app.portlets-4.4.4-py3.6.egg/plone/app/portlets/tests/test_navigation_portlet.py", line 5, in <module>
    from five.intid.intid import IntIds
  File "/home/jenkins/.buildout/eggs/cp36m/five.intid-1.2.4-py3.6.egg/five/intid/intid.py", line 3, in <module>
    from App.class_init import InitializeClass


FAILED:  plone.app.upgrade.tests.test_upgrade.Startup

Error Message:
No module named 'App.class_init'

Stack Trace:
No module named 'App.class_init'

  File "/home/jenkins/workspace/plone-6.0-python-3.6/src/plone.app.upgrade/plone/app/upgrade/__init__.py", line 142, in <module>
    from Products.CMFPlacefulWorkflow import interfaces  # noqa F811
  File "/home/jenkins/.buildout/eggs/cp36m/Products.CMFPlacefulWorkflow-2.0.0-py3.6.egg/Products/CMFPlacefulWorkflow/__init__.py", line 24, in <module>
    from Products.CMFPlacefulWorkflow import DefaultWorkflowPolicy
  File "/home/jenkins/.buildout/eggs/cp36m/Products.CMFPlacefulWorkflow-2.0.0-py3.6.egg/Products/CMFPlacefulWorkflow/DefaultWorkflowPolicy.py", line 25, in <module>
    from App.class_init import InitializeClass


FAILED:  plone.app.upgrade.tests.test_utils.Startup

Error Message:
module 'Products.CMFDefault' has no attribute 'SyndicationInfo'

Stack Trace:
module 'Products.CMFDefault' has no attribute 'SyndicationInfo'

  File "/home/jenkins/workspace/plone-6.0-python-3.6/src/plone.app.upgrade/plone/app/upgrade/__init__.py", line 115, in <module>
    Products.CMFDefault.SyndicationInfo  # pyflakes


FAILED:  plone.app.upgrade.v40.tests.Startup

Error Message:
module 'Products.CMFDefault' has no attribute 'SyndicationInfo'

Stack Trace:
module 'Products.CMFDefault' has no attribute 'SyndicationInfo'

  File "/home/jenkins/workspace/plone-6.0-python-3.6/src/plone.app.upgrade/plone/app/upgrade/__init__.py", line 115, in <module>
    Products.CMFDefault.SyndicationInfo  # pyflakes


FAILED:  plone.app.upgrade.v41.tests.Startup

Error Message:
module 'Products.CMFDefault' has no attribute 'SyndicationInfo'

Stack Trace:
module 'Products.CMFDefault' has no attribute 'SyndicationInfo'

  File "/home/jenkins/workspace/plone-6.0-python-3.6/src/plone.app.upgrade/plone/app/upgrade/__init__.py", line 115, in <module>
    Products.CMFDefault.SyndicationInfo  # pyflakes


FAILED:  plone.app.upgrade.v42.tests.Startup

Error Message:
module 'Products.CMFDefault' has no attribute 'SyndicationInfo'

Stack Trace:
module 'Products.CMFDefault' has no attribute 'SyndicationInfo'

  File "/home/jenkins/workspace/plone-6.0-python-3.6/src/plone.app.upgrade/plone/app/upgrade/__init__.py", line 115, in <module>
    Products.CMFDefault.SyndicationInfo  # pyflakes


FAILED:  plone.app.upgrade.v43.tests.Startup

Error Message:
module 'Products.CMFDefault' has no attribute 'SyndicationInfo'

Stack Trace:
module 'Products.CMFDefault' has no attribute 'SyndicationInfo'

  File "/home/jenkins/workspace/plone-6.0-python-3.6/src/plone.app.upgrade/plone/app/upgrade/__init__.py", line 115, in <module>
    Products.CMFDefault.SyndicationInfo  # pyflakes


FAILED:  plone.app.upgrade.v50.tests.Startup

Error Message:
module 'Products.CMFDefault' has no attribute 'SyndicationInfo'

Stack Trace:
module 'Products.CMFDefault' has no attribute 'SyndicationInfo'

  File "/home/jenkins/workspace/plone-6.0-python-3.6/src/plone.app.upgrade/plone/app/upgrade/__init__.py", line 115, in <module>
    Products.CMFDefault.SyndicationInfo  # pyflakes


FAILED:  plone.app.upgrade.v51.tests.Startup

Error Message:
module 'Products.CMFDefault' has no attribute 'SyndicationInfo'

Stack Trace:
module 'Products.CMFDefault' has no attribute 'SyndicationInfo'

  File "/home/jenkins/workspace/plone-6.0-python-3.6/src/plone.app.upgrade/plone/app/upgrade/__init__.py", line 115, in <module>
    Products.CMFDefault.SyndicationInfo  # pyflakes


FAILED:  plone.app.upgrade.v52.tests.Startup

Error Message:
module 'Products.CMFDefault' has no attribute 'SyndicationInfo'

Stack Trace:
module 'Products.CMFDefault' has no attribute 'SyndicationInfo'

  File "/home/jenkins/workspace/plone-6.0-python-3.6/src/plone.app.upgrade/plone/app/upgrade/__init__.py", line 115, in <module>
    Products.CMFDefault.SyndicationInfo  # pyflakes


FAILED:  plone.app.versioningbehavior.tests.test_modifiers.Startup

Error Message:
No module named 'App.class_init'

Stack Trace:
No module named 'App.class_init'

  File "/home/jenkins/.buildout/eggs/cp36m/plone.app.versioningbehavior-1.3.8-py3.6.egg/plone/app/versioningbehavior/tests/test_modifiers.py", line 2, in <module>
    from five.intid import site
  File "/home/jenkins/.buildout/eggs/cp36m/five.intid-1.2.4-py3.6.egg/five/intid/site.py", line 3, in <module>
    from five.intid.intid import IIntIds
  File "/home/jenkins/.buildout/eggs/cp36m/five.intid-1.2.4-py3.6.egg/five/intid/intid.py", line 3, in <module>
    from App.class_init import InitializeClass


More information about the Testbot mailing list