[Testbot] Plone 4.3 - Python 2.6 - Build # 242 - Failure!

jenkins at plone.org jenkins at plone.org
Wed Jan 31 09:46:03 UTC 2018


Plone 4.3 - Python 2.6 - Build # 242 - Failure:

Check console output at http://jenkins.plone.org/job/plone-4.3-python-2.6/242/ to view the results.

Changes:

[Maurits van Rees] [fc] Add plone.app.robotframework to checkouts.cfg







Test Results:

6 tests failed.
FAILED:  Products.GenericSetup.tests.test_context.DirectoryImportContextTests.test_listDirectory_skip_implicit

Error Message:
[Errno 39] Directory not empty: '/tmp/ICTTexts/subdir'

Stack Trace:
[Errno 39] Directory not empty: '/tmp/ICTTexts/subdir'

  File "/usr/lib/python2.6/unittest.py", line 289, in run
    self.tearDown()
  File "/home/jenkins/.buildout/eggs/Zope2-2.13.26-py2.6.egg/Testing/ZopeTestCase/base.py", line 101, in tearDown
    self.beforeTearDown()
  File "/home/jenkins/.buildout/eggs/Products.GenericSetup-1.8.8-py2.6.egg/Products/GenericSetup/tests/common.py", line 109, in beforeTearDown
    _clearTestDirectory(self._PROFILE_PATH)
  File "/home/jenkins/.buildout/eggs/Products.GenericSetup-1.8.8-py2.6.egg/Products/GenericSetup/tests/common.py", line 83, in _clearTestDirectory
    shutil.rmtree(root_path)
  File "/usr/lib/python2.6/shutil.py", line 212, in rmtree
    rmtree(fullname, ignore_errors, onerror)
  File "/usr/lib/python2.6/shutil.py", line 221, in rmtree
    onerror(os.rmdir, path, sys.exc_info())
  File "/usr/lib/python2.6/shutil.py", line 219, in rmtree
    os.rmdir(path)


FAILED:  Products.GenericSetup.tests.test_context.DirectoryImportContextTests.test_readDataFile_subdir

Error Message:
[Errno 2] No such file or directory: '/tmp/ICTTexts/subdir'

Stack Trace:
[Errno 2] No such file or directory: '/tmp/ICTTexts/subdir'

  File "/usr/lib/python2.6/unittest.py", line 289, in run
    self.tearDown()
  File "/home/jenkins/.buildout/eggs/Zope2-2.13.26-py2.6.egg/Testing/ZopeTestCase/base.py", line 101, in tearDown
    self.beforeTearDown()
  File "/home/jenkins/.buildout/eggs/Products.GenericSetup-1.8.8-py2.6.egg/Products/GenericSetup/tests/common.py", line 109, in beforeTearDown
    _clearTestDirectory(self._PROFILE_PATH)
  File "/home/jenkins/.buildout/eggs/Products.GenericSetup-1.8.8-py2.6.egg/Products/GenericSetup/tests/common.py", line 83, in _clearTestDirectory
    shutil.rmtree(root_path)
  File "/usr/lib/python2.6/shutil.py", line 212, in rmtree
    rmtree(fullname, ignore_errors, onerror)
  File "/usr/lib/python2.6/shutil.py", line 221, in rmtree
    onerror(os.rmdir, path, sys.exc_info())
  File "/usr/lib/python2.6/shutil.py", line 219, in rmtree
    os.rmdir(path)


FAILED:  Products.GenericSetup.tests.test_tool.SetupToolTests.test_purgeProfileVersions

Error Message:
[Errno 2] No such file or directory: '/tmp/STT_test'

Stack Trace:
[Errno 2] No such file or directory: '/tmp/STT_test'

  File "/usr/lib/python2.6/unittest.py", line 289, in run
    self.tearDown()
  File "/home/jenkins/.buildout/eggs/Zope2-2.13.26-py2.6.egg/Testing/ZopeTestCase/base.py", line 101, in tearDown
    self.beforeTearDown()
  File "/home/jenkins/.buildout/eggs/Products.GenericSetup-1.8.8-py2.6.egg/Products/GenericSetup/tests/test_tool.py", line 117, in beforeTearDown
    FilesystemTestBase.beforeTearDown(self)
  File "/home/jenkins/.buildout/eggs/Products.GenericSetup-1.8.8-py2.6.egg/Products/GenericSetup/tests/common.py", line 109, in beforeTearDown
    _clearTestDirectory(self._PROFILE_PATH)
  File "/home/jenkins/.buildout/eggs/Products.GenericSetup-1.8.8-py2.6.egg/Products/GenericSetup/tests/common.py", line 83, in _clearTestDirectory
    shutil.rmtree(root_path)
  File "/usr/lib/python2.6/shutil.py", line 204, in rmtree
    onerror(os.listdir, path, sys.exc_info())
  File "/usr/lib/python2.6/shutil.py", line 202, in rmtree
    names = os.listdir(path)


FAILED:  Products.GenericSetup.tests.test_tool.SetupToolTests.test_runAllImportStepsFromProfile_with_new_strategy

Error Message:
['/tmp/STT_test'] != ['/tmp/STT_test3', '/tmp/STT_test']

Stack Trace:
['/tmp/STT_test'] != ['/tmp/STT_test3', '/tmp/STT_test']

  File "/usr/lib/python2.6/unittest.py", line 279, in run
    testMethod()
  File "/home/jenkins/.buildout/eggs/Products.GenericSetup-1.8.8-py2.6.egg/Products/GenericSetup/tests/test_tool.py", line 666, in test_runAllImportStepsFromProfile_with_new_strategy
    [self._PROFILE_PATH3, self._PROFILE_PATH])
  File "/usr/lib/python2.6/unittest.py", line 350, in failUnlessEqual
    (msg or '%r != %r' % (first, second))


FAILED:  Products.GenericSetup.tests.test_tool.SetupToolTests.test_runAllImportStepsFromProfile_with_reapply_strategy

Error Message:
['/tmp/STT_test'] != ['/tmp/STT_test2', '/tmp/STT_test3', '/tmp/STT_test']

Stack Trace:
['/tmp/STT_test'] != ['/tmp/STT_test2', '/tmp/STT_test3', '/tmp/STT_test']

  File "/usr/lib/python2.6/unittest.py", line 279, in run
    testMethod()
  File "/home/jenkins/.buildout/eggs/Products.GenericSetup-1.8.8-py2.6.egg/Products/GenericSetup/tests/test_tool.py", line 648, in test_runAllImportStepsFromProfile_with_reapply_strategy
    self._PROFILE_PATH])
  File "/usr/lib/python2.6/unittest.py", line 350, in failUnlessEqual
    (msg or '%r != %r' % (first, second))


FAILED:  Products.GenericSetup.tests.test_tool.SetupToolTests.test_setBaselineContext

Error Message:
0 != 1

Stack Trace:
0 != 1

  File "/usr/lib/python2.6/unittest.py", line 279, in run
    testMethod()
  File "/home/jenkins/.buildout/eggs/Products.GenericSetup-1.8.8-py2.6.egg/Products/GenericSetup/tests/test_tool.py", line 201, in test_setBaselineContext
    self.assertEqual(len(import_registry.listSteps()), 1)
  File "/usr/lib/python2.6/unittest.py", line 350, in failUnlessEqual
    (msg or '%r != %r' % (first, second))


More information about the Testbot mailing list