[Testbot] Plone 4.3 - Python 2.7 - Build # 217 - Failure!

jenkins at plone.org jenkins at plone.org
Sat Jan 27 19:10:49 UTC 2018


Plone 4.3 - Python 2.7 - Build # 217 - Failure:

Check console output at http://jenkins.plone.org/job/plone-4.3-python-2.7/217/ to view the results.

Changes:

[Maurits van Rees] [fc] Add Products.CMFQuickInstallerTool to checkouts.cfg







Test Results:

3 tests failed.
FAILED:  Products.GenericSetup.tests.test_tool.SetupToolTests.test_listProfileInfo_for_parameter

Error Message:
[Errno 2] No such file or directory: '/tmp/STT_test'

Stack Trace:
[Errno 2] No such file or directory: '/tmp/STT_test'

  File "/usr/lib/python2.7/unittest/case.py", line 358, in run
    self.tearDown()
  File "/home/jenkins/.buildout/eggs/Zope2-2.13.26-py2.7.egg/Testing/ZopeTestCase/base.py", line 101, in tearDown
    self.beforeTearDown()
  File "/home/jenkins/.buildout/eggs/Products.GenericSetup-1.8.8-py2.7.egg/Products/GenericSetup/tests/test_tool.py", line 117, in beforeTearDown
    FilesystemTestBase.beforeTearDown(self)
  File "/home/jenkins/.buildout/eggs/Products.GenericSetup-1.8.8-py2.7.egg/Products/GenericSetup/tests/common.py", line 109, in beforeTearDown
    _clearTestDirectory(self._PROFILE_PATH)
  File "/home/jenkins/.buildout/eggs/Products.GenericSetup-1.8.8-py2.7.egg/Products/GenericSetup/tests/common.py", line 83, in _clearTestDirectory
    shutil.rmtree(root_path)
  File "/usr/lib/python2.7/shutil.py", line 256, in rmtree
    onerror(os.rmdir, path, sys.exc_info())
  File "/usr/lib/python2.7/shutil.py", line 254, in rmtree
    os.rmdir(path)


FAILED:  Products.GenericSetup.tests.test_tool.SetupToolTests.test_runAllImportStepsFromProfile_step_registration_with_depends

Error Message:
False is not true

Stack Trace:
False is not true

  File "/usr/lib/python2.7/unittest/case.py", line 329, in run
    testMethod()
  File "/home/jenkins/.buildout/eggs/Products.GenericSetup-1.8.8-py2.7.egg/Products/GenericSetup/tests/test_tool.py", line 750, in test_runAllImportStepsFromProfile_step_registration_with_depends
    self.failUnless('one' in result['steps'])
  File "/usr/lib/python2.7/unittest/case.py", line 612, in deprecated_func
    return original_func(*args, **kwargs)
  File "/usr/lib/python2.7/unittest/case.py", line 422, in assertTrue
    raise self.failureException(msg)


FAILED:  Products.GenericSetup.tests.test_tool.SetupToolTests.test_runAllImportStepsFromProfile_with_reapply_strategy

Error Message:
Lists differ: ['/tmp/STT_test'] != ['/tmp/STT_test2', '/tmp/STT_t...

Stack Trace:
Lists differ: ['/tmp/STT_test'] != ['/tmp/STT_test2', '/tmp/STT_t...

First differing element 0:
'/tmp/STT_test'
'/tmp/STT_test2'

Second list contains 2 additional elements.
First extra element 1:
'/tmp/STT_test3'

- ['/tmp/STT_test']
+ ['/tmp/STT_test2', '/tmp/STT_test3', '/tmp/STT_test']

  File "/usr/lib/python2.7/unittest/case.py", line 329, in run
    testMethod()
  File "/home/jenkins/.buildout/eggs/Products.GenericSetup-1.8.8-py2.7.egg/Products/GenericSetup/tests/test_tool.py", line 648, in test_runAllImportStepsFromProfile_with_reapply_strategy
    self._PROFILE_PATH])
  File "/usr/lib/python2.7/unittest/case.py", line 513, in assertEqual
    assertion_func(first, second, msg=msg)
  File "/usr/lib/python2.7/unittest/case.py", line 742, in assertListEqual
    self.assertSequenceEqual(list1, list2, msg, seq_type=list)
  File "/usr/lib/python2.7/unittest/case.py", line 724, in assertSequenceEqual
    self.fail(msg)
  File "/usr/lib/python2.7/unittest/case.py", line 410, in fail
    raise self.failureException(msg)


More information about the Testbot mailing list