[Testbot] Plone 4.3 - Python 2.7 - Build # 253 - Still Failing!

jenkins at plone.org jenkins at plone.org
Sun Feb 11 09:22:58 UTC 2018


Plone 4.3 - Python 2.7 - Build # 253 - Still Failing:

Check console output at https://jenkins.plone.org/job/plone-4.3-python-2.7/253/ to view the results.

Changes:

No changes






Test Results:

21 tests failed.
FAILED:  Products.ExtendedPathIndex.tests.testIndexedAttrs.IndexedAttrsTests.xml.[empty]

Error Message:


Stack Trace:
Test report file /home/jenkins/workspace/plone-4.3-python-2.7/parts/jenkins-test/testreports/Products.ExtendedPathIndex.tests.testIndexedAttrs.IndexedAttrsTests.xml was length 0

FAILED:  Products.PluggableAuthService.plugins.tests.test_ZODBUserManager.ZODBUserManagerTests.xml.[empty]

Error Message:


Stack Trace:
Test report file /home/jenkins/workspace/plone-4.3-python-2.7/parts/jenkins-test/testreports/Products.PluggableAuthService.plugins.tests.test_ZODBUserManager.ZODBUserManagerTests.xml was length 0

FAILED:  Products.ResourceRegistries.tests.testBaseRegistry.BaseRegistryTestCase.xml.[empty]

Error Message:


Stack Trace:
Test report file /home/jenkins/workspace/plone-4.3-python-2.7/parts/jenkins-test/testreports/Products.ResourceRegistries.tests.testBaseRegistry.BaseRegistryTestCase.xml was length 0

FAILED:  archetypes.referencebrowserwidget.tests.test_utils.UtilsTestCase.xml.[empty]

Error Message:


Stack Trace:
Test report file /home/jenkins/workspace/plone-4.3-python-2.7/parts/jenkins-test/testreports/archetypes.referencebrowserwidget.tests.test_utils.UtilsTestCase.xml was length 0

FAILED:  archetypes.schemaextender.tests.testSchemaFactory.OrderableExtenderTests.xml.[empty]

Error Message:


Stack Trace:
Test report file /home/jenkins/workspace/plone-4.3-python-2.7/parts/jenkins-test/testreports/archetypes.schemaextender.tests.testSchemaFactory.OrderableExtenderTests.xml was length 0

FAILED:  collective.monkeypatcher.tests.test_monkeypatcher.TestMonkeyPatcher.xml.[empty]

Error Message:


Stack Trace:
Test report file /home/jenkins/workspace/plone-4.3-python-2.7/parts/jenkins-test/testreports/collective.monkeypatcher.tests.test_monkeypatcher.TestMonkeyPatcher.xml was length 0

FAILED:  doctest-five-intid-README.txt.xml.[empty]

Error Message:


Stack Trace:
Test report file /home/jenkins/workspace/plone-4.3-python-2.7/parts/jenkins-test/testreports/doctest-five-intid-README.txt.xml was length 0

FAILED:  plone.app.testing.helpers.rst

Error Message:
Failed doctest test for helpers.rst

Stack Trace:
Failed doctest test for helpers.rst
  File "/home/jenkins/.buildout/eggs/plone.app.testing-4.2.6-py2.7.egg/plone/app/testing/helpers.rst", line 0

----------------------------------------------------------------------
File "/home/jenkins/.buildout/eggs/plone.app.testing-4.2.6-py2.7.egg/plone/app/testing/helpers.rst", line 117, in helpers.rst
Failed example:
    runner.setup_layer(options, HELPER_DEMOS_INTEGRATION_TESTING, setupLayers)
Exception raised:
    Traceback (most recent call last):
      File "/usr/lib/python2.7/doctest.py", line 1315, in __run
        compileflags, 1) in test.globs
      File "<doctest helpers.rst[11]>", line 1, in <module>
        runner.setup_layer(options, HELPER_DEMOS_INTEGRATION_TESTING, setupLayers)
      File "/home/jenkins/.buildout/eggs/zope.testing-3.9.7-py2.7.egg/zope/testing/testrunner/runner.py", line 628, in setup_layer
        setup_layer(options, base, setup_layers)
      File "/home/jenkins/.buildout/eggs/zope.testing-3.9.7-py2.7.egg/zope/testing/testrunner/runner.py", line 628, in setup_layer
        setup_layer(options, base, setup_layers)
      File "/home/jenkins/.buildout/eggs/zope.testing-3.9.7-py2.7.egg/zope/testing/testrunner/runner.py", line 628, in setup_layer
        setup_layer(options, base, setup_layers)
      File "/home/jenkins/.buildout/eggs/zope.testing-3.9.7-py2.7.egg/zope/testing/testrunner/runner.py", line 633, in setup_layer
        layer.setUp()
      File "/home/jenkins/.buildout/eggs/plone.testing-4.1.2-py2.7.egg/plone/testing/z2.py", line 347, in setUp
        self.setUpDatabase()
      File "/home/jenkins/.buildout/eggs/plone.testing-4.1.2-py2.7.egg/plone/testing/z2.py", line 557, in setUpDatabase
        name='Startup')
      File "/home/jenkins/.buildout/eggs/plone.testing-4.1.2-py2.7.egg/plone/testing/zodb.py", line 26, in stackDemoStorage
        storage = DemoStorage(name=name, base=db.storage)
    AttributeError: 'DB' object has no attribute 'storage'


  File "/usr/lib/python2.7/unittest/case.py", line 329, in run
    testMethod()
  File "/usr/lib/python2.7/doctest.py", line 2226, in runTest
    raise self.failureException(self.format_failure(new.getvalue()))


FAILED:  doctest-plone-app-viewletmanager-tests-storage.rst.xml.[empty]

Error Message:


Stack Trace:
Test report file /home/jenkins/workspace/plone-4.3-python-2.7/parts/jenkins-test/testreports/doctest-plone-app-viewletmanager-tests-storage.rst.xml was length 0

FAILED:  doctest-plone-formwidget-autocomplete-README.txt.xml.[empty]

Error Message:


Stack Trace:
Test report file /home/jenkins/workspace/plone-4.3-python-2.7/parts/jenkins-test/testreports/doctest-plone-formwidget-autocomplete-README.txt.xml was length 0

FAILED:  doctest-plone-portlets-utils.txt.xml.[empty]

Error Message:


Stack Trace:
Test report file /home/jenkins/workspace/plone-4.3-python-2.7/parts/jenkins-test/testreports/doctest-plone-portlets-utils.txt.xml was length 0

FAILED:  plone.app.blob.tests.test_utils.UtilityTests.xml.[empty]

Error Message:


Stack Trace:
Test report file /home/jenkins/workspace/plone-4.3-python-2.7/parts/jenkins-test/testreports/plone.app.blob.tests.test_utils.UtilityTests.xml was length 0

FAILED:  plone.app.dexterity.behaviors.tests.test_metadata.TestCategorization.xml.[empty]

Error Message:


Stack Trace:
Test report file /home/jenkins/workspace/plone-4.3-python-2.7/parts/jenkins-test/testreports/plone.app.dexterity.behaviors.tests.test_metadata.TestCategorization.xml was length 0

FAILED:  plone.app.discussion.tests.test_events.RepliesEventsTest.xml.[empty]

Error Message:


Stack Trace:
Test report file /home/jenkins/workspace/plone-4.3-python-2.7/parts/jenkins-test/testreports/plone.app.discussion.tests.test_events.RepliesEventsTest.xml was length 0

FAILED:  plone.app.folder.tests.test_utils.UtilsTests.xml.[empty]

Error Message:


Stack Trace:
Test report file /home/jenkins/workspace/plone-4.3-python-2.7/parts/jenkins-test/testreports/plone.app.folder.tests.test_utils.UtilsTests.xml was length 0

FAILED:  plone.app.imaging.tests.test_traverse.TraverseTests.xml.[empty]

Error Message:


Stack Trace:
Test report file /home/jenkins/workspace/plone-4.3-python-2.7/parts/jenkins-test/testreports/plone.app.imaging.tests.test_traverse.TraverseTests.xml was length 0

FAILED:  plone.app.linkintegrity.tests.test_doctests.LinkIntegrityTestCase.xml.[empty]

Error Message:


Stack Trace:
Test report file /home/jenkins/workspace/plone-4.3-python-2.7/parts/jenkins-test/testreports/plone.app.linkintegrity.tests.test_doctests.LinkIntegrityTestCase.xml was length 0

FAILED:  plone.app.users.tests.test_account.TestAccountPanelSchemaAdapter.xml.[empty]

Error Message:


Stack Trace:
Test report file /home/jenkins/workspace/plone-4.3-python-2.7/parts/jenkins-test/testreports/plone.app.users.tests.test_account.TestAccountPanelSchemaAdapter.xml was length 0

FAILED:  plone.app.vocabularies.datetimerelated.xml.[empty]

Error Message:


Stack Trace:
Test report file /home/jenkins/workspace/plone-4.3-python-2.7/parts/jenkins-test/testreports/plone.app.vocabularies.datetimerelated.xml was length 0

FAILED:  plone.caching.tests.test_hooks.TestMutateResponse.xml.[empty]

Error Message:


Stack Trace:
Test report file /home/jenkins/workspace/plone-4.3-python-2.7/parts/jenkins-test/testreports/plone.caching.tests.test_hooks.TestMutateResponse.xml was length 0

FAILED:  plone.outputfilters.tests.test_apply_filters.FilterTestCase.xml.[empty]

Error Message:


Stack Trace:
Test report file /home/jenkins/workspace/plone-4.3-python-2.7/parts/jenkins-test/testreports/plone.outputfilters.tests.test_apply_filters.FilterTestCase.xml was length 0


More information about the Testbot mailing list