[Testbot] Plone 5.1 - Python 2.7 - Build # 1181 - Failure!

jenkins at plone.org jenkins at plone.org
Tue Apr 10 14:38:01 UTC 2018


Plone 5.1 - Python 2.7 - Build # 1181 - Failure:

Check console output at https://jenkins.plone.org/job/plone-5.1-python-2.7/1181/ to view the results.

Changes:

[David Glick] use branch of five.customerize







Test Results:

11 tests failed.
FAILED:  plone.app.testing.layers.rst

Error Message:
Failed doctest test for layers.rst

Stack Trace:
Failed doctest test for layers.rst
  File "/home/jenkins/.buildout/eggs/plone.app.testing-5.0.8-py2.7.egg/plone/app/testing/layers.rst", line 0

----------------------------------------------------------------------
File "/home/jenkins/.buildout/eggs/plone.app.testing-5.0.8-py2.7.egg/plone/app/testing/layers.rst", line 289, in layers.rst
Failed example:
    runner.setup_layer(options, layers.PLONE_ZSERVER, setupLayers)
Exception raised:
    Traceback (most recent call last):
      File "/usr/lib/python2.7/doctest.py", line 1315, in __run
        compileflags, 1) in test.globs
      File "<doctest layers.rst[73]>", line 1, in <module>
        runner.setup_layer(options, layers.PLONE_ZSERVER, setupLayers)
      File "/home/jenkins/.buildout/eggs/zope.testrunner-4.4.4-py2.7.egg/zope/testrunner/runner.py", line 708, in setup_layer
        setup_layer(options, base, setup_layers)
      File "/home/jenkins/.buildout/eggs/zope.testrunner-4.4.4-py2.7.egg/zope/testrunner/runner.py", line 713, in setup_layer
        layer.setUp()
      File "/home/jenkins/.buildout/eggs/plone.testing-4.3.1-py2.7.egg/plone/testing/z2.py", line 984, in setUp
        self.setUpServer()
      File "/home/jenkins/.buildout/eggs/plone.testing-4.3.1-py2.7.egg/plone/testing/z2.py", line 1027, in setUpServer
        logger_object=zopeLog)
      File "/home/jenkins/.buildout/eggs/Zope2-2.13.27-py2.7.egg/ZServer/HTTPServer.py", line 449, in __init__
        http_server.__init__(self, ip, port, resolver, logger_object)
      File "/home/jenkins/.buildout/eggs/Zope2-2.13.27-py2.7.egg/ZServer/medusa/http_server.py", line 574, in __init__
        self.bind ((ip, port))
      File "/usr/lib/python2.7/asyncore.py", line 342, in bind
        return self.socket.bind(addr)
      File "/usr/lib/python2.7/socket.py", line 228, in meth
        return getattr(self._sock,name)(*args)
    error: [Errno 98] Address already in use
----------------------------------------------------------------------
File "/home/jenkins/.buildout/eggs/plone.app.testing-5.0.8-py2.7.egg/plone/app/testing/layers.rst", line 300, in layers.rst
Failed example:
    host
Expected:
    'localhost'
Got:
    'nohost'
----------------------------------------------------------------------
File "/home/jenkins/.buildout/eggs/plone.app.testing-5.0.8-py2.7.egg/plone/app/testing/layers.rst", line 305, in layers.rst
Failed example:
    port == int(os.environ.get('ZSERVER_PORT', 55001))
Expected:
    True
Got:
    False
----------------------------------------------------------------------
File "/home/jenkins/.buildout/eggs/plone.app.testing-5.0.8-py2.7.egg/plone/app/testing/layers.rst", line 335, in layers.rst
Failed example:
    portal_url.split(':')[:-1]
Expected:
    ['http', '//localhost']
Got:
    ['http']
----------------------------------------------------------------------
File "/home/jenkins/.buildout/eggs/plone.app.testing-5.0.8-py2.7.egg/plone/app/testing/layers.rst", line 339, in layers.rst
Failed example:
    conn = urllib2.urlopen(portal_url + '/Title', timeout=10)
Exception raised:
    Traceback (most recent call last):
      File "/usr/lib/python2.7/doctest.py", line 1315, in __run
        compileflags, 1) in test.globs
      File "<doctest layers.rst[91]>", line 1, in <module>
        conn = urllib2.urlopen(portal_url + '/Title', timeout=10)
      File "/usr/lib/python2.7/urllib2.py", line 154, in urlopen
        return opener.open(url, data, timeout)
      File "/usr/lib/python2.7/urllib2.py", line 429, in open
        response = self._open(req, data)
      File "/usr/lib/python2.7/urllib2.py", line 447, in _open
        '_open', req)
      File "/usr/lib/python2.7/urllib2.py", line 407, in _call_chain
        result = func(*args)
      File "/usr/lib/python2.7/urllib2.py", line 1228, in http_open
        return self.do_open(httplib.HTTPConnection, req)
      File "/usr/lib/python2.7/urllib2.py", line 1198, in do_open
        raise URLError(err)
    URLError: <urlopen error [Errno -2] Name or service not known>
----------------------------------------------------------------------
File "/home/jenkins/.buildout/eggs/plone.app.testing-5.0.8-py2.7.egg/plone/app/testing/layers.rst", line 340, in layers.rst
Failed example:
    responseBody = conn.read()
Exception raised:
    Traceback (most recent call last):
      File "/usr/lib/python2.7/doctest.py", line 1315, in __run
        compileflags, 1) in test.globs
      File "<doctest layers.rst[92]>", line 1, in <module>
        responseBody = conn.read()
    NameError: name 'conn' is not defined
----------------------------------------------------------------------
File "/home/jenkins/.buildout/eggs/plone.app.testing-5.0.8-py2.7.egg/plone/app/testing/layers.rst", line 341, in layers.rst
Failed example:
    "Fancy Portal" in responseBody
Exception raised:
    Traceback (most recent call last):
      File "/usr/lib/python2.7/doctest.py", line 1315, in __run
        compileflags, 1) in test.globs
      File "<doctest layers.rst[93]>", line 1, in <module>
        "Fancy Portal" in responseBody
    NameError: name 'responseBody' is not defined
----------------------------------------------------------------------
File "/home/jenkins/.buildout/eggs/plone.app.testing-5.0.8-py2.7.egg/plone/app/testing/layers.rst", line 343, in layers.rst
Failed example:
    conn.close()
Exception raised:
    Traceback (most recent call last):
      File "/usr/lib/python2.7/doctest.py", line 1315, in __run
        compileflags, 1) in test.globs
      File "<doctest layers.rst[94]>", line 1, in <module>
        conn.close()
    NameError: name 'conn' is not defined
----------------------------------------------------------------------
File "/home/jenkins/.buildout/eggs/plone.app.testing-5.0.8-py2.7.egg/plone/app/testing/layers.rst", line 368, in layers.rst
Failed example:
    runner.tear_down_unneeded(options, [], setupLayers)
Expected:
    Tear down plone.app.testing.layers.Plone:ZServer in ... seconds.
    ...Tear down plone.app.testing.layers.PloneFixture in ... seconds.
    ...Tear down plone.testing.z2.Startup in ... seconds.
    Tear down plone.testing.zca.LayerCleanup in ... seconds.
Got:
      Tear down plone.app.testing.layers.PloneFixture in 0.032 seconds.
      Tear down plone.testing.z2.Startup in 0.004 seconds.
      Tear down plone.testing.zca.LayerCleanup in 0.002 seconds.
----------------------------------------------------------------------
File "/home/jenkins/.buildout/eggs/plone.app.testing-5.0.8-py2.7.egg/plone/app/testing/layers.rst", line 374, in layers.rst
Failed example:
    conn = urllib2.urlopen(portal_url + '/folder1', timeout=5)
Expected:
    Traceback (most recent call last):
    ...
    URLError: <urlopen error [Errno ...] Connection refused>
Got:
    Traceback (most recent call last):
      File "/usr/lib/python2.7/doctest.py", line 1315, in __run
        compileflags, 1) in test.globs
      File "<doctest layers.rst[105]>", line 1, in <module>
        conn = urllib2.urlopen(portal_url + '/folder1', timeout=5)
      File "/usr/lib/python2.7/urllib2.py", line 154, in urlopen
        return opener.open(url, data, timeout)
      File "/usr/lib/python2.7/urllib2.py", line 429, in open
        response = self._open(req, data)
      File "/usr/lib/python2.7/urllib2.py", line 447, in _open
        '_open', req)
      File "/usr/lib/python2.7/urllib2.py", line 407, in _call_chain
        result = func(*args)
      File "/usr/lib/python2.7/urllib2.py", line 1228, in http_open
        return self.do_open(httplib.HTTPConnection, req)
      File "/usr/lib/python2.7/urllib2.py", line 1198, in do_open
        raise URLError(err)
    URLError: <urlopen error [Errno -2] Name or service not known>


  File "/usr/lib/python2.7/unittest/case.py", line 329, in run
    testMethod()
  File "/usr/lib/python2.7/doctest.py", line 2226, in runTest
    raise self.failureException(self.format_failure(new.getvalue()))


FAILED:  plone.testing.z2.rst

Error Message:
Failed doctest test for z2.rst

Stack Trace:
Failed doctest test for z2.rst
  File "/home/jenkins/.buildout/eggs/plone.testing-4.3.1-py2.7.egg/plone/testing/z2.rst", line 0

----------------------------------------------------------------------
File "/home/jenkins/.buildout/eggs/plone.testing-4.3.1-py2.7.egg/plone/testing/z2.rst", line 468, in z2.rst
Failed example:
    host
Expected:
    'localhost'
Got:
    'nohost'
----------------------------------------------------------------------
File "/home/jenkins/.buildout/eggs/plone.testing-4.3.1-py2.7.egg/plone/testing/z2.rst", line 473, in z2.rst
Failed example:
    port == int(os.environ.get('ZSERVER_PORT', 55001))
Expected:
    True
Got:
    False
----------------------------------------------------------------------
File "/home/jenkins/.buildout/eggs/plone.testing-4.3.1-py2.7.egg/plone/testing/z2.rst", line 497, in z2.rst
Failed example:
    app_url.split(':')[:-1]
Expected:
    ['http', '//localhost']
Got:
    ['http']
----------------------------------------------------------------------
File "/home/jenkins/.buildout/eggs/plone.testing-4.3.1-py2.7.egg/plone/testing/z2.rst", line 501, in z2.rst
Failed example:
    conn = urllib2.urlopen(app_url + '/folder1', timeout=5)
Exception raised:
    Traceback (most recent call last):
      File "/usr/lib/python2.7/doctest.py", line 1315, in __run
        compileflags, 1) in test.globs
      File "<doctest z2.rst[129]>", line 1, in <module>
        conn = urllib2.urlopen(app_url + '/folder1', timeout=5)
      File "/usr/lib/python2.7/urllib2.py", line 154, in urlopen
        return opener.open(url, data, timeout)
      File "/usr/lib/python2.7/urllib2.py", line 429, in open
        response = self._open(req, data)
      File "/usr/lib/python2.7/urllib2.py", line 447, in _open
        '_open', req)
      File "/usr/lib/python2.7/urllib2.py", line 407, in _call_chain
        result = func(*args)
      File "/usr/lib/python2.7/urllib2.py", line 1228, in http_open
        return self.do_open(httplib.HTTPConnection, req)
      File "/usr/lib/python2.7/urllib2.py", line 1198, in do_open
        raise URLError(err)
    URLError: <urlopen error [Errno -2] Name or service not known>
----------------------------------------------------------------------
File "/home/jenkins/.buildout/eggs/plone.testing-4.3.1-py2.7.egg/plone/testing/z2.rst", line 502, in z2.rst
Failed example:
    print conn.read()
Exception raised:
    Traceback (most recent call last):
      File "/usr/lib/python2.7/doctest.py", line 1315, in __run
        compileflags, 1) in test.globs
      File "<doctest z2.rst[130]>", line 1, in <module>
        print conn.read()
    AttributeError: 'Connection' object has no attribute 'read'
----------------------------------------------------------------------
File "/home/jenkins/.buildout/eggs/plone.testing-4.3.1-py2.7.egg/plone/testing/z2.rst", line 530, in z2.rst
Failed example:
    conn = urllib2.urlopen(app_url + '/folder1', timeout=5)
Expected:
    Traceback (most recent call last):
    ...
    URLError: <urlopen error [Errno ...] Connection refused>
Got:
    Traceback (most recent call last):
      File "/usr/lib/python2.7/doctest.py", line 1315, in __run
        compileflags, 1) in test.globs
      File "<doctest z2.rst[139]>", line 1, in <module>
        conn = urllib2.urlopen(app_url + '/folder1', timeout=5)
      File "/usr/lib/python2.7/urllib2.py", line 154, in urlopen
        return opener.open(url, data, timeout)
      File "/usr/lib/python2.7/urllib2.py", line 429, in open
        response = self._open(req, data)
      File "/usr/lib/python2.7/urllib2.py", line 447, in _open
        '_open', req)
      File "/usr/lib/python2.7/urllib2.py", line 407, in _call_chain
        result = func(*args)
      File "/usr/lib/python2.7/urllib2.py", line 1228, in http_open
        return self.do_open(httplib.HTTPConnection, req)
      File "/usr/lib/python2.7/urllib2.py", line 1198, in do_open
        raise URLError(err)
    URLError: <urlopen error [Errno -2] Name or service not known>


  File "/usr/lib/python2.7/unittest/case.py", line 329, in run
    testMethod()
  File "/usr/lib/python2.7/doctest.py", line 2226, in runTest
    raise self.failureException(self.format_failure(new.getvalue()))


FAILED:  plone.cachepurging.tests.test_purger.TestAsync.testAsyncError

Error Message:
[Errno 98] Address already in use

Stack Trace:
[Errno 98] Address already in use

  File "/usr/lib/python2.7/unittest/case.py", line 320, in run
    self.setUp()
  File "/home/jenkins/.buildout/eggs/plone.cachepurging-1.0.14-py2.7.egg/plone/cachepurging/tests/test_purger.py", line 83, in setUp
    self.httpd, self.httpt = self.startServer()
  File "/home/jenkins/.buildout/eggs/plone.cachepurging-1.0.14-py2.7.egg/plone/cachepurging/tests/test_purger.py", line 116, in startServer
    httpd = TestHTTPServer(server_address, TestHandler)
  File "/home/jenkins/.buildout/eggs/plone.cachepurging-1.0.14-py2.7.egg/plone/cachepurging/tests/test_purger.py", line 70, in __init__
    HTTPServer.__init__(self, address, handler)
  File "/usr/lib/python2.7/SocketServer.py", line 417, in __init__
    self.server_bind()
  File "/usr/lib/python2.7/BaseHTTPServer.py", line 108, in server_bind
    SocketServer.TCPServer.server_bind(self)
  File "/usr/lib/python2.7/SocketServer.py", line 431, in server_bind
    self.socket.bind(self.server_address)
  File "/usr/lib/python2.7/socket.py", line 228, in meth
    return getattr(self._sock,name)(*args)


FAILED:  plone.cachepurging.tests.test_purger.TestAsync.testSimpleAsync

Error Message:
[Errno 98] Address already in use

Stack Trace:
[Errno 98] Address already in use

  File "/usr/lib/python2.7/unittest/case.py", line 320, in run
    self.setUp()
  File "/home/jenkins/.buildout/eggs/plone.cachepurging-1.0.14-py2.7.egg/plone/cachepurging/tests/test_purger.py", line 83, in setUp
    self.httpd, self.httpt = self.startServer()
  File "/home/jenkins/.buildout/eggs/plone.cachepurging-1.0.14-py2.7.egg/plone/cachepurging/tests/test_purger.py", line 116, in startServer
    httpd = TestHTTPServer(server_address, TestHandler)
  File "/home/jenkins/.buildout/eggs/plone.cachepurging-1.0.14-py2.7.egg/plone/cachepurging/tests/test_purger.py", line 70, in __init__
    HTTPServer.__init__(self, address, handler)
  File "/usr/lib/python2.7/SocketServer.py", line 417, in __init__
    self.server_bind()
  File "/usr/lib/python2.7/BaseHTTPServer.py", line 108, in server_bind
    SocketServer.TCPServer.server_bind(self)
  File "/usr/lib/python2.7/SocketServer.py", line 431, in server_bind
    self.socket.bind(self.server_address)
  File "/usr/lib/python2.7/socket.py", line 228, in meth
    return getattr(self._sock,name)(*args)


FAILED:  plone.cachepurging.tests.test_purger.TestAsyncConnectionFailure.testConnectionFailure

Error Message:
[Errno 98] Address already in use

Stack Trace:
[Errno 98] Address already in use

  File "/usr/lib/python2.7/unittest/case.py", line 320, in run
    self.setUp()
  File "/home/jenkins/.buildout/eggs/plone.cachepurging-1.0.14-py2.7.egg/plone/cachepurging/tests/test_purger.py", line 201, in setUp
    self.httpd, self.httpt = self.startServer(start=False)
  File "/home/jenkins/.buildout/eggs/plone.cachepurging-1.0.14-py2.7.egg/plone/cachepurging/tests/test_purger.py", line 116, in startServer
    httpd = TestHTTPServer(server_address, TestHandler)
  File "/home/jenkins/.buildout/eggs/plone.cachepurging-1.0.14-py2.7.egg/plone/cachepurging/tests/test_purger.py", line 70, in __init__
    HTTPServer.__init__(self, address, handler)
  File "/usr/lib/python2.7/SocketServer.py", line 417, in __init__
    self.server_bind()
  File "/usr/lib/python2.7/BaseHTTPServer.py", line 108, in server_bind
    SocketServer.TCPServer.server_bind(self)
  File "/usr/lib/python2.7/SocketServer.py", line 431, in server_bind
    self.socket.bind(self.server_address)
  File "/usr/lib/python2.7/socket.py", line 228, in meth
    return getattr(self._sock,name)(*args)


FAILED:  plone.cachepurging.tests.test_purger.TestSync.testError

Error Message:
[Errno 98] Address already in use

Stack Trace:
[Errno 98] Address already in use

  File "/usr/lib/python2.7/unittest/case.py", line 320, in run
    self.setUp()
  File "/home/jenkins/.buildout/eggs/plone.cachepurging-1.0.14-py2.7.egg/plone/cachepurging/tests/test_purger.py", line 126, in setUp
    super(TestSync, self).setUp()
  File "/home/jenkins/.buildout/eggs/plone.cachepurging-1.0.14-py2.7.egg/plone/cachepurging/tests/test_purger.py", line 83, in setUp
    self.httpd, self.httpt = self.startServer()
  File "/home/jenkins/.buildout/eggs/plone.cachepurging-1.0.14-py2.7.egg/plone/cachepurging/tests/test_purger.py", line 116, in startServer
    httpd = TestHTTPServer(server_address, TestHandler)
  File "/home/jenkins/.buildout/eggs/plone.cachepurging-1.0.14-py2.7.egg/plone/cachepurging/tests/test_purger.py", line 70, in __init__
    HTTPServer.__init__(self, address, handler)
  File "/usr/lib/python2.7/SocketServer.py", line 417, in __init__
    self.server_bind()
  File "/usr/lib/python2.7/BaseHTTPServer.py", line 108, in server_bind
    SocketServer.TCPServer.server_bind(self)
  File "/usr/lib/python2.7/SocketServer.py", line 431, in server_bind
    self.socket.bind(self.server_address)
  File "/usr/lib/python2.7/socket.py", line 228, in meth
    return getattr(self._sock,name)(*args)


FAILED:  plone.cachepurging.tests.test_purger.TestSync.testHeaders

Error Message:
[Errno 98] Address already in use

Stack Trace:
[Errno 98] Address already in use

  File "/usr/lib/python2.7/unittest/case.py", line 320, in run
    self.setUp()
  File "/home/jenkins/.buildout/eggs/plone.cachepurging-1.0.14-py2.7.egg/plone/cachepurging/tests/test_purger.py", line 126, in setUp
    super(TestSync, self).setUp()
  File "/home/jenkins/.buildout/eggs/plone.cachepurging-1.0.14-py2.7.egg/plone/cachepurging/tests/test_purger.py", line 83, in setUp
    self.httpd, self.httpt = self.startServer()
  File "/home/jenkins/.buildout/eggs/plone.cachepurging-1.0.14-py2.7.egg/plone/cachepurging/tests/test_purger.py", line 116, in startServer
    httpd = TestHTTPServer(server_address, TestHandler)
  File "/home/jenkins/.buildout/eggs/plone.cachepurging-1.0.14-py2.7.egg/plone/cachepurging/tests/test_purger.py", line 70, in __init__
    HTTPServer.__init__(self, address, handler)
  File "/usr/lib/python2.7/SocketServer.py", line 417, in __init__
    self.server_bind()
  File "/usr/lib/python2.7/BaseHTTPServer.py", line 108, in server_bind
    SocketServer.TCPServer.server_bind(self)
  File "/usr/lib/python2.7/SocketServer.py", line 431, in server_bind
    self.socket.bind(self.server_address)
  File "/usr/lib/python2.7/socket.py", line 228, in meth
    return getattr(self._sock,name)(*args)


FAILED:  plone.cachepurging.tests.test_purger.TestSync.testSimpleSync

Error Message:
[Errno 98] Address already in use

Stack Trace:
[Errno 98] Address already in use

  File "/usr/lib/python2.7/unittest/case.py", line 320, in run
    self.setUp()
  File "/home/jenkins/.buildout/eggs/plone.cachepurging-1.0.14-py2.7.egg/plone/cachepurging/tests/test_purger.py", line 126, in setUp
    super(TestSync, self).setUp()
  File "/home/jenkins/.buildout/eggs/plone.cachepurging-1.0.14-py2.7.egg/plone/cachepurging/tests/test_purger.py", line 83, in setUp
    self.httpd, self.httpt = self.startServer()
  File "/home/jenkins/.buildout/eggs/plone.cachepurging-1.0.14-py2.7.egg/plone/cachepurging/tests/test_purger.py", line 116, in startServer
    httpd = TestHTTPServer(server_address, TestHandler)
  File "/home/jenkins/.buildout/eggs/plone.cachepurging-1.0.14-py2.7.egg/plone/cachepurging/tests/test_purger.py", line 70, in __init__
    HTTPServer.__init__(self, address, handler)
  File "/usr/lib/python2.7/SocketServer.py", line 417, in __init__
    self.server_bind()
  File "/usr/lib/python2.7/BaseHTTPServer.py", line 108, in server_bind
    SocketServer.TCPServer.server_bind(self)
  File "/usr/lib/python2.7/SocketServer.py", line 431, in server_bind
    self.socket.bind(self.server_address)
  File "/usr/lib/python2.7/socket.py", line 228, in meth
    return getattr(self._sock,name)(*args)


FAILED:  plone.cachepurging.tests.test_purger.TestSyncHTTP10.testError

Error Message:
[Errno 98] Address already in use

Stack Trace:
[Errno 98] Address already in use

  File "/usr/lib/python2.7/unittest/case.py", line 320, in run
    self.setUp()
  File "/home/jenkins/.buildout/eggs/plone.cachepurging-1.0.14-py2.7.egg/plone/cachepurging/tests/test_purger.py", line 160, in setUp
    super(TestSync, self).setUp()
  File "/home/jenkins/.buildout/eggs/plone.cachepurging-1.0.14-py2.7.egg/plone/cachepurging/tests/test_purger.py", line 83, in setUp
    self.httpd, self.httpt = self.startServer()
  File "/home/jenkins/.buildout/eggs/plone.cachepurging-1.0.14-py2.7.egg/plone/cachepurging/tests/test_purger.py", line 116, in startServer
    httpd = TestHTTPServer(server_address, TestHandler)
  File "/home/jenkins/.buildout/eggs/plone.cachepurging-1.0.14-py2.7.egg/plone/cachepurging/tests/test_purger.py", line 70, in __init__
    HTTPServer.__init__(self, address, handler)
  File "/usr/lib/python2.7/SocketServer.py", line 417, in __init__
    self.server_bind()
  File "/usr/lib/python2.7/BaseHTTPServer.py", line 108, in server_bind
    SocketServer.TCPServer.server_bind(self)
  File "/usr/lib/python2.7/SocketServer.py", line 431, in server_bind
    self.socket.bind(self.server_address)
  File "/usr/lib/python2.7/socket.py", line 228, in meth
    return getattr(self._sock,name)(*args)


FAILED:  plone.cachepurging.tests.test_purger.TestSyncHTTP10.testHeaders

Error Message:
[Errno 98] Address already in use

Stack Trace:
[Errno 98] Address already in use

  File "/usr/lib/python2.7/unittest/case.py", line 320, in run
    self.setUp()
  File "/home/jenkins/.buildout/eggs/plone.cachepurging-1.0.14-py2.7.egg/plone/cachepurging/tests/test_purger.py", line 160, in setUp
    super(TestSync, self).setUp()
  File "/home/jenkins/.buildout/eggs/plone.cachepurging-1.0.14-py2.7.egg/plone/cachepurging/tests/test_purger.py", line 83, in setUp
    self.httpd, self.httpt = self.startServer()
  File "/home/jenkins/.buildout/eggs/plone.cachepurging-1.0.14-py2.7.egg/plone/cachepurging/tests/test_purger.py", line 116, in startServer
    httpd = TestHTTPServer(server_address, TestHandler)
  File "/home/jenkins/.buildout/eggs/plone.cachepurging-1.0.14-py2.7.egg/plone/cachepurging/tests/test_purger.py", line 70, in __init__
    HTTPServer.__init__(self, address, handler)
  File "/usr/lib/python2.7/SocketServer.py", line 417, in __init__
    self.server_bind()
  File "/usr/lib/python2.7/BaseHTTPServer.py", line 108, in server_bind
    SocketServer.TCPServer.server_bind(self)
  File "/usr/lib/python2.7/SocketServer.py", line 431, in server_bind
    self.socket.bind(self.server_address)
  File "/usr/lib/python2.7/socket.py", line 228, in meth
    return getattr(self._sock,name)(*args)


FAILED:  plone.cachepurging.tests.test_purger.TestSyncHTTP10.testSimpleSync

Error Message:
[Errno 98] Address already in use

Stack Trace:
[Errno 98] Address already in use

  File "/usr/lib/python2.7/unittest/case.py", line 320, in run
    self.setUp()
  File "/home/jenkins/.buildout/eggs/plone.cachepurging-1.0.14-py2.7.egg/plone/cachepurging/tests/test_purger.py", line 160, in setUp
    super(TestSync, self).setUp()
  File "/home/jenkins/.buildout/eggs/plone.cachepurging-1.0.14-py2.7.egg/plone/cachepurging/tests/test_purger.py", line 83, in setUp
    self.httpd, self.httpt = self.startServer()
  File "/home/jenkins/.buildout/eggs/plone.cachepurging-1.0.14-py2.7.egg/plone/cachepurging/tests/test_purger.py", line 116, in startServer
    httpd = TestHTTPServer(server_address, TestHandler)
  File "/home/jenkins/.buildout/eggs/plone.cachepurging-1.0.14-py2.7.egg/plone/cachepurging/tests/test_purger.py", line 70, in __init__
    HTTPServer.__init__(self, address, handler)
  File "/usr/lib/python2.7/SocketServer.py", line 417, in __init__
    self.server_bind()
  File "/usr/lib/python2.7/BaseHTTPServer.py", line 108, in server_bind
    SocketServer.TCPServer.server_bind(self)
  File "/usr/lib/python2.7/SocketServer.py", line 431, in server_bind
    self.socket.bind(self.server_address)
  File "/usr/lib/python2.7/socket.py", line 228, in meth
    return getattr(self._sock,name)(*args)


More information about the Testbot mailing list