[Testbot] Plone 5.1 - Python 2.7 - Build # 554 - Still Failing!

jenkins at plone.org jenkins at plone.org
Tue Sep 26 03:10:25 UTC 2017


Plone 5.1 - Python 2.7 - Build # 554 - Still Failing:

Check console output at http://jenkins.plone.org/job/plone-5.1-python-2.7/554/ to view the results.

Changes:

No changes






Test Results:

3 tests failed.
FAILED:  Products.CMFPlone.tests.testMigrationTool.TestMigrationTool.testDoUpgrades

Error Message:
Tuples differ: ('5108',) != (u'5109',)

Stack Trace:
Tuples differ: ('5108',) != (u'5109',)

First differing element 0:
'5108'
u'5109'

- ('5108',)
?      ^

+ (u'5109',)
?  +    ^


  File "/usr/lib/python2.7/unittest/case.py", line 329, in run
    testMethod()
  File "/home/jenkins/workspace/plone-5.1-python-2.7/src/Products.CMFPlone/Products/CMFPlone/tests/testMigrationTool.py", line 60, in testDoUpgrades
    self.assertEqual(last, current)
  File "/usr/lib/python2.7/unittest/case.py", line 513, in assertEqual
    assertion_func(first, second, msg=msg)
  File "/usr/lib/python2.7/unittest/case.py", line 753, in assertTupleEqual
    self.assertSequenceEqual(tuple1, tuple2, msg, seq_type=tuple)
  File "/usr/lib/python2.7/unittest/case.py", line 724, in assertSequenceEqual
    self.fail(msg)
  File "/usr/lib/python2.7/unittest/case.py", line 410, in fail
    raise self.failureException(msg)


FAILED:  plone.app.upgrade.tests.test_upgrade.TestUpgrade.testDoUpgrades

Error Message:
Tuples differ: ('5108',) != (u'5109',)

Stack Trace:
Tuples differ: ('5108',) != (u'5109',)

First differing element 0:
'5108'
u'5109'

- ('5108',)
?      ^

+ (u'5109',)
?  +    ^


  File "/usr/lib/python2.7/unittest/case.py", line 329, in run
    testMethod()
  File "/home/jenkins/.buildout/eggs/plone.app.upgrade-2.0.8-py2.7.egg/plone/app/upgrade/tests/test_upgrade.py", line 62, in testDoUpgrades
    self.assertEqual(last, current)
  File "/usr/lib/python2.7/unittest/case.py", line 513, in assertEqual
    assertion_func(first, second, msg=msg)
  File "/usr/lib/python2.7/unittest/case.py", line 753, in assertTupleEqual
    self.assertSequenceEqual(tuple1, tuple2, msg, seq_type=tuple)
  File "/usr/lib/python2.7/unittest/case.py", line 724, in assertSequenceEqual
    self.fail(msg)
  File "/usr/lib/python2.7/unittest/case.py", line 410, in fail
    raise self.failureException(msg)


FAILED:  plone.app.upgrade.v50.tests.TestFunctionalMigrations.testFullyUpgraded

Error Message:
True is not false

Stack Trace:
True is not false

  File "/usr/lib/python2.7/unittest/case.py", line 329, in run
    testMethod()
  File "/home/jenkins/.buildout/eggs/plone.app.upgrade-2.0.8-py2.7.egg/plone/app/upgrade/v50/tests.py", line 107, in testFullyUpgraded
    self.assertFalse(self.portal.portal_migration.needUpgrading())
  File "/usr/lib/python2.7/unittest/case.py", line 416, in assertFalse
    raise self.failureException(msg)


More information about the Testbot mailing list