[Testbot] Plone 4.3 - Python 2.6 - Build # 120 - Still Failing!

jenkins at plone.org jenkins at plone.org
Fri Sep 8 00:27:35 UTC 2017


Plone 4.3 - Python 2.6 - Build # 120 - Still Failing:

Check console output at http://jenkins.plone.org/job/plone-4.3-python-2.6/120/ to view the results.

Changes:

[Eric Steele] add missing checkouts







Test Results:

64 tests failed.
FAILED:  Products.Archetypes.tests.test_copying.PortalCopyTests.test_copy_handles_talkback_Items

Error Message:
0 != 1

Stack Trace:
0 != 1

  File "/usr/lib/python2.6/unittest.py", line 279, in run
    testMethod()
  File "/home/jenkins/.buildout/eggs/Products.Archetypes-1.9.17-py2.6.egg/Products/Archetypes/tests/test_copying.py", line 269, in test_copy_handles_talkback_Items
    self.assertEqual(len(results), 1)
  File "/usr/lib/python2.6/unittest.py", line 350, in failUnlessEqual
    (msg or '%r != %r' % (first, second))


FAILED:  Products.Archetypes.tests.test_copying.PortalCopyTests.test_delete_handles_talkback_Items

Error Message:
0 != 1

Stack Trace:
0 != 1

  File "/usr/lib/python2.6/unittest.py", line 279, in run
    testMethod()
  File "/home/jenkins/.buildout/eggs/Products.Archetypes-1.9.17-py2.6.egg/Products/Archetypes/tests/test_copying.py", line 294, in test_delete_handles_talkback_Items
    self.assertEqual(len(results), 1)
  File "/usr/lib/python2.6/unittest.py", line 350, in failUnlessEqual
    (msg or '%r != %r' % (first, second))


FAILED:  Products.CMFDefault.tests.test_Discussions.DiscussionTests.test_deletePropagation

Error Message:
0 != 2

Stack Trace:
0 != 2

  File "/usr/lib/python2.6/unittest.py", line 279, in run
    testMethod()
  File "/home/jenkins/.buildout/eggs/Products.CMFDefault-2.2.4-py2.6.egg/Products/CMFDefault/tests/test_Discussions.py", line 255, in test_deletePropagation
    self.assertEqual( len(ctool), 2 )
  File "/usr/lib/python2.6/unittest.py", line 350, in failUnlessEqual
    (msg or '%r != %r' % (first, second))


FAILED:  Products.CMFDefault.tests.test_Discussions.DiscussionTests.test_deleteReplies

Error Message:
0 != 7

Stack Trace:
0 != 7

  File "/usr/lib/python2.6/unittest.py", line 279, in run
    testMethod()
  File "/home/jenkins/.buildout/eggs/Products.CMFDefault-2.2.4-py2.6.egg/Products/CMFDefault/tests/test_Discussions.py", line 293, in test_deleteReplies
    self.assertEqual(len(ctool), 7)
  File "/usr/lib/python2.6/unittest.py", line 350, in failUnlessEqual
    (msg or '%r != %r' % (first, second))


FAILED:  Products.CMFDefault.tests.test_Discussions.DiscussionTests.test_itemCataloguing

Error Message:
0 != 1

Stack Trace:
0 != 1

  File "/usr/lib/python2.6/unittest.py", line 279, in run
    testMethod()
  File "/home/jenkins/.buildout/eggs/Products.CMFDefault-2.2.4-py2.6.egg/Products/CMFDefault/tests/test_Discussions.py", line 181, in test_itemCataloguing
    self.assertEqual( len(ctool), 1 )
  File "/usr/lib/python2.6/unittest.py", line 350, in failUnlessEqual
    (msg or '%r != %r' % (first, second))


FAILED:  Products.CMFDefault.tests.test_Portal.CMFSiteTests.test_DocumentEditCataloguing

Error Message:
'' != 'Foo'

Stack Trace:
'' != 'Foo'

  File "/usr/lib/python2.6/unittest.py", line 279, in run
    testMethod()
  File "/home/jenkins/.buildout/eggs/Products.CMFDefault-2.2.4-py2.6.egg/Products/CMFDefault/tests/test_Portal.py", line 109, in test_DocumentEditCataloguing
    self.assertEqual( _getMetadata( catalog, rid ), 'Foo' )
  File "/usr/lib/python2.6/unittest.py", line 350, in failUnlessEqual
    (msg or '%r != %r' % (first, second))


FAILED:  Products.CMFDefault.tests.test_Portal.CMFSiteTests.test_FileEditCataloguing

Error Message:
'' != 'Foo'

Stack Trace:
'' != 'Foo'

  File "/usr/lib/python2.6/unittest.py", line 279, in run
    testMethod()
  File "/home/jenkins/.buildout/eggs/Products.CMFDefault-2.2.4-py2.6.egg/Products/CMFDefault/tests/test_Portal.py", line 143, in test_FileEditCataloguing
    self.assertEqual( _getMetadata( catalog, rid ), 'Foo' )
  File "/usr/lib/python2.6/unittest.py", line 350, in failUnlessEqual
    (msg or '%r != %r' % (first, second))


FAILED:  Products.CMFDefault.tests.test_Portal.CMFSiteTests.test_ImageEditCataloguing

Error Message:
'' != 'Foo'

Stack Trace:
'' != 'Foo'

  File "/usr/lib/python2.6/unittest.py", line 279, in run
    testMethod()
  File "/home/jenkins/.buildout/eggs/Products.CMFDefault-2.2.4-py2.6.egg/Products/CMFDefault/tests/test_Portal.py", line 127, in test_ImageEditCataloguing
    self.assertEqual( _getMetadata( catalog, rid ), 'Foo' )
  File "/usr/lib/python2.6/unittest.py", line 350, in failUnlessEqual
    (msg or '%r != %r' % (first, second))


FAILED:  Products.CMFDefault.tests.test_Portal.CMFSiteTests.test_LinkEditCataloguing

Error Message:
'' != 'Foo'

Stack Trace:
'' != 'Foo'

  File "/usr/lib/python2.6/unittest.py", line 279, in run
    testMethod()
  File "/home/jenkins/.buildout/eggs/Products.CMFDefault-2.2.4-py2.6.egg/Products/CMFDefault/tests/test_Portal.py", line 159, in test_LinkEditCataloguing
    self.assertEqual( _getMetadata( catalog, rid ), 'Foo' )
  File "/usr/lib/python2.6/unittest.py", line 350, in failUnlessEqual
    (msg or '%r != %r' % (first, second))


FAILED:  Products.CMFDefault.tests.test_Portal.CMFSiteTests.test_MetadataCataloguing

Error Message:
'' != 'Foo'

Stack Trace:
'' != 'Foo'

  File "/usr/lib/python2.6/unittest.py", line 279, in run
    testMethod()
  File "/home/jenkins/.buildout/eggs/Products.CMFDefault-2.2.4-py2.6.egg/Products/CMFDefault/tests/test_Portal.py", line 85, in test_MetadataCataloguing
    self.assertEqual( title, 'Foo' )
  File "/usr/lib/python2.6/unittest.py", line 350, in failUnlessEqual
    (msg or '%r != %r' % (first, second))


FAILED:  Products.CMFDefault.tests.test_Portal.CMFSiteTests.test_NewsItemEditCataloguing

Error Message:
'' != 'Foo'

Stack Trace:
'' != 'Foo'

  File "/usr/lib/python2.6/unittest.py", line 279, in run
    testMethod()
  File "/home/jenkins/.buildout/eggs/Products.CMFDefault-2.2.4-py2.6.egg/Products/CMFDefault/tests/test_Portal.py", line 175, in test_NewsItemEditCataloguing
    self.assertEqual( _getMetadata( catalog, rid ), 'Foo' )
  File "/usr/lib/python2.6/unittest.py", line 350, in failUnlessEqual
    (msg or '%r != %r' % (first, second))


FAILED:  Products.CMFEditions.tests.test_IntegrationTests.TestIntegration.test13_revertUpdatesCatalog

Error Message:
1 != 0

Stack Trace:
1 != 0

  File "/usr/lib/python2.6/unittest.py", line 279, in run
    testMethod()
  File "/home/jenkins/.buildout/eggs/Products.CMFEditions-2.2.23-py2.6.egg/Products/CMFEditions/tests/test_IntegrationTests.py", line 417, in test13_revertUpdatesCatalog
    self.assertEqual(len(results), 0)
  File "/usr/lib/python2.6/unittest.py", line 350, in failUnlessEqual
    (msg or '%r != %r' % (first, second))


FAILED:  Products.CMFEditions.tests.test_IntegrationTests.TestIntegration.test16_revertInsideRefsUpdatesCatalog

Error Message:
2 != 0

Stack Trace:
2 != 0

  File "/usr/lib/python2.6/unittest.py", line 279, in run
    testMethod()
  File "/home/jenkins/.buildout/eggs/Products.CMFEditions-2.2.23-py2.6.egg/Products/CMFEditions/tests/test_IntegrationTests.py", line 621, in test16_revertInsideRefsUpdatesCatalog
    self.assertEqual(len(results), 0)
  File "/usr/lib/python2.6/unittest.py", line 350, in failUnlessEqual
    (msg or '%r != %r' % (first, second))


FAILED:  Products.CMFEditions.tests.test_IntegrationTests.TestIntegration.test21_RestoreMovedObject

Error Message:
0 != 1

Stack Trace:
0 != 1

  File "/usr/lib/python2.6/unittest.py", line 279, in run
    testMethod()
  File "/home/jenkins/.buildout/eggs/Products.CMFEditions-2.2.23-py2.6.egg/Products/CMFEditions/tests/test_IntegrationTests.py", line 922, in test21_RestoreMovedObject
    self.assertEqual(len(catalog(Title='v1 of doc1')), 1)
  File "/usr/lib/python2.6/unittest.py", line 350, in failUnlessEqual
    (msg or '%r != %r' % (first, second))


FAILED:  Products.CMFEditions.tests.test_IntegrationTests.TestIntegration.test21_RevertObjectWithChangedIdMaintainsConsistentCatalog

Error Message:
0 != 1

Stack Trace:
0 != 1

  File "/usr/lib/python2.6/unittest.py", line 279, in run
    testMethod()
  File "/home/jenkins/.buildout/eggs/Products.CMFEditions-2.2.23-py2.6.egg/Products/CMFEditions/tests/test_IntegrationTests.py", line 889, in test21_RevertObjectWithChangedIdMaintainsConsistentCatalog
    self.assertEqual(len(catalog(Title='v1 of doc1')), 1)
  File "/usr/lib/python2.6/unittest.py", line 350, in failUnlessEqual
    (msg or '%r != %r' % (first, second))


FAILED:  Products.CMFPlone.tests.testCatalogTool.TestCatalogIndexing.testClearFindAndRebuildAddsMissingContent

Error Message:
['Members', 'aggregator', 'aggregator', 'doc', 'events', 'front-page', 'news', 'test_user_1_'] != ['aggregator', 'aggregator', 'doc', 'events', 'front-page', 'news', 'test_user_1_']

Stack Trace:
['Members', 'aggregator', 'aggregator', 'doc', 'events', 'front-page', 'news', 'test_user_1_'] != ['aggregator', 'aggregator', 'doc', 'events', 'front-page', 'news', 'test_user_1_']

  File "/usr/lib/python2.6/unittest.py", line 279, in run
    testMethod()
  File "/home/jenkins/workspace/plone-4.3-python-2.6/src/Products.CMFPlone/Products/CMFPlone/tests/testCatalogTool.py", line 326, in testClearFindAndRebuildAddsMissingContent
    self.assertResults(res, altered_content)
  File "/home/jenkins/workspace/plone-4.3-python-2.6/src/Products.CMFPlone/Products/CMFPlone/tests/testCatalogTool.py", line 171, in assertResults
    self.assertEqual(lhs, rhs)
  File "/usr/lib/python2.6/unittest.py", line 350, in failUnlessEqual
    (msg or '%r != %r' % (first, second))


FAILED:  Products.CMFPlone.tests.testCatalogTool.TestCatalogIndexing.testFixture

Error Message:
1 != 0

Stack Trace:
1 != 0

  File "/usr/lib/python2.6/unittest.py", line 279, in run
    testMethod()
  File "/home/jenkins/workspace/plone-4.3-python-2.6/src/Products.CMFPlone/Products/CMFPlone/tests/testCatalogTool.py", line 177, in testFixture
    self.assertEqual(len(self.catalog(getId='doc')), 0)
  File "/usr/lib/python2.6/unittest.py", line 350, in failUnlessEqual
    (msg or '%r != %r' % (first, second))


FAILED:  Products.CMFPlone.tests.testCatalogTool.TestCatalogIndexing.testIndexIdOnly

Error Message:
1 != 0

Stack Trace:
1 != 0

  File "/usr/lib/python2.6/unittest.py", line 279, in run
    testMethod()
  File "/home/jenkins/workspace/plone-4.3-python-2.6/src/Products.CMFPlone/Products/CMFPlone/tests/testCatalogTool.py", line 296, in testIndexIdOnly
    self.assertEqual(len(self.catalog(getId='doc')), 0)  # <-- Should be 1
  File "/usr/lib/python2.6/unittest.py", line 350, in failUnlessEqual
    (msg or '%r != %r' % (first, second))


FAILED:  Products.CMFPlone.tests.testCatalogTool.TestCatalogIndexing.testIndexTitleOnly

Error Message:
1 != 0

Stack Trace:
1 != 0

  File "/usr/lib/python2.6/unittest.py", line 279, in run
    testMethod()
  File "/home/jenkins/workspace/plone-4.3-python-2.6/src/Products.CMFPlone/Products/CMFPlone/tests/testCatalogTool.py", line 281, in testIndexTitleOnly
    self.assertEqual(len(self.catalog(getId='doc')), 0)
  File "/usr/lib/python2.6/unittest.py", line 350, in failUnlessEqual
    (msg or '%r != %r' % (first, second))


FAILED:  Products.CMFPlone.tests.testCatalogTool.TestCatalogIndexing.testReindexObjectUpdatesMetadata

Error Message:
'Foo' != 'Fred'

Stack Trace:
'Foo' != 'Fred'

  File "/usr/lib/python2.6/unittest.py", line 279, in run
    testMethod()
  File "/home/jenkins/workspace/plone-4.3-python-2.6/src/Products.CMFPlone/Products/CMFPlone/tests/testCatalogTool.py", line 218, in testReindexObjectUpdatesMetadata
    self.assertEqual(brain.Title, 'Fred')
  File "/usr/lib/python2.6/unittest.py", line 350, in failUnlessEqual
    (msg or '%r != %r' % (first, second))


FAILED:  Products.CMFPlone.tests.testCatalogTool.TestCatalogIndexing.testReindexTitleOnly

Error Message:
0 != 1

Stack Trace:
0 != 1

  File "/usr/lib/python2.6/unittest.py", line 279, in run
    testMethod()
  File "/home/jenkins/workspace/plone-4.3-python-2.6/src/Products.CMFPlone/Products/CMFPlone/tests/testCatalogTool.py", line 240, in testReindexTitleOnly
    self.assertEqual(len(self.catalog(Title='Fred')), 1)
  File "/usr/lib/python2.6/unittest.py", line 350, in failUnlessEqual
    (msg or '%r != %r' % (first, second))


FAILED:  Products.CMFPlone.tests.testCatalogTool.TestCatalogIndexing.testReindexTitleOnlyUpdatesMetadata

Error Message:
'Foo' != 'Fred'

Stack Trace:
'Foo' != 'Fred'

  File "/usr/lib/python2.6/unittest.py", line 279, in run
    testMethod()
  File "/home/jenkins/workspace/plone-4.3-python-2.6/src/Products.CMFPlone/Products/CMFPlone/tests/testCatalogTool.py", line 253, in testReindexTitleOnlyUpdatesMetadata
    self.assertEqual(brain.Title, 'Fred')
  File "/usr/lib/python2.6/unittest.py", line 350, in failUnlessEqual
    (msg or '%r != %r' % (first, second))


FAILED:  Products.CMFPlone.tests.testCatalogTool.TestCatalogIndexing.testUnindexObject

Error Message:
1 != 0

Stack Trace:
1 != 0

  File "/usr/lib/python2.6/unittest.py", line 279, in run
    testMethod()
  File "/home/jenkins/workspace/plone-4.3-python-2.6/src/Products.CMFPlone/Products/CMFPlone/tests/testCatalogTool.py", line 200, in testUnindexObject
    self.assertEqual(len(self.catalog(getId='doc')), 0)
  File "/usr/lib/python2.6/unittest.py", line 350, in failUnlessEqual
    (msg or '%r != %r' % (first, second))


FAILED:  Products.CMFPlone.tests.testUnicodeSplitter.TestQuery.testIndexUnicode

Error Message:
0 != 1

Stack Trace:
0 != 1

  File "/usr/lib/python2.6/unittest.py", line 279, in run
    testMethod()
  File "/home/jenkins/workspace/plone-4.3-python-2.6/src/Products.CMFPlone/Products/CMFPlone/tests/testUnicodeSplitter.py", line 233, in testIndexUnicode
    self.assertEqual(len(brains), 1)
  File "/usr/lib/python2.6/unittest.py", line 350, in failUnlessEqual
    (msg or '%r != %r' % (first, second))


FAILED:  Products.CMFPlone.tests.testUnicodeSplitter.TestQuery.testIndexUnicodeLower

Error Message:
0 != 1

Stack Trace:
0 != 1

  File "/usr/lib/python2.6/unittest.py", line 279, in run
    testMethod()
  File "/home/jenkins/workspace/plone-4.3-python-2.6/src/Products.CMFPlone/Products/CMFPlone/tests/testUnicodeSplitter.py", line 239, in testIndexUnicodeLower
    self.assertEqual(len(brains), 1)
  File "/usr/lib/python2.6/unittest.py", line 350, in failUnlessEqual
    (msg or '%r != %r' % (first, second))


FAILED:  Products.CMFPlone.tests.testUnicodeSplitter.TestQuery.testMixedModeQuery

Error Message:
0 != 1

Stack Trace:
0 != 1

  File "/usr/lib/python2.6/unittest.py", line 279, in run
    testMethod()
  File "/home/jenkins/workspace/plone-4.3-python-2.6/src/Products.CMFPlone/Products/CMFPlone/tests/testUnicodeSplitter.py", line 213, in testMixedModeQuery
    self.assertEqual(len(brains), 1)
  File "/usr/lib/python2.6/unittest.py", line 350, in failUnlessEqual
    (msg or '%r != %r' % (first, second))


FAILED:  Products.CMFPlone.tests.testUnicodeSplitter.TestQuery.testQueryByLatin1

Error Message:
0 != 1

Stack Trace:
0 != 1

  File "/usr/lib/python2.6/unittest.py", line 279, in run
    testMethod()
  File "/home/jenkins/workspace/plone-4.3-python-2.6/src/Products.CMFPlone/Products/CMFPlone/tests/testUnicodeSplitter.py", line 183, in testQueryByLatin1
    self.assertEqual(len(brains), 1)
  File "/usr/lib/python2.6/unittest.py", line 350, in failUnlessEqual
    (msg or '%r != %r' % (first, second))


FAILED:  Products.CMFPlone.tests.testUnicodeSplitter.TestQuery.testQueryByLatin1Lower

Error Message:
0 != 1

Stack Trace:
0 != 1

  File "/usr/lib/python2.6/unittest.py", line 279, in run
    testMethod()
  File "/home/jenkins/workspace/plone-4.3-python-2.6/src/Products.CMFPlone/Products/CMFPlone/tests/testUnicodeSplitter.py", line 197, in testQueryByLatin1Lower
    self.assertEqual(len(brains), 1)
  File "/usr/lib/python2.6/unittest.py", line 350, in failUnlessEqual
    (msg or '%r != %r' % (first, second))


FAILED:  Products.CMFPlone.tests.testUnicodeSplitter.TestQuery.testQueryByUmlaut

Error Message:
0 != 1

Stack Trace:
0 != 1

  File "/usr/lib/python2.6/unittest.py", line 279, in run
    testMethod()
  File "/home/jenkins/workspace/plone-4.3-python-2.6/src/Products.CMFPlone/Products/CMFPlone/tests/testUnicodeSplitter.py", line 149, in testQueryByUmlaut
    self.assertEqual(len(brains), 1)
  File "/usr/lib/python2.6/unittest.py", line 350, in failUnlessEqual
    (msg or '%r != %r' % (first, second))


FAILED:  Products.CMFPlone.tests.testUnicodeSplitter.TestQuery.testQueryByUmlautLower

Error Message:
0 != 1

Stack Trace:
0 != 1

  File "/usr/lib/python2.6/unittest.py", line 279, in run
    testMethod()
  File "/home/jenkins/workspace/plone-4.3-python-2.6/src/Products.CMFPlone/Products/CMFPlone/tests/testUnicodeSplitter.py", line 155, in testQueryByUmlautLower
    self.assertEqual(len(brains), 1)
  File "/usr/lib/python2.6/unittest.py", line 350, in failUnlessEqual
    (msg or '%r != %r' % (first, second))


FAILED:  Products.CMFPlone.tests.testUnicodeSplitter.TestQuery.testQueryByUnicode

Error Message:
0 != 1

Stack Trace:
0 != 1

  File "/usr/lib/python2.6/unittest.py", line 279, in run
    testMethod()
  File "/home/jenkins/workspace/plone-4.3-python-2.6/src/Products.CMFPlone/Products/CMFPlone/tests/testUnicodeSplitter.py", line 221, in testQueryByUnicode
    self.assertEqual(len(brains), 1)
  File "/usr/lib/python2.6/unittest.py", line 350, in failUnlessEqual
    (msg or '%r != %r' % (first, second))


FAILED:  Products.CMFPlone.tests.testUnicodeSplitter.TestQuery.testQueryByUnicodeLower

Error Message:
0 != 1

Stack Trace:
0 != 1

  File "/usr/lib/python2.6/unittest.py", line 279, in run
    testMethod()
  File "/home/jenkins/workspace/plone-4.3-python-2.6/src/Products.CMFPlone/Products/CMFPlone/tests/testUnicodeSplitter.py", line 227, in testQueryByUnicodeLower
    self.assertEqual(len(brains), 1)
  File "/usr/lib/python2.6/unittest.py", line 350, in failUnlessEqual
    (msg or '%r != %r' % (first, second))


FAILED:  Products.CMFPlone.tests.testUnicodeSplitter.TestQuery.testQueryDifferentiatesUmlauts

Error Message:
0 != 1

Stack Trace:
0 != 1

  File "/usr/lib/python2.6/unittest.py", line 279, in run
    testMethod()
  File "/home/jenkins/workspace/plone-4.3-python-2.6/src/Products.CMFPlone/Products/CMFPlone/tests/testUnicodeSplitter.py", line 163, in testQueryDifferentiatesUmlauts
    self.assertEqual(len(brains), 1)
  File "/usr/lib/python2.6/unittest.py", line 350, in failUnlessEqual
    (msg or '%r != %r' % (first, second))


FAILED:  Products.CMFPlone.tests.testUnicodeSplitter.TestQuery.testQueryDifferentiatesUmlautsLower

Error Message:
0 != 1

Stack Trace:
0 != 1

  File "/usr/lib/python2.6/unittest.py", line 279, in run
    testMethod()
  File "/home/jenkins/workspace/plone-4.3-python-2.6/src/Products.CMFPlone/Products/CMFPlone/tests/testUnicodeSplitter.py", line 171, in testQueryDifferentiatesUmlautsLower
    self.assertEqual(len(brains), 1)
  File "/usr/lib/python2.6/unittest.py", line 350, in failUnlessEqual
    (msg or '%r != %r' % (first, second))


FAILED:  Products.CMFUid.tests.test_uidhandling.UniqueIdHandlerTests.test_UidCataloging

Error Message:
0 != 1

Stack Trace:
0 != 1

  File "/usr/lib/python2.6/unittest.py", line 279, in run
    testMethod()
  File "/home/jenkins/.buildout/eggs/Products.CMFUid-2.2.1-py2.6.egg/Products/CMFUid/tests/test_uidhandling.py", line 260, in test_UidCataloging
    self.assertEqual(len(brains), 1)
  File "/usr/lib/python2.6/unittest.py", line 350, in failUnlessEqual
    (msg or '%r != %r' % (first, second))


FAILED:  Products.CMFUid.tests.test_uidhandling.UniqueIdHandlerTests.test_UidCatalogingDoesNotAcquireUid

Error Message:
0 != 1

Stack Trace:
0 != 1

  File "/usr/lib/python2.6/unittest.py", line 279, in run
    testMethod()
  File "/home/jenkins/.buildout/eggs/Products.CMFUid-2.2.1-py2.6.egg/Products/CMFUid/tests/test_uidhandling.py", line 270, in test_UidCatalogingDoesNotAcquireUid
    self.assertEqual(len(brains), 1)
  File "/usr/lib/python2.6/unittest.py", line 350, in failUnlessEqual
    (msg or '%r != %r' % (first, second))


FAILED:  Products.CMFUid.tests.test_uidhandling.UniqueIdHandlerTests.test_getRegisteredObjectByUid

Error Message:
No object found with '1' as uid.

Stack Trace:
No object found with '1' as uid.

  File "/usr/lib/python2.6/unittest.py", line 279, in run
    testMethod()
  File "/home/jenkins/.buildout/eggs/Products.CMFUid-2.2.1-py2.6.egg/Products/CMFUid/tests/test_uidhandling.py", line 129, in test_getRegisteredObjectByUid
    self.assertEqual(handler.getObject(uid), dummy)
  File "/home/jenkins/.buildout/eggs/Products.CMFUid-2.2.1-py2.6.egg/Products/CMFUid/UniqueIdHandlerTool.py", line 215, in getObject
    return self.getBrain(uid).getObject()
  File "/home/jenkins/.buildout/eggs/Products.CMFUid-2.2.1-py2.6.egg/Products/CMFUid/UniqueIdHandlerTool.py", line 209, in getBrain
    return self._getBrain(uid, self.queryBrain)
  File "/home/jenkins/.buildout/eggs/Products.CMFUid-2.2.1-py2.6.egg/Products/CMFUid/UniqueIdHandlerTool.py", line 202, in _getBrain
    raise UniqueIdError, "No object found with '%s' as uid." % uid


FAILED:  Products.CMFUid.tests.test_uidhandling.UniqueIdHandlerTests.test_setExistingUidOnDifferentObjectWithCheckRaisesException

Error Message:
UniqueIdError not raised

Stack Trace:
UniqueIdError not raised

  File "/usr/lib/python2.6/unittest.py", line 279, in run
    testMethod()
  File "/home/jenkins/.buildout/eggs/Products.CMFUid-2.2.1-py2.6.egg/Products/CMFUid/tests/test_uidhandling.py", line 208, in test_setExistingUidOnDifferentObjectWithCheckRaisesException
    self.assertRaises(UniqueIdError, handler.setUid, dummy2, uid1_reg)
  File "/usr/lib/python2.6/unittest.py", line 342, in failUnlessRaises
    raise self.failureException, "%s not raised" % excName


FAILED:  Products.CMFUid.tests.test_uidhandling.UniqueIdHandlerTests.test_setExistingUidOnDifferentObjectWithoutCheck

Error Message:
0 != 2

Stack Trace:
0 != 2

  File "/usr/lib/python2.6/unittest.py", line 279, in run
    testMethod()
  File "/home/jenkins/.buildout/eggs/Products.CMFUid-2.2.1-py2.6.egg/Products/CMFUid/tests/test_uidhandling.py", line 227, in test_setExistingUidOnDifferentObjectWithoutCheck
    self.assertEqual(len(result), 2)
  File "/usr/lib/python2.6/unittest.py", line 350, in failUnlessEqual
    (msg or '%r != %r' % (first, second))


FAILED:  plone.app.content.basecontent.txt

Error Message:
Failed doctest test for basecontent.txt

Stack Trace:
Failed doctest test for basecontent.txt
  File "/home/jenkins/.buildout/eggs/plone.app.content-2.1.7-py2.6.egg/plone/app/content/basecontent.txt", line 0

----------------------------------------------------------------------
File "/home/jenkins/.buildout/eggs/plone.app.content-2.1.7-py2.6.egg/plone/app/content/basecontent.txt", line 117, in basecontent.txt
Failed example:
    [b.Title for b in catalog(getId = 'my-item')]
Expected:
    ['A non-folderish item']
Got:
    []


  File "/usr/lib/python2.6/unittest.py", line 279, in run
    testMethod()
  File "/usr/lib/python2.6/doctest.py", line 2163, in runTest
    raise self.failureException(self.format_failure(new.getvalue()))


FAILED:  plone.app.discussion.tests.test_catalog.CommentCatalogTest.test_add_comment

Error Message:
0

Stack Trace:
0

  File "/home/jenkins/.buildout/eggs/unittest2-0.5.1-py2.6.egg/unittest2/case.py", line 333, in run
    self.setUp()
  File "/home/jenkins/.buildout/eggs/plone.app.discussion-2.2.20-py2.6.egg/plone/app/discussion/tests/test_catalog.py", line 293, in setUp
    self.comment_brain = brains[0]
  File "/home/jenkins/.buildout/eggs/Products.ZCatalog-2.13.27-py2.6.egg/Products/ZCatalog/Lazy.py", line 132, in __getitem__
    raise IndexError(index)


FAILED:  plone.app.discussion.tests.test_catalog.CommentCatalogTest.test_clear_and_rebuild_catalog

Error Message:
0

Stack Trace:
0

  File "/home/jenkins/.buildout/eggs/unittest2-0.5.1-py2.6.egg/unittest2/case.py", line 333, in run
    self.setUp()
  File "/home/jenkins/.buildout/eggs/plone.app.discussion-2.2.20-py2.6.egg/plone/app/discussion/tests/test_catalog.py", line 293, in setUp
    self.comment_brain = brains[0]
  File "/home/jenkins/.buildout/eggs/Products.ZCatalog-2.13.27-py2.6.egg/Products/ZCatalog/Lazy.py", line 132, in __getitem__
    raise IndexError(index)


FAILED:  plone.app.discussion.tests.test_catalog.CommentCatalogTest.test_clear_and_rebuild_catalog_for_nested_comments

Error Message:
0

Stack Trace:
0

  File "/home/jenkins/.buildout/eggs/unittest2-0.5.1-py2.6.egg/unittest2/case.py", line 333, in run
    self.setUp()
  File "/home/jenkins/.buildout/eggs/plone.app.discussion-2.2.20-py2.6.egg/plone/app/discussion/tests/test_catalog.py", line 293, in setUp
    self.comment_brain = brains[0]
  File "/home/jenkins/.buildout/eggs/Products.ZCatalog-2.13.27-py2.6.egg/Products/ZCatalog/Lazy.py", line 132, in __getitem__
    raise IndexError(index)


FAILED:  plone.app.discussion.tests.test_catalog.CommentCatalogTest.test_collection

Error Message:
0

Stack Trace:
0

  File "/home/jenkins/.buildout/eggs/unittest2-0.5.1-py2.6.egg/unittest2/case.py", line 333, in run
    self.setUp()
  File "/home/jenkins/.buildout/eggs/plone.app.discussion-2.2.20-py2.6.egg/plone/app/discussion/tests/test_catalog.py", line 293, in setUp
    self.comment_brain = brains[0]
  File "/home/jenkins/.buildout/eggs/Products.ZCatalog-2.13.27-py2.6.egg/Products/ZCatalog/Lazy.py", line 132, in __getitem__
    raise IndexError(index)


FAILED:  plone.app.discussion.tests.test_catalog.CommentCatalogTest.test_creator

Error Message:
0

Stack Trace:
0

  File "/home/jenkins/.buildout/eggs/unittest2-0.5.1-py2.6.egg/unittest2/case.py", line 333, in run
    self.setUp()
  File "/home/jenkins/.buildout/eggs/plone.app.discussion-2.2.20-py2.6.egg/plone/app/discussion/tests/test_catalog.py", line 293, in setUp
    self.comment_brain = brains[0]
  File "/home/jenkins/.buildout/eggs/Products.ZCatalog-2.13.27-py2.6.egg/Products/ZCatalog/Lazy.py", line 132, in __getitem__
    raise IndexError(index)


FAILED:  plone.app.discussion.tests.test_catalog.CommentCatalogTest.test_delete_comment

Error Message:
0

Stack Trace:
0

  File "/home/jenkins/.buildout/eggs/unittest2-0.5.1-py2.6.egg/unittest2/case.py", line 333, in run
    self.setUp()
  File "/home/jenkins/.buildout/eggs/plone.app.discussion-2.2.20-py2.6.egg/plone/app/discussion/tests/test_catalog.py", line 293, in setUp
    self.comment_brain = brains[0]
  File "/home/jenkins/.buildout/eggs/Products.ZCatalog-2.13.27-py2.6.egg/Products/ZCatalog/Lazy.py", line 132, in __getitem__
    raise IndexError(index)


FAILED:  plone.app.discussion.tests.test_catalog.CommentCatalogTest.test_in_response_to

Error Message:
0

Stack Trace:
0

  File "/home/jenkins/.buildout/eggs/unittest2-0.5.1-py2.6.egg/unittest2/case.py", line 333, in run
    self.setUp()
  File "/home/jenkins/.buildout/eggs/plone.app.discussion-2.2.20-py2.6.egg/plone/app/discussion/tests/test_catalog.py", line 293, in setUp
    self.comment_brain = brains[0]
  File "/home/jenkins/.buildout/eggs/Products.ZCatalog-2.13.27-py2.6.egg/Products/ZCatalog/Lazy.py", line 132, in __getitem__
    raise IndexError(index)


FAILED:  plone.app.discussion.tests.test_catalog.CommentCatalogTest.test_move_comments_when_content_object_is_moved

Error Message:
0

Stack Trace:
0

  File "/home/jenkins/.buildout/eggs/unittest2-0.5.1-py2.6.egg/unittest2/case.py", line 333, in run
    self.setUp()
  File "/home/jenkins/.buildout/eggs/plone.app.discussion-2.2.20-py2.6.egg/plone/app/discussion/tests/test_catalog.py", line 293, in setUp
    self.comment_brain = brains[0]
  File "/home/jenkins/.buildout/eggs/Products.ZCatalog-2.13.27-py2.6.egg/Products/ZCatalog/Lazy.py", line 132, in __getitem__
    raise IndexError(index)


FAILED:  plone.app.discussion.tests.test_catalog.CommentCatalogTest.test_move_upper_level_folder

Error Message:
0

Stack Trace:
0

  File "/home/jenkins/.buildout/eggs/unittest2-0.5.1-py2.6.egg/unittest2/case.py", line 333, in run
    self.setUp()
  File "/home/jenkins/.buildout/eggs/plone.app.discussion-2.2.20-py2.6.egg/plone/app/discussion/tests/test_catalog.py", line 293, in setUp
    self.comment_brain = brains[0]
  File "/home/jenkins/.buildout/eggs/Products.ZCatalog-2.13.27-py2.6.egg/Products/ZCatalog/Lazy.py", line 132, in __getitem__
    raise IndexError(index)


FAILED:  plone.app.discussion.tests.test_catalog.CommentCatalogTest.test_no_name_title

Error Message:
0

Stack Trace:
0

  File "/home/jenkins/.buildout/eggs/unittest2-0.5.1-py2.6.egg/unittest2/case.py", line 333, in run
    self.setUp()
  File "/home/jenkins/.buildout/eggs/plone.app.discussion-2.2.20-py2.6.egg/plone/app/discussion/tests/test_catalog.py", line 293, in setUp
    self.comment_brain = brains[0]
  File "/home/jenkins/.buildout/eggs/Products.ZCatalog-2.13.27-py2.6.egg/Products/ZCatalog/Lazy.py", line 132, in __getitem__
    raise IndexError(index)


FAILED:  plone.app.discussion.tests.test_catalog.CommentCatalogTest.test_remove_comments_when_content_object_is_removed

Error Message:
0

Stack Trace:
0

  File "/home/jenkins/.buildout/eggs/unittest2-0.5.1-py2.6.egg/unittest2/case.py", line 333, in run
    self.setUp()
  File "/home/jenkins/.buildout/eggs/plone.app.discussion-2.2.20-py2.6.egg/plone/app/discussion/tests/test_catalog.py", line 293, in setUp
    self.comment_brain = brains[0]
  File "/home/jenkins/.buildout/eggs/Products.ZCatalog-2.13.27-py2.6.egg/Products/ZCatalog/Lazy.py", line 132, in __getitem__
    raise IndexError(index)


FAILED:  plone.app.discussion.tests.test_catalog.CommentCatalogTest.test_review_state

Error Message:
0

Stack Trace:
0

  File "/home/jenkins/.buildout/eggs/unittest2-0.5.1-py2.6.egg/unittest2/case.py", line 333, in run
    self.setUp()
  File "/home/jenkins/.buildout/eggs/plone.app.discussion-2.2.20-py2.6.egg/plone/app/discussion/tests/test_catalog.py", line 293, in setUp
    self.comment_brain = brains[0]
  File "/home/jenkins/.buildout/eggs/Products.ZCatalog-2.13.27-py2.6.egg/Products/ZCatalog/Lazy.py", line 132, in __getitem__
    raise IndexError(index)


FAILED:  plone.app.discussion.tests.test_catalog.CommentCatalogTest.test_title

Error Message:
0

Stack Trace:
0

  File "/home/jenkins/.buildout/eggs/unittest2-0.5.1-py2.6.egg/unittest2/case.py", line 333, in run
    self.setUp()
  File "/home/jenkins/.buildout/eggs/plone.app.discussion-2.2.20-py2.6.egg/plone/app/discussion/tests/test_catalog.py", line 293, in setUp
    self.comment_brain = brains[0]
  File "/home/jenkins/.buildout/eggs/Products.ZCatalog-2.13.27-py2.6.egg/Products/ZCatalog/Lazy.py", line 132, in __getitem__
    raise IndexError(index)


FAILED:  plone.app.discussion.tests.test_catalog.CommentCatalogTest.test_type

Error Message:
0

Stack Trace:
0

  File "/home/jenkins/.buildout/eggs/unittest2-0.5.1-py2.6.egg/unittest2/case.py", line 333, in run
    self.setUp()
  File "/home/jenkins/.buildout/eggs/plone.app.discussion-2.2.20-py2.6.egg/plone/app/discussion/tests/test_catalog.py", line 293, in setUp
    self.comment_brain = brains[0]
  File "/home/jenkins/.buildout/eggs/Products.ZCatalog-2.13.27-py2.6.egg/Products/ZCatalog/Lazy.py", line 132, in __getitem__
    raise IndexError(index)


FAILED:  plone.app.discussion.tests.test_catalog.CommentCatalogTest.test_update_comments_when_content_object_is_renamed

Error Message:
0

Stack Trace:
0

  File "/home/jenkins/.buildout/eggs/unittest2-0.5.1-py2.6.egg/unittest2/case.py", line 333, in run
    self.setUp()
  File "/home/jenkins/.buildout/eggs/plone.app.discussion-2.2.20-py2.6.egg/plone/app/discussion/tests/test_catalog.py", line 293, in setUp
    self.comment_brain = brains[0]
  File "/home/jenkins/.buildout/eggs/Products.ZCatalog-2.13.27-py2.6.egg/Products/ZCatalog/Lazy.py", line 132, in __getitem__
    raise IndexError(index)


FAILED:  plone.app.discussion.tests.test_catalog.ConversationCatalogTest.test_conversation_indexes_not_in_comments

Error Message:
0

Stack Trace:
0

  File "/home/jenkins/.buildout/eggs/unittest2-0.5.1-py2.6.egg/unittest2/case.py", line 340, in run
    testMethod()
  File "/home/jenkins/.buildout/eggs/plone.app.discussion-2.2.20-py2.6.egg/plone/app/discussion/tests/test_catalog.py", line 243, in test_conversation_indexes_not_in_comments
    comment1_brain = brains[0]
  File "/home/jenkins/.buildout/eggs/Products.ZCatalog-2.13.27-py2.6.egg/Products/ZCatalog/Lazy.py", line 132, in __getitem__
    raise IndexError(index)


FAILED:  plone.app.discussion.tests.test_comment.CommentTest.test_comment_uid_differs_from_content_uid

Error Message:
0

Stack Trace:
0

  File "/home/jenkins/.buildout/eggs/unittest2-0.5.1-py2.6.egg/unittest2/case.py", line 340, in run
    testMethod()
  File "/home/jenkins/.buildout/eggs/plone.app.discussion-2.2.20-py2.6.egg/plone/app/discussion/tests/test_comment.py", line 100, in test_comment_uid_differs_from_content_uid
    )[0]
  File "/home/jenkins/.buildout/eggs/Products.ZCatalog-2.13.27-py2.6.egg/Products/ZCatalog/Lazy.py", line 132, in __getitem__
    raise IndexError(index)


FAILED:  plone.app.discussion.tests.test_comment.CommentTest.test_uid

Error Message:
0

Stack Trace:
0

  File "/home/jenkins/.buildout/eggs/unittest2-0.5.1-py2.6.egg/unittest2/case.py", line 340, in run
    testMethod()
  File "/home/jenkins/.buildout/eggs/plone.app.discussion-2.2.20-py2.6.egg/plone/app/discussion/tests/test_comment.py", line 80, in test_uid
    )[0]
  File "/home/jenkins/.buildout/eggs/Products.ZCatalog-2.13.27-py2.6.egg/Products/ZCatalog/Lazy.py", line 132, in __getitem__
    raise IndexError(index)


FAILED:  plone.app.discussion.tests.test_comment.CommentTest.test_uid_is_unique

Error Message:
list index out of range

Stack Trace:
list index out of range

  File "/home/jenkins/.buildout/eggs/unittest2-0.5.1-py2.6.egg/unittest2/case.py", line 340, in run
    testMethod()
  File "/home/jenkins/.buildout/eggs/plone.app.discussion-2.2.20-py2.6.egg/plone/app/discussion/tests/test_comment.py", line 92, in test_uid_is_unique
    self.assertNotEqual(brains[0].UID, brains[1].UID)
  File "/home/jenkins/.buildout/eggs/Products.ZCatalog-2.13.27-py2.6.egg/Products/ZCatalog/Lazy.py", line 190, in __getitem__
    value = data[index] = self._func(self._seq[index])


FAILED:  plone.app.discussion.tests.test_tool.ToolTest.test_tool_indexing

Error Message:
False is not True : There is only one comment, but we got 0 results in the search

Stack Trace:
False is not True : There is only one comment, but we got 0 results in the search

  File "/home/jenkins/.buildout/eggs/unittest2-0.5.1-py2.6.egg/unittest2/case.py", line 340, in run
    testMethod()
  File "/home/jenkins/.buildout/eggs/plone.app.discussion-2.2.20-py2.6.egg/plone/app/discussion/tests/test_tool.py", line 43, in test_tool_indexing
    " %s results in the search" % len(comment)
  File "/home/jenkins/.buildout/eggs/unittest2-0.5.1-py2.6.egg/unittest2/case.py", line 427, in assertTrue
    raise self.failureException(msg)


FAILED:  plone.app.layout.sitemap.tests.test_sitemap.SiteMapTestCase.test_default_pages

Error Message:


Stack Trace:


  File "/usr/lib/python2.6/unittest.py", line 279, in run
    testMethod()
  File "/home/jenkins/.buildout/eggs/plone.app.layout-2.3.17-py2.6.egg/plone/app/layout/sitemap/tests/test_sitemap.py", line 237, in test_default_pages
    self.assertTrue('<lastmod>2001-01-01T' in xml)
  File "/usr/lib/python2.6/unittest.py", line 325, in failUnless
    if not expr: raise self.failureException, msg


FAILED:  plone.app.layout.sitemap.tests.test_sitemap.SiteMapTestCase.test_navroot

Error Message:


Stack Trace:


  File "/usr/lib/python2.6/unittest.py", line 279, in run
    testMethod()
  File "/home/jenkins/.buildout/eggs/plone.app.layout-2.3.17-py2.6.egg/plone/app/layout/sitemap/tests/test_sitemap.py", line 173, in test_navroot
    self.assertTrue('<loc>http://nohost/plone/navroot/published</loc>' in xml)
  File "/usr/lib/python2.6/unittest.py", line 325, in failUnless
    if not expr: raise self.failureException, msg


FAILED:  plone.app.workflow.tests.test_folder_workflow.TestFolderWorkflow.testFindPrivateFolder

Error Message:


Stack Trace:


  File "/usr/lib/python2.6/unittest.py", line 279, in run
    testMethod()
  File "/home/jenkins/.buildout/eggs/plone.app.workflow-2.1.9-py2.6.egg/plone/app/workflow/tests/test_folder_workflow.py", line 420, in testFindPrivateFolder
    self.failIf(self.catalog(id='dir'))
  File "/usr/lib/python2.6/unittest.py", line 321, in failIf
    if expr: raise self.failureException, msg


FAILED:  plone.app.workflow.tests.test_plone_workflow.TestDefaultWorkflow.testFindPrivateDocument

Error Message:


Stack Trace:


  File "/usr/lib/python2.6/unittest.py", line 279, in run
    testMethod()
  File "/home/jenkins/.buildout/eggs/plone.app.workflow-2.1.9-py2.6.egg/plone/app/workflow/tests/test_plone_workflow.py", line 449, in testFindPrivateDocument
    self.failIf(self.catalog(id='doc'))
  File "/usr/lib/python2.6/unittest.py", line 321, in failIf
    if expr: raise self.failureException, msg


More information about the Testbot mailing list