[Testbot] Plone 5.0 - Python 2.7 - Build # 109 - Failure!

jenkins at plone.org jenkins at plone.org
Tue May 30 15:43:46 UTC 2017


Plone 5.0 - Python 2.7 - Build # 109 - Failure:

Check console output at http://jenkins.plone.org/job/plone-5.0-python-2.7/109/ to view the results.

Changes:

[Godefroid Chapelle] [fc] Repository: Products.Archetypes Branch: refs/heads/1.10.x Date:







Test Results:

22 tests failed.
FAILED:  plone.app.folder.tests.test_integration.Startup

Error Message:
name 'implements' is not defined

Stack Trace:
name 'implements' is not defined

  File "/home/jenkins/.buildout/eggs/plone.app.folder-1.2.3-py2.7.egg/plone/app/folder/tests/test_integration.py", line 2, in <module>
    from plone.app.folder.tests.base import IntegrationTestCase
  File "/home/jenkins/.buildout/eggs/plone.app.folder-1.2.3-py2.7.egg/plone/app/folder/tests/base.py", line 2, in <module>
    from plone.app.testing.bbb import PloneTestCase
  File "/home/jenkins/.buildout/eggs/plone.app.testing-5.0.6-py2.7.egg/plone/app/testing/__init__.py", line 4, in <module>
    from plone.app.testing.helpers import applyProfile
  File "/home/jenkins/.buildout/eggs/plone.app.testing-5.0.6-py2.7.egg/plone/app/testing/helpers.py", line 5, in <module>
    from plone.app.testing import layers
  File "/home/jenkins/.buildout/eggs/plone.app.testing-5.0.6-py2.7.egg/plone/app/testing/layers.py", line 27, in <module>
    class PloneFixture(Layer):
  File "/home/jenkins/.buildout/eggs/plone.app.testing-5.0.6-py2.7.egg/plone/app/testing/layers.py", line 81, in PloneFixture
    import Products.PasswordResetTool  # noqa
  File "/home/jenkins/.buildout/eggs/Products.PasswordResetTool-2.2.3-py2.7.egg/Products/PasswordResetTool/__init__.py", line 4, in <module>
    import PasswordResetTool
  File "/home/jenkins/.buildout/eggs/Products.PasswordResetTool-2.2.3-py2.7.egg/Products/PasswordResetTool/PasswordResetTool.py", line 24, in <module>
    from Products.CMFPlone.interfaces import ISecuritySchema
  File "/home/jenkins/workspace/plone-5.0-python-2.7/src/Products.CMFPlone/Products/CMFPlone/__init__.py", line 228, in <module>
    from Products.CMFPlone import earlypatches  # noqa
  File "/home/jenkins/workspace/plone-5.0-python-2.7/src/Products.CMFPlone/Products/CMFPlone/earlypatches/__init__.py", line 2, in <module>
    import security  # noqa
  File "/home/jenkins/workspace/plone-5.0-python-2.7/src/Products.CMFPlone/Products/CMFPlone/earlypatches/security.py", line 86, in <module>
    exec code in utils.getToolByName.func_globals
  File "<string>", line 5, in <module>
  File "/home/jenkins/workspace/plone-5.0-python-2.7/src/Products.ATContentTypes/Products/ATContentTypes/__init__.py", line 33, in <module>
    import Products.ATContentTypes.content  # noqa
  File "/home/jenkins/workspace/plone-5.0-python-2.7/src/Products.ATContentTypes/Products/ATContentTypes/content/__init__.py", line 2, in <module>
    import Products.ATContentTypes.content.link  # noqa
  File "/home/jenkins/workspace/plone-5.0-python-2.7/src/Products.ATContentTypes/Products/ATContentTypes/content/link.py", line 3, in <module>
    from Products.Archetypes.atapi import Schema
  File "/home/jenkins/workspace/plone-5.0-python-2.7/src/Products.Archetypes/Products/Archetypes/atapi.py", line 32, in <module>
    from Products.Archetypes.BaseObject import BaseObject
  File "/home/jenkins/workspace/plone-5.0-python-2.7/src/Products.Archetypes/Products/Archetypes/BaseObject.py", line 114, in <module>
    class BaseObject(Referenceable):
  File "/home/jenkins/workspace/plone-5.0-python-2.7/src/Products.Archetypes/Products/Archetypes/BaseObject.py", line 133, in BaseObject
    implements(IBaseObject, IReferenceable)


FAILED:  plone.app.folder.tests.test_migration.Startup

Error Message:
name 'implements' is not defined

Stack Trace:
name 'implements' is not defined

  File "/home/jenkins/.buildout/eggs/plone.app.folder-1.2.3-py2.7.egg/plone/app/folder/tests/test_migration.py", line 4, in <module>
    from Products.ATContentTypes.content.document import ATDocument
  File "/home/jenkins/workspace/plone-5.0-python-2.7/src/Products.ATContentTypes/Products/ATContentTypes/__init__.py", line 33, in <module>
    import Products.ATContentTypes.content  # noqa
  File "/home/jenkins/workspace/plone-5.0-python-2.7/src/Products.ATContentTypes/Products/ATContentTypes/content/__init__.py", line 2, in <module>
    import Products.ATContentTypes.content.link  # noqa
  File "/home/jenkins/workspace/plone-5.0-python-2.7/src/Products.ATContentTypes/Products/ATContentTypes/content/link.py", line 3, in <module>
    from Products.Archetypes.atapi import Schema
  File "/home/jenkins/workspace/plone-5.0-python-2.7/src/Products.Archetypes/Products/Archetypes/atapi.py", line 32, in <module>
    from Products.Archetypes.BaseObject import BaseObject
  File "/home/jenkins/workspace/plone-5.0-python-2.7/src/Products.Archetypes/Products/Archetypes/BaseObject.py", line 114, in <module>
    class BaseObject(Referenceable):
  File "/home/jenkins/workspace/plone-5.0-python-2.7/src/Products.Archetypes/Products/Archetypes/BaseObject.py", line 133, in BaseObject
    implements(IBaseObject, IReferenceable)


FAILED:  plone.app.folder.tests.test_nextprevious.Startup

Error Message:
name 'implements' is not defined

Stack Trace:
name 'implements' is not defined

  File "/home/jenkins/.buildout/eggs/plone.app.folder-1.2.3-py2.7.egg/plone/app/folder/tests/test_nextprevious.py", line 3, in <module>
    from plone.app.folder.tests.base import IntegrationTestCase
  File "/home/jenkins/.buildout/eggs/plone.app.folder-1.2.3-py2.7.egg/plone/app/folder/tests/base.py", line 2, in <module>
    from plone.app.testing.bbb import PloneTestCase
  File "/home/jenkins/.buildout/eggs/plone.app.testing-5.0.6-py2.7.egg/plone/app/testing/__init__.py", line 4, in <module>
    from plone.app.testing.helpers import applyProfile
  File "/home/jenkins/.buildout/eggs/plone.app.testing-5.0.6-py2.7.egg/plone/app/testing/helpers.py", line 5, in <module>
    from plone.app.testing import layers
  File "/home/jenkins/.buildout/eggs/plone.app.testing-5.0.6-py2.7.egg/plone/app/testing/layers.py", line 27, in <module>
    class PloneFixture(Layer):
  File "/home/jenkins/.buildout/eggs/plone.app.testing-5.0.6-py2.7.egg/plone/app/testing/layers.py", line 81, in PloneFixture
    import Products.PasswordResetTool  # noqa
  File "/home/jenkins/.buildout/eggs/Products.PasswordResetTool-2.2.3-py2.7.egg/Products/PasswordResetTool/__init__.py", line 4, in <module>
    import PasswordResetTool
  File "/home/jenkins/.buildout/eggs/Products.PasswordResetTool-2.2.3-py2.7.egg/Products/PasswordResetTool/PasswordResetTool.py", line 24, in <module>
    from Products.CMFPlone.interfaces import ISecuritySchema
  File "/home/jenkins/workspace/plone-5.0-python-2.7/src/Products.CMFPlone/Products/CMFPlone/__init__.py", line 228, in <module>
    from Products.CMFPlone import earlypatches  # noqa
  File "/home/jenkins/workspace/plone-5.0-python-2.7/src/Products.CMFPlone/Products/CMFPlone/earlypatches/__init__.py", line 2, in <module>
    import security  # noqa
  File "/home/jenkins/workspace/plone-5.0-python-2.7/src/Products.CMFPlone/Products/CMFPlone/earlypatches/security.py", line 86, in <module>
    exec code in utils.getToolByName.func_globals
  File "<string>", line 5, in <module>
  File "/home/jenkins/workspace/plone-5.0-python-2.7/src/Products.ATContentTypes/Products/ATContentTypes/__init__.py", line 33, in <module>
    import Products.ATContentTypes.content  # noqa
  File "/home/jenkins/workspace/plone-5.0-python-2.7/src/Products.ATContentTypes/Products/ATContentTypes/content/__init__.py", line 2, in <module>
    import Products.ATContentTypes.content.link  # noqa
  File "/home/jenkins/workspace/plone-5.0-python-2.7/src/Products.ATContentTypes/Products/ATContentTypes/content/link.py", line 3, in <module>
    from Products.Archetypes.atapi import Schema
  File "/home/jenkins/workspace/plone-5.0-python-2.7/src/Products.Archetypes/Products/Archetypes/atapi.py", line 32, in <module>
    from Products.Archetypes.BaseObject import BaseObject
  File "/home/jenkins/workspace/plone-5.0-python-2.7/src/Products.Archetypes/Products/Archetypes/BaseObject.py", line 114, in <module>
    class BaseObject(Referenceable):
  File "/home/jenkins/workspace/plone-5.0-python-2.7/src/Products.Archetypes/Products/Archetypes/BaseObject.py", line 133, in BaseObject
    implements(IBaseObject, IReferenceable)


FAILED:  plone.app.folder.tests.test_nogopip.Startup

Error Message:
name 'implements' is not defined

Stack Trace:
name 'implements' is not defined

  File "/home/jenkins/.buildout/eggs/plone.app.folder-1.2.3-py2.7.egg/plone/app/folder/tests/test_nogopip.py", line 1, in <module>
    from plone.app.folder.tests.base import IntegrationTestCase
  File "/home/jenkins/.buildout/eggs/plone.app.folder-1.2.3-py2.7.egg/plone/app/folder/tests/base.py", line 2, in <module>
    from plone.app.testing.bbb import PloneTestCase
  File "/home/jenkins/.buildout/eggs/plone.app.testing-5.0.6-py2.7.egg/plone/app/testing/__init__.py", line 4, in <module>
    from plone.app.testing.helpers import applyProfile
  File "/home/jenkins/.buildout/eggs/plone.app.testing-5.0.6-py2.7.egg/plone/app/testing/helpers.py", line 5, in <module>
    from plone.app.testing import layers
  File "/home/jenkins/.buildout/eggs/plone.app.testing-5.0.6-py2.7.egg/plone/app/testing/layers.py", line 27, in <module>
    class PloneFixture(Layer):
  File "/home/jenkins/.buildout/eggs/plone.app.testing-5.0.6-py2.7.egg/plone/app/testing/layers.py", line 81, in PloneFixture
    import Products.PasswordResetTool  # noqa
  File "/home/jenkins/.buildout/eggs/Products.PasswordResetTool-2.2.3-py2.7.egg/Products/PasswordResetTool/__init__.py", line 4, in <module>
    import PasswordResetTool
  File "/home/jenkins/.buildout/eggs/Products.PasswordResetTool-2.2.3-py2.7.egg/Products/PasswordResetTool/PasswordResetTool.py", line 24, in <module>
    from Products.CMFPlone.interfaces import ISecuritySchema
  File "/home/jenkins/workspace/plone-5.0-python-2.7/src/Products.CMFPlone/Products/CMFPlone/__init__.py", line 228, in <module>
    from Products.CMFPlone import earlypatches  # noqa
  File "/home/jenkins/workspace/plone-5.0-python-2.7/src/Products.CMFPlone/Products/CMFPlone/earlypatches/__init__.py", line 2, in <module>
    import security  # noqa
  File "/home/jenkins/workspace/plone-5.0-python-2.7/src/Products.CMFPlone/Products/CMFPlone/earlypatches/security.py", line 86, in <module>
    exec code in utils.getToolByName.func_globals
  File "<string>", line 5, in <module>
  File "/home/jenkins/workspace/plone-5.0-python-2.7/src/Products.ATContentTypes/Products/ATContentTypes/__init__.py", line 33, in <module>
    import Products.ATContentTypes.content  # noqa
  File "/home/jenkins/workspace/plone-5.0-python-2.7/src/Products.ATContentTypes/Products/ATContentTypes/content/__init__.py", line 2, in <module>
    import Products.ATContentTypes.content.link  # noqa
  File "/home/jenkins/workspace/plone-5.0-python-2.7/src/Products.ATContentTypes/Products/ATContentTypes/content/link.py", line 3, in <module>
    from Products.Archetypes.atapi import Schema
  File "/home/jenkins/workspace/plone-5.0-python-2.7/src/Products.Archetypes/Products/Archetypes/atapi.py", line 32, in <module>
    from Products.Archetypes.BaseObject import BaseObject
  File "/home/jenkins/workspace/plone-5.0-python-2.7/src/Products.Archetypes/Products/Archetypes/BaseObject.py", line 114, in <module>
    class BaseObject(Referenceable):
  File "/home/jenkins/workspace/plone-5.0-python-2.7/src/Products.Archetypes/Products/Archetypes/BaseObject.py", line 133, in BaseObject
    implements(IBaseObject, IReferenceable)


FAILED:  plone.app.folder.tests.test_partialordering_integration.Startup

Error Message:
name 'implements' is not defined

Stack Trace:
name 'implements' is not defined

  File "/home/jenkins/.buildout/eggs/plone.app.folder-1.2.3-py2.7.egg/plone/app/folder/tests/test_partialordering_integration.py", line 2, in <module>
    from Products.ATContentTypes.content.document import ATDocument
  File "/home/jenkins/workspace/plone-5.0-python-2.7/src/Products.ATContentTypes/Products/ATContentTypes/__init__.py", line 33, in <module>
    import Products.ATContentTypes.content  # noqa
  File "/home/jenkins/workspace/plone-5.0-python-2.7/src/Products.ATContentTypes/Products/ATContentTypes/content/__init__.py", line 2, in <module>
    import Products.ATContentTypes.content.link  # noqa
  File "/home/jenkins/workspace/plone-5.0-python-2.7/src/Products.ATContentTypes/Products/ATContentTypes/content/link.py", line 3, in <module>
    from Products.Archetypes.atapi import Schema
  File "/home/jenkins/workspace/plone-5.0-python-2.7/src/Products.Archetypes/Products/Archetypes/atapi.py", line 32, in <module>
    from Products.Archetypes.BaseObject import BaseObject
  File "/home/jenkins/workspace/plone-5.0-python-2.7/src/Products.Archetypes/Products/Archetypes/BaseObject.py", line 114, in <module>
    class BaseObject(Referenceable):
  File "/home/jenkins/workspace/plone-5.0-python-2.7/src/Products.Archetypes/Products/Archetypes/BaseObject.py", line 133, in BaseObject
    implements(IBaseObject, IReferenceable)


FAILED:  plone.app.folder.tests.test_unorderedordering_integration.Startup

Error Message:
name 'implements' is not defined

Stack Trace:
name 'implements' is not defined

  File "/home/jenkins/.buildout/eggs/plone.app.folder-1.2.3-py2.7.egg/plone/app/folder/tests/test_unorderedordering_integration.py", line 2, in <module>
    from plone.app.folder.tests.base import IntegrationTestCase
  File "/home/jenkins/.buildout/eggs/plone.app.folder-1.2.3-py2.7.egg/plone/app/folder/tests/base.py", line 2, in <module>
    from plone.app.testing.bbb import PloneTestCase
  File "/home/jenkins/.buildout/eggs/plone.app.testing-5.0.6-py2.7.egg/plone/app/testing/__init__.py", line 4, in <module>
    from plone.app.testing.helpers import applyProfile
  File "/home/jenkins/.buildout/eggs/plone.app.testing-5.0.6-py2.7.egg/plone/app/testing/helpers.py", line 5, in <module>
    from plone.app.testing import layers
  File "/home/jenkins/.buildout/eggs/plone.app.testing-5.0.6-py2.7.egg/plone/app/testing/layers.py", line 27, in <module>
    class PloneFixture(Layer):
  File "/home/jenkins/.buildout/eggs/plone.app.testing-5.0.6-py2.7.egg/plone/app/testing/layers.py", line 81, in PloneFixture
    import Products.PasswordResetTool  # noqa
  File "/home/jenkins/.buildout/eggs/Products.PasswordResetTool-2.2.3-py2.7.egg/Products/PasswordResetTool/__init__.py", line 4, in <module>
    import PasswordResetTool
  File "/home/jenkins/.buildout/eggs/Products.PasswordResetTool-2.2.3-py2.7.egg/Products/PasswordResetTool/PasswordResetTool.py", line 24, in <module>
    from Products.CMFPlone.interfaces import ISecuritySchema
  File "/home/jenkins/workspace/plone-5.0-python-2.7/src/Products.CMFPlone/Products/CMFPlone/__init__.py", line 228, in <module>
    from Products.CMFPlone import earlypatches  # noqa
  File "/home/jenkins/workspace/plone-5.0-python-2.7/src/Products.CMFPlone/Products/CMFPlone/earlypatches/__init__.py", line 2, in <module>
    import security  # noqa
  File "/home/jenkins/workspace/plone-5.0-python-2.7/src/Products.CMFPlone/Products/CMFPlone/earlypatches/security.py", line 86, in <module>
    exec code in utils.getToolByName.func_globals
  File "<string>", line 5, in <module>
  File "/home/jenkins/workspace/plone-5.0-python-2.7/src/Products.ATContentTypes/Products/ATContentTypes/__init__.py", line 33, in <module>
    import Products.ATContentTypes.content  # noqa
  File "/home/jenkins/workspace/plone-5.0-python-2.7/src/Products.ATContentTypes/Products/ATContentTypes/content/__init__.py", line 2, in <module>
    import Products.ATContentTypes.content.link  # noqa
  File "/home/jenkins/workspace/plone-5.0-python-2.7/src/Products.ATContentTypes/Products/ATContentTypes/content/link.py", line 3, in <module>
    from Products.Archetypes.atapi import Schema
  File "/home/jenkins/workspace/plone-5.0-python-2.7/src/Products.Archetypes/Products/Archetypes/atapi.py", line 32, in <module>
    from Products.Archetypes.BaseObject import BaseObject
  File "/home/jenkins/workspace/plone-5.0-python-2.7/src/Products.Archetypes/Products/Archetypes/BaseObject.py", line 114, in <module>
    class BaseObject(Referenceable):
  File "/home/jenkins/workspace/plone-5.0-python-2.7/src/Products.Archetypes/Products/Archetypes/BaseObject.py", line 133, in BaseObject
    implements(IBaseObject, IReferenceable)


FAILED:  plone.app.lockingbehavior.tests.test_locking.Startup

Error Message:
name 'implements' is not defined

Stack Trace:
name 'implements' is not defined

  File "/home/jenkins/.buildout/eggs/plone.app.lockingbehavior-1.0.5-py2.7.egg/plone/app/lockingbehavior/tests/test_locking.py", line 3, in <module>
    from plone.app.lockingbehavior.testing import LOCKING_FUNCTIONAL_TESTING
  File "/home/jenkins/.buildout/eggs/plone.app.lockingbehavior-1.0.5-py2.7.egg/plone/app/lockingbehavior/testing.py", line 2, in <module>
    from plone.app.testing import PloneSandboxLayer
  File "/home/jenkins/.buildout/eggs/plone.app.testing-5.0.6-py2.7.egg/plone/app/testing/__init__.py", line 4, in <module>
    from plone.app.testing.helpers import applyProfile
  File "/home/jenkins/.buildout/eggs/plone.app.testing-5.0.6-py2.7.egg/plone/app/testing/helpers.py", line 5, in <module>
    from plone.app.testing import layers
  File "/home/jenkins/.buildout/eggs/plone.app.testing-5.0.6-py2.7.egg/plone/app/testing/layers.py", line 27, in <module>
    class PloneFixture(Layer):
  File "/home/jenkins/.buildout/eggs/plone.app.testing-5.0.6-py2.7.egg/plone/app/testing/layers.py", line 81, in PloneFixture
    import Products.PasswordResetTool  # noqa
  File "/home/jenkins/.buildout/eggs/Products.PasswordResetTool-2.2.3-py2.7.egg/Products/PasswordResetTool/__init__.py", line 4, in <module>
    import PasswordResetTool
  File "/home/jenkins/.buildout/eggs/Products.PasswordResetTool-2.2.3-py2.7.egg/Products/PasswordResetTool/PasswordResetTool.py", line 24, in <module>
    from Products.CMFPlone.interfaces import ISecuritySchema
  File "/home/jenkins/workspace/plone-5.0-python-2.7/src/Products.CMFPlone/Products/CMFPlone/__init__.py", line 228, in <module>
    from Products.CMFPlone import earlypatches  # noqa
  File "/home/jenkins/workspace/plone-5.0-python-2.7/src/Products.CMFPlone/Products/CMFPlone/earlypatches/__init__.py", line 2, in <module>
    import security  # noqa
  File "/home/jenkins/workspace/plone-5.0-python-2.7/src/Products.CMFPlone/Products/CMFPlone/earlypatches/security.py", line 86, in <module>
    exec code in utils.getToolByName.func_globals
  File "<string>", line 5, in <module>
  File "/home/jenkins/workspace/plone-5.0-python-2.7/src/Products.ATContentTypes/Products/ATContentTypes/__init__.py", line 33, in <module>
    import Products.ATContentTypes.content  # noqa
  File "/home/jenkins/workspace/plone-5.0-python-2.7/src/Products.ATContentTypes/Products/ATContentTypes/content/__init__.py", line 2, in <module>
    import Products.ATContentTypes.content.link  # noqa
  File "/home/jenkins/workspace/plone-5.0-python-2.7/src/Products.ATContentTypes/Products/ATContentTypes/content/link.py", line 3, in <module>
    from Products.Archetypes.atapi import Schema
  File "/home/jenkins/workspace/plone-5.0-python-2.7/src/Products.Archetypes/Products/Archetypes/atapi.py", line 32, in <module>
    from Products.Archetypes.BaseObject import BaseObject
  File "/home/jenkins/workspace/plone-5.0-python-2.7/src/Products.Archetypes/Products/Archetypes/BaseObject.py", line 114, in <module>
    class BaseObject(Referenceable):
  File "/home/jenkins/workspace/plone-5.0-python-2.7/src/Products.Archetypes/Products/Archetypes/BaseObject.py", line 133, in BaseObject
    implements(IBaseObject, IReferenceable)


FAILED:  plone.app.multilingual.tests.test_alternates.Startup

Error Message:
name 'implements' is not defined

Stack Trace:
name 'implements' is not defined

  File "/home/jenkins/workspace/plone-5.0-python-2.7/src/plone.app.multilingual/src/plone/app/multilingual/tests/test_alternates.py", line 2, in <module>
    from plone.app.multilingual import api
  File "/home/jenkins/workspace/plone-5.0-python-2.7/src/plone.app.multilingual/src/plone/app/multilingual/api.py", line 2, in <module>
    from plone.app.multilingual.interfaces import ITG
  File "/home/jenkins/workspace/plone-5.0-python-2.7/src/plone.app.multilingual/src/plone/app/multilingual/interfaces.py", line 8, in <module>
    from Products.CMFPlone.interfaces import ILanguageSchema
  File "/home/jenkins/workspace/plone-5.0-python-2.7/src/Products.CMFPlone/Products/CMFPlone/__init__.py", line 228, in <module>
    from Products.CMFPlone import earlypatches  # noqa
  File "/home/jenkins/workspace/plone-5.0-python-2.7/src/Products.CMFPlone/Products/CMFPlone/earlypatches/__init__.py", line 2, in <module>
    import security  # noqa
  File "/home/jenkins/workspace/plone-5.0-python-2.7/src/Products.CMFPlone/Products/CMFPlone/earlypatches/security.py", line 86, in <module>
    exec code in utils.getToolByName.func_globals
  File "<string>", line 5, in <module>
  File "/home/jenkins/workspace/plone-5.0-python-2.7/src/Products.ATContentTypes/Products/ATContentTypes/__init__.py", line 33, in <module>
    import Products.ATContentTypes.content  # noqa
  File "/home/jenkins/workspace/plone-5.0-python-2.7/src/Products.ATContentTypes/Products/ATContentTypes/content/__init__.py", line 2, in <module>
    import Products.ATContentTypes.content.link  # noqa
  File "/home/jenkins/workspace/plone-5.0-python-2.7/src/Products.ATContentTypes/Products/ATContentTypes/content/link.py", line 3, in <module>
    from Products.Archetypes.atapi import Schema
  File "/home/jenkins/workspace/plone-5.0-python-2.7/src/Products.Archetypes/Products/Archetypes/atapi.py", line 32, in <module>
    from Products.Archetypes.BaseObject import BaseObject
  File "/home/jenkins/workspace/plone-5.0-python-2.7/src/Products.Archetypes/Products/Archetypes/BaseObject.py", line 114, in <module>
    class BaseObject(Referenceable):
  File "/home/jenkins/workspace/plone-5.0-python-2.7/src/Products.Archetypes/Products/Archetypes/BaseObject.py", line 133, in BaseObject
    implements(IBaseObject, IReferenceable)


FAILED:  plone.app.multilingual.tests.test_api.Startup

Error Message:
name 'implements' is not defined

Stack Trace:
name 'implements' is not defined

  File "/home/jenkins/workspace/plone-5.0-python-2.7/src/plone.app.multilingual/src/plone/app/multilingual/tests/test_api.py", line 4, in <module>
    from plone.app.multilingual import api
  File "/home/jenkins/workspace/plone-5.0-python-2.7/src/plone.app.multilingual/src/plone/app/multilingual/api.py", line 2, in <module>
    from plone.app.multilingual.interfaces import ITG
  File "/home/jenkins/workspace/plone-5.0-python-2.7/src/plone.app.multilingual/src/plone/app/multilingual/interfaces.py", line 8, in <module>
    from Products.CMFPlone.interfaces import ILanguageSchema
  File "/home/jenkins/workspace/plone-5.0-python-2.7/src/Products.CMFPlone/Products/CMFPlone/__init__.py", line 228, in <module>
    from Products.CMFPlone import earlypatches  # noqa
  File "/home/jenkins/workspace/plone-5.0-python-2.7/src/Products.CMFPlone/Products/CMFPlone/earlypatches/__init__.py", line 2, in <module>
    import security  # noqa
  File "/home/jenkins/workspace/plone-5.0-python-2.7/src/Products.CMFPlone/Products/CMFPlone/earlypatches/security.py", line 86, in <module>
    exec code in utils.getToolByName.func_globals
  File "<string>", line 5, in <module>
  File "/home/jenkins/workspace/plone-5.0-python-2.7/src/Products.ATContentTypes/Products/ATContentTypes/__init__.py", line 33, in <module>
    import Products.ATContentTypes.content  # noqa
  File "/home/jenkins/workspace/plone-5.0-python-2.7/src/Products.ATContentTypes/Products/ATContentTypes/content/__init__.py", line 2, in <module>
    import Products.ATContentTypes.content.link  # noqa
  File "/home/jenkins/workspace/plone-5.0-python-2.7/src/Products.ATContentTypes/Products/ATContentTypes/content/link.py", line 3, in <module>
    from Products.Archetypes.atapi import Schema
  File "/home/jenkins/workspace/plone-5.0-python-2.7/src/Products.Archetypes/Products/Archetypes/atapi.py", line 32, in <module>
    from Products.Archetypes.BaseObject import BaseObject
  File "/home/jenkins/workspace/plone-5.0-python-2.7/src/Products.Archetypes/Products/Archetypes/BaseObject.py", line 114, in <module>
    class BaseObject(Referenceable):
  File "/home/jenkins/workspace/plone-5.0-python-2.7/src/Products.Archetypes/Products/Archetypes/BaseObject.py", line 133, in BaseObject
    implements(IBaseObject, IReferenceable)


FAILED:  plone.app.multilingual.tests.test_catalog.Startup

Error Message:
name 'implements' is not defined

Stack Trace:
name 'implements' is not defined

  File "/home/jenkins/workspace/plone-5.0-python-2.7/src/plone.app.multilingual/src/plone/app/multilingual/tests/test_catalog.py", line 3, in <module>
    from plone.app.multilingual.interfaces import LANGUAGE_INDEPENDENT
  File "/home/jenkins/workspace/plone-5.0-python-2.7/src/plone.app.multilingual/src/plone/app/multilingual/interfaces.py", line 8, in <module>
    from Products.CMFPlone.interfaces import ILanguageSchema
  File "/home/jenkins/workspace/plone-5.0-python-2.7/src/Products.CMFPlone/Products/CMFPlone/__init__.py", line 228, in <module>
    from Products.CMFPlone import earlypatches  # noqa
  File "/home/jenkins/workspace/plone-5.0-python-2.7/src/Products.CMFPlone/Products/CMFPlone/earlypatches/__init__.py", line 2, in <module>
    import security  # noqa
  File "/home/jenkins/workspace/plone-5.0-python-2.7/src/Products.CMFPlone/Products/CMFPlone/earlypatches/security.py", line 86, in <module>
    exec code in utils.getToolByName.func_globals
  File "<string>", line 5, in <module>
  File "/home/jenkins/workspace/plone-5.0-python-2.7/src/Products.ATContentTypes/Products/ATContentTypes/__init__.py", line 33, in <module>
    import Products.ATContentTypes.content  # noqa
  File "/home/jenkins/workspace/plone-5.0-python-2.7/src/Products.ATContentTypes/Products/ATContentTypes/content/__init__.py", line 2, in <module>
    import Products.ATContentTypes.content.link  # noqa
  File "/home/jenkins/workspace/plone-5.0-python-2.7/src/Products.ATContentTypes/Products/ATContentTypes/content/link.py", line 3, in <module>
    from Products.Archetypes.atapi import Schema
  File "/home/jenkins/workspace/plone-5.0-python-2.7/src/Products.Archetypes/Products/Archetypes/atapi.py", line 32, in <module>
    from Products.Archetypes.BaseObject import BaseObject
  File "/home/jenkins/workspace/plone-5.0-python-2.7/src/Products.Archetypes/Products/Archetypes/BaseObject.py", line 114, in <module>
    class BaseObject(Referenceable):
  File "/home/jenkins/workspace/plone-5.0-python-2.7/src/Products.Archetypes/Products/Archetypes/BaseObject.py", line 133, in BaseObject
    implements(IBaseObject, IReferenceable)


FAILED:  plone.app.multilingual.tests.test_directives.Startup

Error Message:
name 'implements' is not defined

Stack Trace:
name 'implements' is not defined

  File "/home/jenkins/workspace/plone-5.0-python-2.7/src/plone.app.multilingual/src/plone/app/multilingual/tests/test_directives.py", line 2, in <module>
    from plone.app.multilingual.dx.directives import languageindependent
  File "/home/jenkins/workspace/plone-5.0-python-2.7/src/plone.app.multilingual/src/plone/app/multilingual/dx/directives.py", line 2, in <module>
    from plone.app.multilingual.dx.interfaces import ILanguageIndependentField
  File "/home/jenkins/workspace/plone-5.0-python-2.7/src/plone.app.multilingual/src/plone/app/multilingual/dx/interfaces.py", line 2, in <module>
    from plone.app.multilingual.interfaces import ITranslatable
  File "/home/jenkins/workspace/plone-5.0-python-2.7/src/plone.app.multilingual/src/plone/app/multilingual/interfaces.py", line 8, in <module>
    from Products.CMFPlone.interfaces import ILanguageSchema
  File "/home/jenkins/workspace/plone-5.0-python-2.7/src/Products.CMFPlone/Products/CMFPlone/__init__.py", line 228, in <module>
    from Products.CMFPlone import earlypatches  # noqa
  File "/home/jenkins/workspace/plone-5.0-python-2.7/src/Products.CMFPlone/Products/CMFPlone/earlypatches/__init__.py", line 2, in <module>
    import security  # noqa
  File "/home/jenkins/workspace/plone-5.0-python-2.7/src/Products.CMFPlone/Products/CMFPlone/earlypatches/security.py", line 86, in <module>
    exec code in utils.getToolByName.func_globals
  File "<string>", line 5, in <module>
  File "/home/jenkins/workspace/plone-5.0-python-2.7/src/Products.ATContentTypes/Products/ATContentTypes/__init__.py", line 33, in <module>
    import Products.ATContentTypes.content  # noqa
  File "/home/jenkins/workspace/plone-5.0-python-2.7/src/Products.ATContentTypes/Products/ATContentTypes/content/__init__.py", line 2, in <module>
    import Products.ATContentTypes.content.link  # noqa
  File "/home/jenkins/workspace/plone-5.0-python-2.7/src/Products.ATContentTypes/Products/ATContentTypes/content/link.py", line 3, in <module>
    from Products.Archetypes.atapi import Schema
  File "/home/jenkins/workspace/plone-5.0-python-2.7/src/Products.Archetypes/Products/Archetypes/atapi.py", line 32, in <module>
    from Products.Archetypes.BaseObject import BaseObject
  File "/home/jenkins/workspace/plone-5.0-python-2.7/src/Products.Archetypes/Products/Archetypes/BaseObject.py", line 114, in <module>
    class BaseObject(Referenceable):
  File "/home/jenkins/workspace/plone-5.0-python-2.7/src/Products.Archetypes/Products/Archetypes/BaseObject.py", line 133, in BaseObject
    implements(IBaseObject, IReferenceable)


FAILED:  plone.app.multilingual.tests.test_form.Startup

Error Message:
name 'implements' is not defined

Stack Trace:
name 'implements' is not defined

  File "/home/jenkins/workspace/plone-5.0-python-2.7/src/plone.app.multilingual/src/plone/app/multilingual/tests/test_form.py", line 2, in <module>
    from plone.app.multilingual.testing import PAM_FUNCTIONAL_TESTING
  File "/home/jenkins/workspace/plone-5.0-python-2.7/src/plone.app.multilingual/src/plone/app/multilingual/testing.py", line 4, in <module>
    from plone.app.contenttypes.testing import PLONE_APP_CONTENTTYPES_FIXTURE
  File "/home/jenkins/workspace/plone-5.0-python-2.7/src/plone.app.contenttypes/plone/app/contenttypes/testing.py", line 4, in <module>
    from plone.app.event.testing import PAEvent_FIXTURE
  File "/home/jenkins/.buildout/eggs/plone.app.event-2.0.13-py2.7.egg/plone/app/event/testing.py", line 1, in <module>
    from Products.CMFPlone.utils import getFSVersionTuple
  File "/home/jenkins/workspace/plone-5.0-python-2.7/src/Products.CMFPlone/Products/CMFPlone/__init__.py", line 228, in <module>
    from Products.CMFPlone import earlypatches  # noqa
  File "/home/jenkins/workspace/plone-5.0-python-2.7/src/Products.CMFPlone/Products/CMFPlone/earlypatches/__init__.py", line 2, in <module>
    import security  # noqa
  File "/home/jenkins/workspace/plone-5.0-python-2.7/src/Products.CMFPlone/Products/CMFPlone/earlypatches/security.py", line 86, in <module>
    exec code in utils.getToolByName.func_globals
  File "<string>", line 5, in <module>
  File "/home/jenkins/workspace/plone-5.0-python-2.7/src/Products.ATContentTypes/Products/ATContentTypes/__init__.py", line 33, in <module>
    import Products.ATContentTypes.content  # noqa
  File "/home/jenkins/workspace/plone-5.0-python-2.7/src/Products.ATContentTypes/Products/ATContentTypes/content/__init__.py", line 2, in <module>
    import Products.ATContentTypes.content.link  # noqa
  File "/home/jenkins/workspace/plone-5.0-python-2.7/src/Products.ATContentTypes/Products/ATContentTypes/content/link.py", line 3, in <module>
    from Products.Archetypes.atapi import Schema
  File "/home/jenkins/workspace/plone-5.0-python-2.7/src/Products.Archetypes/Products/Archetypes/atapi.py", line 32, in <module>
    from Products.Archetypes.BaseObject import BaseObject
  File "/home/jenkins/workspace/plone-5.0-python-2.7/src/Products.Archetypes/Products/Archetypes/BaseObject.py", line 114, in <module>
    class BaseObject(Referenceable):
  File "/home/jenkins/workspace/plone-5.0-python-2.7/src/Products.Archetypes/Products/Archetypes/BaseObject.py", line 133, in BaseObject
    implements(IBaseObject, IReferenceable)


FAILED:  plone.app.multilingual.tests.test_helper_views.Startup

Error Message:
name 'implements' is not defined

Stack Trace:
name 'implements' is not defined

  File "/home/jenkins/workspace/plone-5.0-python-2.7/src/plone.app.multilingual/src/plone/app/multilingual/tests/test_helper_views.py", line 2, in <module>
    from plone.app.multilingual import api
  File "/home/jenkins/workspace/plone-5.0-python-2.7/src/plone.app.multilingual/src/plone/app/multilingual/api.py", line 2, in <module>
    from plone.app.multilingual.interfaces import ITG
  File "/home/jenkins/workspace/plone-5.0-python-2.7/src/plone.app.multilingual/src/plone/app/multilingual/interfaces.py", line 8, in <module>
    from Products.CMFPlone.interfaces import ILanguageSchema
  File "/home/jenkins/workspace/plone-5.0-python-2.7/src/Products.CMFPlone/Products/CMFPlone/__init__.py", line 228, in <module>
    from Products.CMFPlone import earlypatches  # noqa
  File "/home/jenkins/workspace/plone-5.0-python-2.7/src/Products.CMFPlone/Products/CMFPlone/earlypatches/__init__.py", line 2, in <module>
    import security  # noqa
  File "/home/jenkins/workspace/plone-5.0-python-2.7/src/Products.CMFPlone/Products/CMFPlone/earlypatches/security.py", line 86, in <module>
    exec code in utils.getToolByName.func_globals
  File "<string>", line 5, in <module>
  File "/home/jenkins/workspace/plone-5.0-python-2.7/src/Products.ATContentTypes/Products/ATContentTypes/__init__.py", line 33, in <module>
    import Products.ATContentTypes.content  # noqa
  File "/home/jenkins/workspace/plone-5.0-python-2.7/src/Products.ATContentTypes/Products/ATContentTypes/content/__init__.py", line 2, in <module>
    import Products.ATContentTypes.content.link  # noqa
  File "/home/jenkins/workspace/plone-5.0-python-2.7/src/Products.ATContentTypes/Products/ATContentTypes/content/link.py", line 3, in <module>
    from Products.Archetypes.atapi import Schema
  File "/home/jenkins/workspace/plone-5.0-python-2.7/src/Products.Archetypes/Products/Archetypes/atapi.py", line 32, in <module>
    from Products.Archetypes.BaseObject import BaseObject
  File "/home/jenkins/workspace/plone-5.0-python-2.7/src/Products.Archetypes/Products/Archetypes/BaseObject.py", line 114, in <module>
    class BaseObject(Referenceable):
  File "/home/jenkins/workspace/plone-5.0-python-2.7/src/Products.Archetypes/Products/Archetypes/BaseObject.py", line 133, in BaseObject
    implements(IBaseObject, IReferenceable)


FAILED:  plone.app.multilingual.tests.test_lif.Startup

Error Message:
name 'implements' is not defined

Stack Trace:
name 'implements' is not defined

  File "/home/jenkins/workspace/plone-5.0-python-2.7/src/plone.app.multilingual/src/plone/app/multilingual/tests/test_lif.py", line 3, in <module>
    from plone.app.multilingual import api
  File "/home/jenkins/workspace/plone-5.0-python-2.7/src/plone.app.multilingual/src/plone/app/multilingual/api.py", line 2, in <module>
    from plone.app.multilingual.interfaces import ITG
  File "/home/jenkins/workspace/plone-5.0-python-2.7/src/plone.app.multilingual/src/plone/app/multilingual/interfaces.py", line 8, in <module>
    from Products.CMFPlone.interfaces import ILanguageSchema
  File "/home/jenkins/workspace/plone-5.0-python-2.7/src/Products.CMFPlone/Products/CMFPlone/__init__.py", line 228, in <module>
    from Products.CMFPlone import earlypatches  # noqa
  File "/home/jenkins/workspace/plone-5.0-python-2.7/src/Products.CMFPlone/Products/CMFPlone/earlypatches/__init__.py", line 2, in <module>
    import security  # noqa
  File "/home/jenkins/workspace/plone-5.0-python-2.7/src/Products.CMFPlone/Products/CMFPlone/earlypatches/security.py", line 86, in <module>
    exec code in utils.getToolByName.func_globals
  File "<string>", line 5, in <module>
  File "/home/jenkins/workspace/plone-5.0-python-2.7/src/Products.ATContentTypes/Products/ATContentTypes/__init__.py", line 33, in <module>
    import Products.ATContentTypes.content  # noqa
  File "/home/jenkins/workspace/plone-5.0-python-2.7/src/Products.ATContentTypes/Products/ATContentTypes/content/__init__.py", line 2, in <module>
    import Products.ATContentTypes.content.link  # noqa
  File "/home/jenkins/workspace/plone-5.0-python-2.7/src/Products.ATContentTypes/Products/ATContentTypes/content/link.py", line 3, in <module>
    from Products.Archetypes.atapi import Schema
  File "/home/jenkins/workspace/plone-5.0-python-2.7/src/Products.Archetypes/Products/Archetypes/atapi.py", line 32, in <module>
    from Products.Archetypes.BaseObject import BaseObject
  File "/home/jenkins/workspace/plone-5.0-python-2.7/src/Products.Archetypes/Products/Archetypes/BaseObject.py", line 114, in <module>
    class BaseObject(Referenceable):
  File "/home/jenkins/workspace/plone-5.0-python-2.7/src/Products.Archetypes/Products/Archetypes/BaseObject.py", line 133, in BaseObject
    implements(IBaseObject, IReferenceable)


FAILED:  plone.app.multilingual.tests.test_lrf.Startup

Error Message:
name 'implements' is not defined

Stack Trace:
name 'implements' is not defined

  File "/home/jenkins/workspace/plone-5.0-python-2.7/src/plone.app.multilingual/src/plone/app/multilingual/tests/test_lrf.py", line 3, in <module>
    from plone.app.multilingual.browser.utils import is_language_independent
  File "/home/jenkins/workspace/plone-5.0-python-2.7/src/plone.app.multilingual/src/plone/app/multilingual/browser/utils.py", line 9, in <module>
    from plone.app.multilingual.browser.selector import LanguageSelectorViewlet
  File "/home/jenkins/workspace/plone-5.0-python-2.7/src/plone.app.multilingual/src/plone/app/multilingual/browser/selector.py", line 4, in <module>
    from plone.app.multilingual.interfaces import ITG
  File "/home/jenkins/workspace/plone-5.0-python-2.7/src/plone.app.multilingual/src/plone/app/multilingual/interfaces.py", line 8, in <module>
    from Products.CMFPlone.interfaces import ILanguageSchema
  File "/home/jenkins/workspace/plone-5.0-python-2.7/src/Products.CMFPlone/Products/CMFPlone/__init__.py", line 228, in <module>
    from Products.CMFPlone import earlypatches  # noqa
  File "/home/jenkins/workspace/plone-5.0-python-2.7/src/Products.CMFPlone/Products/CMFPlone/earlypatches/__init__.py", line 2, in <module>
    import security  # noqa
  File "/home/jenkins/workspace/plone-5.0-python-2.7/src/Products.CMFPlone/Products/CMFPlone/earlypatches/security.py", line 86, in <module>
    exec code in utils.getToolByName.func_globals
  File "<string>", line 5, in <module>
  File "/home/jenkins/workspace/plone-5.0-python-2.7/src/Products.ATContentTypes/Products/ATContentTypes/__init__.py", line 33, in <module>
    import Products.ATContentTypes.content  # noqa
  File "/home/jenkins/workspace/plone-5.0-python-2.7/src/Products.ATContentTypes/Products/ATContentTypes/content/__init__.py", line 2, in <module>
    import Products.ATContentTypes.content.link  # noqa
  File "/home/jenkins/workspace/plone-5.0-python-2.7/src/Products.ATContentTypes/Products/ATContentTypes/content/link.py", line 3, in <module>
    from Products.Archetypes.atapi import Schema
  File "/home/jenkins/workspace/plone-5.0-python-2.7/src/Products.Archetypes/Products/Archetypes/atapi.py", line 32, in <module>
    from Products.Archetypes.BaseObject import BaseObject
  File "/home/jenkins/workspace/plone-5.0-python-2.7/src/Products.Archetypes/Products/Archetypes/BaseObject.py", line 114, in <module>
    class BaseObject(Referenceable):
  File "/home/jenkins/workspace/plone-5.0-python-2.7/src/Products.Archetypes/Products/Archetypes/BaseObject.py", line 133, in BaseObject
    implements(IBaseObject, IReferenceable)


FAILED:  plone.app.multilingual.tests.test_menu.Startup

Error Message:
name 'implements' is not defined

Stack Trace:
name 'implements' is not defined

  File "/home/jenkins/workspace/plone-5.0-python-2.7/src/plone.app.multilingual/src/plone/app/multilingual/tests/test_menu.py", line 2, in <module>
    from plone.app.multilingual.testing import PAM_FUNCTIONAL_TESTING
  File "/home/jenkins/workspace/plone-5.0-python-2.7/src/plone.app.multilingual/src/plone/app/multilingual/testing.py", line 4, in <module>
    from plone.app.contenttypes.testing import PLONE_APP_CONTENTTYPES_FIXTURE
  File "/home/jenkins/workspace/plone-5.0-python-2.7/src/plone.app.contenttypes/plone/app/contenttypes/testing.py", line 4, in <module>
    from plone.app.event.testing import PAEvent_FIXTURE
  File "/home/jenkins/.buildout/eggs/plone.app.event-2.0.13-py2.7.egg/plone/app/event/testing.py", line 1, in <module>
    from Products.CMFPlone.utils import getFSVersionTuple
  File "/home/jenkins/workspace/plone-5.0-python-2.7/src/Products.CMFPlone/Products/CMFPlone/__init__.py", line 228, in <module>
    from Products.CMFPlone import earlypatches  # noqa
  File "/home/jenkins/workspace/plone-5.0-python-2.7/src/Products.CMFPlone/Products/CMFPlone/earlypatches/__init__.py", line 2, in <module>
    import security  # noqa
  File "/home/jenkins/workspace/plone-5.0-python-2.7/src/Products.CMFPlone/Products/CMFPlone/earlypatches/security.py", line 86, in <module>
    exec code in utils.getToolByName.func_globals
  File "<string>", line 5, in <module>
  File "/home/jenkins/workspace/plone-5.0-python-2.7/src/Products.ATContentTypes/Products/ATContentTypes/__init__.py", line 33, in <module>
    import Products.ATContentTypes.content  # noqa
  File "/home/jenkins/workspace/plone-5.0-python-2.7/src/Products.ATContentTypes/Products/ATContentTypes/content/__init__.py", line 2, in <module>
    import Products.ATContentTypes.content.link  # noqa
  File "/home/jenkins/workspace/plone-5.0-python-2.7/src/Products.ATContentTypes/Products/ATContentTypes/content/link.py", line 3, in <module>
    from Products.Archetypes.atapi import Schema
  File "/home/jenkins/workspace/plone-5.0-python-2.7/src/Products.Archetypes/Products/Archetypes/atapi.py", line 32, in <module>
    from Products.Archetypes.BaseObject import BaseObject
  File "/home/jenkins/workspace/plone-5.0-python-2.7/src/Products.Archetypes/Products/Archetypes/BaseObject.py", line 114, in <module>
    class BaseObject(Referenceable):
  File "/home/jenkins/workspace/plone-5.0-python-2.7/src/Products.Archetypes/Products/Archetypes/BaseObject.py", line 133, in BaseObject
    implements(IBaseObject, IReferenceable)


FAILED:  plone.app.multilingual.tests.test_robot.Startup

Error Message:
name 'implements' is not defined

Stack Trace:
name 'implements' is not defined

  File "/home/jenkins/workspace/plone-5.0-python-2.7/src/plone.app.multilingual/src/plone/app/multilingual/tests/test_robot.py", line 2, in <module>
    from plone.app.multilingual.testing import PAM_ROBOT_TESTING
  File "/home/jenkins/workspace/plone-5.0-python-2.7/src/plone.app.multilingual/src/plone/app/multilingual/testing.py", line 4, in <module>
    from plone.app.contenttypes.testing import PLONE_APP_CONTENTTYPES_FIXTURE
  File "/home/jenkins/workspace/plone-5.0-python-2.7/src/plone.app.contenttypes/plone/app/contenttypes/testing.py", line 4, in <module>
    from plone.app.event.testing import PAEvent_FIXTURE
  File "/home/jenkins/.buildout/eggs/plone.app.event-2.0.13-py2.7.egg/plone/app/event/testing.py", line 1, in <module>
    from Products.CMFPlone.utils import getFSVersionTuple
  File "/home/jenkins/workspace/plone-5.0-python-2.7/src/Products.CMFPlone/Products/CMFPlone/__init__.py", line 228, in <module>
    from Products.CMFPlone import earlypatches  # noqa
  File "/home/jenkins/workspace/plone-5.0-python-2.7/src/Products.CMFPlone/Products/CMFPlone/earlypatches/__init__.py", line 2, in <module>
    import security  # noqa
  File "/home/jenkins/workspace/plone-5.0-python-2.7/src/Products.CMFPlone/Products/CMFPlone/earlypatches/security.py", line 86, in <module>
    exec code in utils.getToolByName.func_globals
  File "<string>", line 5, in <module>
  File "/home/jenkins/workspace/plone-5.0-python-2.7/src/Products.ATContentTypes/Products/ATContentTypes/__init__.py", line 33, in <module>
    import Products.ATContentTypes.content  # noqa
  File "/home/jenkins/workspace/plone-5.0-python-2.7/src/Products.ATContentTypes/Products/ATContentTypes/content/__init__.py", line 2, in <module>
    import Products.ATContentTypes.content.link  # noqa
  File "/home/jenkins/workspace/plone-5.0-python-2.7/src/Products.ATContentTypes/Products/ATContentTypes/content/link.py", line 3, in <module>
    from Products.Archetypes.atapi import Schema
  File "/home/jenkins/workspace/plone-5.0-python-2.7/src/Products.Archetypes/Products/Archetypes/atapi.py", line 32, in <module>
    from Products.Archetypes.BaseObject import BaseObject
  File "/home/jenkins/workspace/plone-5.0-python-2.7/src/Products.Archetypes/Products/Archetypes/BaseObject.py", line 114, in <module>
    class BaseObject(Referenceable):
  File "/home/jenkins/workspace/plone-5.0-python-2.7/src/Products.Archetypes/Products/Archetypes/BaseObject.py", line 133, in BaseObject
    implements(IBaseObject, IReferenceable)


FAILED:  plone.app.multilingual.tests.test_selector.Startup

Error Message:
name 'implements' is not defined

Stack Trace:
name 'implements' is not defined

  File "/home/jenkins/workspace/plone-5.0-python-2.7/src/plone.app.multilingual/src/plone/app/multilingual/tests/test_selector.py", line 4, in <module>
    from plone.app.multilingual import api
  File "/home/jenkins/workspace/plone-5.0-python-2.7/src/plone.app.multilingual/src/plone/app/multilingual/api.py", line 2, in <module>
    from plone.app.multilingual.interfaces import ITG
  File "/home/jenkins/workspace/plone-5.0-python-2.7/src/plone.app.multilingual/src/plone/app/multilingual/interfaces.py", line 8, in <module>
    from Products.CMFPlone.interfaces import ILanguageSchema
  File "/home/jenkins/workspace/plone-5.0-python-2.7/src/Products.CMFPlone/Products/CMFPlone/__init__.py", line 228, in <module>
    from Products.CMFPlone import earlypatches  # noqa
  File "/home/jenkins/workspace/plone-5.0-python-2.7/src/Products.CMFPlone/Products/CMFPlone/earlypatches/__init__.py", line 2, in <module>
    import security  # noqa
  File "/home/jenkins/workspace/plone-5.0-python-2.7/src/Products.CMFPlone/Products/CMFPlone/earlypatches/security.py", line 86, in <module>
    exec code in utils.getToolByName.func_globals
  File "<string>", line 5, in <module>
  File "/home/jenkins/workspace/plone-5.0-python-2.7/src/Products.ATContentTypes/Products/ATContentTypes/__init__.py", line 33, in <module>
    import Products.ATContentTypes.content  # noqa
  File "/home/jenkins/workspace/plone-5.0-python-2.7/src/Products.ATContentTypes/Products/ATContentTypes/content/__init__.py", line 2, in <module>
    import Products.ATContentTypes.content.link  # noqa
  File "/home/jenkins/workspace/plone-5.0-python-2.7/src/Products.ATContentTypes/Products/ATContentTypes/content/link.py", line 3, in <module>
    from Products.Archetypes.atapi import Schema
  File "/home/jenkins/workspace/plone-5.0-python-2.7/src/Products.Archetypes/Products/Archetypes/atapi.py", line 32, in <module>
    from Products.Archetypes.BaseObject import BaseObject
  File "/home/jenkins/workspace/plone-5.0-python-2.7/src/Products.Archetypes/Products/Archetypes/BaseObject.py", line 114, in <module>
    class BaseObject(Referenceable):
  File "/home/jenkins/workspace/plone-5.0-python-2.7/src/Products.Archetypes/Products/Archetypes/BaseObject.py", line 133, in BaseObject
    implements(IBaseObject, IReferenceable)


FAILED:  plone.app.multilingual.tests.test_setup.Startup

Error Message:
name 'implements' is not defined

Stack Trace:
name 'implements' is not defined

  File "/home/jenkins/workspace/plone-5.0-python-2.7/src/plone.app.multilingual/src/plone/app/multilingual/tests/test_setup.py", line 7, in <module>
    from plone.app.multilingual.browser.setup import SetupMultilingualSite
  File "/home/jenkins/workspace/plone-5.0-python-2.7/src/plone.app.multilingual/src/plone/app/multilingual/browser/setup.py", line 3, in <module>
    from Products.CMFPlone.utils import _createObjectByType
  File "/home/jenkins/workspace/plone-5.0-python-2.7/src/Products.CMFPlone/Products/CMFPlone/__init__.py", line 228, in <module>
    from Products.CMFPlone import earlypatches  # noqa
  File "/home/jenkins/workspace/plone-5.0-python-2.7/src/Products.CMFPlone/Products/CMFPlone/earlypatches/__init__.py", line 2, in <module>
    import security  # noqa
  File "/home/jenkins/workspace/plone-5.0-python-2.7/src/Products.CMFPlone/Products/CMFPlone/earlypatches/security.py", line 86, in <module>
    exec code in utils.getToolByName.func_globals
  File "<string>", line 5, in <module>
  File "/home/jenkins/workspace/plone-5.0-python-2.7/src/Products.ATContentTypes/Products/ATContentTypes/__init__.py", line 33, in <module>
    import Products.ATContentTypes.content  # noqa
  File "/home/jenkins/workspace/plone-5.0-python-2.7/src/Products.ATContentTypes/Products/ATContentTypes/content/__init__.py", line 2, in <module>
    import Products.ATContentTypes.content.link  # noqa
  File "/home/jenkins/workspace/plone-5.0-python-2.7/src/Products.ATContentTypes/Products/ATContentTypes/content/link.py", line 3, in <module>
    from Products.Archetypes.atapi import Schema
  File "/home/jenkins/workspace/plone-5.0-python-2.7/src/Products.Archetypes/Products/Archetypes/atapi.py", line 32, in <module>
    from Products.Archetypes.BaseObject import BaseObject
  File "/home/jenkins/workspace/plone-5.0-python-2.7/src/Products.Archetypes/Products/Archetypes/BaseObject.py", line 114, in <module>
    class BaseObject(Referenceable):
  File "/home/jenkins/workspace/plone-5.0-python-2.7/src/Products.Archetypes/Products/Archetypes/BaseObject.py", line 133, in BaseObject
    implements(IBaseObject, IReferenceable)


FAILED:  plone.app.multilingual.tests.test_sitemap.Startup

Error Message:
name 'implements' is not defined

Stack Trace:
name 'implements' is not defined

  File "/home/jenkins/workspace/plone-5.0-python-2.7/src/plone.app.multilingual/src/plone/app/multilingual/tests/test_sitemap.py", line 4, in <module>
    from plone.app.multilingual.interfaces import IPloneAppMultilingualInstalled
  File "/home/jenkins/workspace/plone-5.0-python-2.7/src/plone.app.multilingual/src/plone/app/multilingual/interfaces.py", line 8, in <module>
    from Products.CMFPlone.interfaces import ILanguageSchema
  File "/home/jenkins/workspace/plone-5.0-python-2.7/src/Products.CMFPlone/Products/CMFPlone/__init__.py", line 228, in <module>
    from Products.CMFPlone import earlypatches  # noqa
  File "/home/jenkins/workspace/plone-5.0-python-2.7/src/Products.CMFPlone/Products/CMFPlone/earlypatches/__init__.py", line 2, in <module>
    import security  # noqa
  File "/home/jenkins/workspace/plone-5.0-python-2.7/src/Products.CMFPlone/Products/CMFPlone/earlypatches/security.py", line 86, in <module>
    exec code in utils.getToolByName.func_globals
  File "<string>", line 5, in <module>
  File "/home/jenkins/workspace/plone-5.0-python-2.7/src/Products.ATContentTypes/Products/ATContentTypes/__init__.py", line 33, in <module>
    import Products.ATContentTypes.content  # noqa
  File "/home/jenkins/workspace/plone-5.0-python-2.7/src/Products.ATContentTypes/Products/ATContentTypes/content/__init__.py", line 2, in <module>
    import Products.ATContentTypes.content.link  # noqa
  File "/home/jenkins/workspace/plone-5.0-python-2.7/src/Products.ATContentTypes/Products/ATContentTypes/content/link.py", line 3, in <module>
    from Products.Archetypes.atapi import Schema
  File "/home/jenkins/workspace/plone-5.0-python-2.7/src/Products.Archetypes/Products/Archetypes/atapi.py", line 32, in <module>
    from Products.Archetypes.BaseObject import BaseObject
  File "/home/jenkins/workspace/plone-5.0-python-2.7/src/Products.Archetypes/Products/Archetypes/BaseObject.py", line 114, in <module>
    class BaseObject(Referenceable):
  File "/home/jenkins/workspace/plone-5.0-python-2.7/src/Products.Archetypes/Products/Archetypes/BaseObject.py", line 133, in BaseObject
    implements(IBaseObject, IReferenceable)


FAILED:  plone.app.multilingual.tests.test_subscribers.Startup

Error Message:
name 'implements' is not defined

Stack Trace:
name 'implements' is not defined

  File "/home/jenkins/workspace/plone-5.0-python-2.7/src/plone.app.multilingual/src/plone/app/multilingual/tests/test_subscribers.py", line 5, in <module>
    from Products.CMFPlone.interfaces import ILanguage
  File "/home/jenkins/workspace/plone-5.0-python-2.7/src/Products.CMFPlone/Products/CMFPlone/__init__.py", line 228, in <module>
    from Products.CMFPlone import earlypatches  # noqa
  File "/home/jenkins/workspace/plone-5.0-python-2.7/src/Products.CMFPlone/Products/CMFPlone/earlypatches/__init__.py", line 2, in <module>
    import security  # noqa
  File "/home/jenkins/workspace/plone-5.0-python-2.7/src/Products.CMFPlone/Products/CMFPlone/earlypatches/security.py", line 86, in <module>
    exec code in utils.getToolByName.func_globals
  File "<string>", line 5, in <module>
  File "/home/jenkins/workspace/plone-5.0-python-2.7/src/Products.ATContentTypes/Products/ATContentTypes/__init__.py", line 33, in <module>
    import Products.ATContentTypes.content  # noqa
  File "/home/jenkins/workspace/plone-5.0-python-2.7/src/Products.ATContentTypes/Products/ATContentTypes/content/__init__.py", line 2, in <module>
    import Products.ATContentTypes.content.link  # noqa
  File "/home/jenkins/workspace/plone-5.0-python-2.7/src/Products.ATContentTypes/Products/ATContentTypes/content/link.py", line 3, in <module>
    from Products.Archetypes.atapi import Schema
  File "/home/jenkins/workspace/plone-5.0-python-2.7/src/Products.Archetypes/Products/Archetypes/atapi.py", line 32, in <module>
    from Products.Archetypes.BaseObject import BaseObject
  File "/home/jenkins/workspace/plone-5.0-python-2.7/src/Products.Archetypes/Products/Archetypes/BaseObject.py", line 114, in <module>
    class BaseObject(Referenceable):
  File "/home/jenkins/workspace/plone-5.0-python-2.7/src/Products.Archetypes/Products/Archetypes/BaseObject.py", line 133, in BaseObject
    implements(IBaseObject, IReferenceable)


FAILED:  plone.app.multilingual.tests.test_vocabularies.Startup

Error Message:
name 'implements' is not defined

Stack Trace:
name 'implements' is not defined

  File "/home/jenkins/workspace/plone-5.0-python-2.7/src/plone.app.multilingual/src/plone/app/multilingual/tests/test_vocabularies.py", line 3, in <module>
    from plone.app.multilingual import api
  File "/home/jenkins/workspace/plone-5.0-python-2.7/src/plone.app.multilingual/src/plone/app/multilingual/api.py", line 2, in <module>
    from plone.app.multilingual.interfaces import ITG
  File "/home/jenkins/workspace/plone-5.0-python-2.7/src/plone.app.multilingual/src/plone/app/multilingual/interfaces.py", line 8, in <module>
    from Products.CMFPlone.interfaces import ILanguageSchema
  File "/home/jenkins/workspace/plone-5.0-python-2.7/src/Products.CMFPlone/Products/CMFPlone/__init__.py", line 228, in <module>
    from Products.CMFPlone import earlypatches  # noqa
  File "/home/jenkins/workspace/plone-5.0-python-2.7/src/Products.CMFPlone/Products/CMFPlone/earlypatches/__init__.py", line 2, in <module>
    import security  # noqa
  File "/home/jenkins/workspace/plone-5.0-python-2.7/src/Products.CMFPlone/Products/CMFPlone/earlypatches/security.py", line 86, in <module>
    exec code in utils.getToolByName.func_globals
  File "<string>", line 5, in <module>
  File "/home/jenkins/workspace/plone-5.0-python-2.7/src/Products.ATContentTypes/Products/ATContentTypes/__init__.py", line 33, in <module>
    import Products.ATContentTypes.content  # noqa
  File "/home/jenkins/workspace/plone-5.0-python-2.7/src/Products.ATContentTypes/Products/ATContentTypes/content/__init__.py", line 2, in <module>
    import Products.ATContentTypes.content.link  # noqa
  File "/home/jenkins/workspace/plone-5.0-python-2.7/src/Products.ATContentTypes/Products/ATContentTypes/content/link.py", line 3, in <module>
    from Products.Archetypes.atapi import Schema
  File "/home/jenkins/workspace/plone-5.0-python-2.7/src/Products.Archetypes/Products/Archetypes/atapi.py", line 32, in <module>
    from Products.Archetypes.BaseObject import BaseObject
  File "/home/jenkins/workspace/plone-5.0-python-2.7/src/Products.Archetypes/Products/Archetypes/BaseObject.py", line 114, in <module>
    class BaseObject(Referenceable):
  File "/home/jenkins/workspace/plone-5.0-python-2.7/src/Products.Archetypes/Products/Archetypes/BaseObject.py", line 133, in BaseObject
    implements(IBaseObject, IReferenceable)


More information about the Testbot mailing list