[Testbot] Plone 5.0 - Python 2.7 - Archetypes - Build # 108 - Failure!

jenkins at plone.org jenkins at plone.org
Tue May 30 15:43:32 UTC 2017


Plone 5.0 - Python 2.7 - Archetypes - Build # 108 - Failure:

Check console output at http://jenkins.plone.org/job/plone-5.0-python-2.7-at/108/ to view the results.

Changes:

[Godefroid Chapelle] [fc] Repository: Products.Archetypes Branch: refs/heads/1.10.x Date:







Test Results:

78 tests failed.
FAILED:  Products.Archetypes.tests.test_annotation.Startup

Error Message:
name 'implements' is not defined

Stack Trace:
name 'implements' is not defined

  File "/home/jenkins/workspace/plone-5.0-python-2.7-at/src/Products.Archetypes/Products/Archetypes/tests/test_annotation.py", line 26, in <module>
    from Products.Archetypes.tests.atsitetestcase import ATSiteTestCase
  File "/home/jenkins/workspace/plone-5.0-python-2.7-at/src/Products.Archetypes/Products/Archetypes/tests/atsitetestcase.py", line 1, in <module>
    from Products.Archetypes.tests.attestcase import ATTestCase as ATSiteTestCase
  File "/home/jenkins/workspace/plone-5.0-python-2.7-at/src/Products.Archetypes/Products/Archetypes/tests/attestcase.py", line 1, in <module>
    from plone.app.testing import bbb
  File "/home/jenkins/.buildout/eggs/plone.app.testing-5.0.6-py2.7.egg/plone/app/testing/__init__.py", line 4, in <module>
    from plone.app.testing.helpers import applyProfile
  File "/home/jenkins/.buildout/eggs/plone.app.testing-5.0.6-py2.7.egg/plone/app/testing/helpers.py", line 5, in <module>
    from plone.app.testing import layers
  File "/home/jenkins/.buildout/eggs/plone.app.testing-5.0.6-py2.7.egg/plone/app/testing/layers.py", line 27, in <module>
    class PloneFixture(Layer):
  File "/home/jenkins/.buildout/eggs/plone.app.testing-5.0.6-py2.7.egg/plone/app/testing/layers.py", line 81, in PloneFixture
    import Products.PasswordResetTool  # noqa
  File "/home/jenkins/.buildout/eggs/Products.PasswordResetTool-2.2.3-py2.7.egg/Products/PasswordResetTool/__init__.py", line 4, in <module>
    import PasswordResetTool
  File "/home/jenkins/.buildout/eggs/Products.PasswordResetTool-2.2.3-py2.7.egg/Products/PasswordResetTool/PasswordResetTool.py", line 24, in <module>
    from Products.CMFPlone.interfaces import ISecuritySchema
  File "/home/jenkins/workspace/plone-5.0-python-2.7-at/src/Products.CMFPlone/Products/CMFPlone/__init__.py", line 228, in <module>
    from Products.CMFPlone import earlypatches  # noqa
  File "/home/jenkins/workspace/plone-5.0-python-2.7-at/src/Products.CMFPlone/Products/CMFPlone/earlypatches/__init__.py", line 2, in <module>
    import security  # noqa
  File "/home/jenkins/workspace/plone-5.0-python-2.7-at/src/Products.CMFPlone/Products/CMFPlone/earlypatches/security.py", line 86, in <module>
    exec code in utils.getToolByName.func_globals
  File "<string>", line 5, in <module>
  File "/home/jenkins/workspace/plone-5.0-python-2.7-at/src/Products.ATContentTypes/Products/ATContentTypes/__init__.py", line 33, in <module>
    import Products.ATContentTypes.content  # noqa
  File "/home/jenkins/workspace/plone-5.0-python-2.7-at/src/Products.ATContentTypes/Products/ATContentTypes/content/__init__.py", line 2, in <module>
    import Products.ATContentTypes.content.link  # noqa
  File "/home/jenkins/workspace/plone-5.0-python-2.7-at/src/Products.ATContentTypes/Products/ATContentTypes/content/link.py", line 3, in <module>
    from Products.Archetypes.atapi import Schema
  File "/home/jenkins/workspace/plone-5.0-python-2.7-at/src/Products.Archetypes/Products/Archetypes/atapi.py", line 32, in <module>
    from Products.Archetypes.BaseObject import BaseObject
  File "/home/jenkins/workspace/plone-5.0-python-2.7-at/src/Products.Archetypes/Products/Archetypes/BaseObject.py", line 114, in <module>
    class BaseObject(Referenceable):
  File "/home/jenkins/workspace/plone-5.0-python-2.7-at/src/Products.Archetypes/Products/Archetypes/BaseObject.py", line 133, in BaseObject
    implements(IBaseObject, IReferenceable)


FAILED:  Products.Archetypes.tests.test_baseobject.Startup

Error Message:
name 'implements' is not defined

Stack Trace:
name 'implements' is not defined

  File "/home/jenkins/workspace/plone-5.0-python-2.7-at/src/Products.Archetypes/Products/Archetypes/tests/test_baseobject.py", line 26, in <module>
    from Products.Archetypes.tests.atsitetestcase import ATSiteTestCase
  File "/home/jenkins/workspace/plone-5.0-python-2.7-at/src/Products.Archetypes/Products/Archetypes/tests/atsitetestcase.py", line 1, in <module>
    from Products.Archetypes.tests.attestcase import ATTestCase as ATSiteTestCase
  File "/home/jenkins/workspace/plone-5.0-python-2.7-at/src/Products.Archetypes/Products/Archetypes/tests/attestcase.py", line 1, in <module>
    from plone.app.testing import bbb
  File "/home/jenkins/.buildout/eggs/plone.app.testing-5.0.6-py2.7.egg/plone/app/testing/__init__.py", line 4, in <module>
    from plone.app.testing.helpers import applyProfile
  File "/home/jenkins/.buildout/eggs/plone.app.testing-5.0.6-py2.7.egg/plone/app/testing/helpers.py", line 5, in <module>
    from plone.app.testing import layers
  File "/home/jenkins/.buildout/eggs/plone.app.testing-5.0.6-py2.7.egg/plone/app/testing/layers.py", line 27, in <module>
    class PloneFixture(Layer):
  File "/home/jenkins/.buildout/eggs/plone.app.testing-5.0.6-py2.7.egg/plone/app/testing/layers.py", line 81, in PloneFixture
    import Products.PasswordResetTool  # noqa
  File "/home/jenkins/.buildout/eggs/Products.PasswordResetTool-2.2.3-py2.7.egg/Products/PasswordResetTool/__init__.py", line 4, in <module>
    import PasswordResetTool
  File "/home/jenkins/.buildout/eggs/Products.PasswordResetTool-2.2.3-py2.7.egg/Products/PasswordResetTool/PasswordResetTool.py", line 24, in <module>
    from Products.CMFPlone.interfaces import ISecuritySchema
  File "/home/jenkins/workspace/plone-5.0-python-2.7-at/src/Products.CMFPlone/Products/CMFPlone/__init__.py", line 228, in <module>
    from Products.CMFPlone import earlypatches  # noqa
  File "/home/jenkins/workspace/plone-5.0-python-2.7-at/src/Products.CMFPlone/Products/CMFPlone/earlypatches/__init__.py", line 2, in <module>
    import security  # noqa
  File "/home/jenkins/workspace/plone-5.0-python-2.7-at/src/Products.CMFPlone/Products/CMFPlone/earlypatches/security.py", line 86, in <module>
    exec code in utils.getToolByName.func_globals
  File "<string>", line 5, in <module>
  File "/home/jenkins/workspace/plone-5.0-python-2.7-at/src/Products.ATContentTypes/Products/ATContentTypes/__init__.py", line 33, in <module>
    import Products.ATContentTypes.content  # noqa
  File "/home/jenkins/workspace/plone-5.0-python-2.7-at/src/Products.ATContentTypes/Products/ATContentTypes/content/__init__.py", line 2, in <module>
    import Products.ATContentTypes.content.link  # noqa
  File "/home/jenkins/workspace/plone-5.0-python-2.7-at/src/Products.ATContentTypes/Products/ATContentTypes/content/link.py", line 3, in <module>
    from Products.Archetypes.atapi import Schema
  File "/home/jenkins/workspace/plone-5.0-python-2.7-at/src/Products.Archetypes/Products/Archetypes/atapi.py", line 32, in <module>
    from Products.Archetypes.BaseObject import BaseObject
  File "/home/jenkins/workspace/plone-5.0-python-2.7-at/src/Products.Archetypes/Products/Archetypes/BaseObject.py", line 114, in <module>
    class BaseObject(Referenceable):
  File "/home/jenkins/workspace/plone-5.0-python-2.7-at/src/Products.Archetypes/Products/Archetypes/BaseObject.py", line 133, in BaseObject
    implements(IBaseObject, IReferenceable)


FAILED:  Products.Archetypes.tests.test_baseschema.Startup

Error Message:
name 'implements' is not defined

Stack Trace:
name 'implements' is not defined

  File "/home/jenkins/workspace/plone-5.0-python-2.7-at/src/Products.Archetypes/Products/Archetypes/tests/test_baseschema.py", line 26, in <module>
    from Products.Archetypes.tests.atsitetestcase import ATSiteTestCase
  File "/home/jenkins/workspace/plone-5.0-python-2.7-at/src/Products.Archetypes/Products/Archetypes/tests/atsitetestcase.py", line 1, in <module>
    from Products.Archetypes.tests.attestcase import ATTestCase as ATSiteTestCase
  File "/home/jenkins/workspace/plone-5.0-python-2.7-at/src/Products.Archetypes/Products/Archetypes/tests/attestcase.py", line 1, in <module>
    from plone.app.testing import bbb
  File "/home/jenkins/.buildout/eggs/plone.app.testing-5.0.6-py2.7.egg/plone/app/testing/__init__.py", line 4, in <module>
    from plone.app.testing.helpers import applyProfile
  File "/home/jenkins/.buildout/eggs/plone.app.testing-5.0.6-py2.7.egg/plone/app/testing/helpers.py", line 5, in <module>
    from plone.app.testing import layers
  File "/home/jenkins/.buildout/eggs/plone.app.testing-5.0.6-py2.7.egg/plone/app/testing/layers.py", line 27, in <module>
    class PloneFixture(Layer):
  File "/home/jenkins/.buildout/eggs/plone.app.testing-5.0.6-py2.7.egg/plone/app/testing/layers.py", line 81, in PloneFixture
    import Products.PasswordResetTool  # noqa
  File "/home/jenkins/.buildout/eggs/Products.PasswordResetTool-2.2.3-py2.7.egg/Products/PasswordResetTool/__init__.py", line 4, in <module>
    import PasswordResetTool
  File "/home/jenkins/.buildout/eggs/Products.PasswordResetTool-2.2.3-py2.7.egg/Products/PasswordResetTool/PasswordResetTool.py", line 24, in <module>
    from Products.CMFPlone.interfaces import ISecuritySchema
  File "/home/jenkins/workspace/plone-5.0-python-2.7-at/src/Products.CMFPlone/Products/CMFPlone/__init__.py", line 228, in <module>
    from Products.CMFPlone import earlypatches  # noqa
  File "/home/jenkins/workspace/plone-5.0-python-2.7-at/src/Products.CMFPlone/Products/CMFPlone/earlypatches/__init__.py", line 2, in <module>
    import security  # noqa
  File "/home/jenkins/workspace/plone-5.0-python-2.7-at/src/Products.CMFPlone/Products/CMFPlone/earlypatches/security.py", line 86, in <module>
    exec code in utils.getToolByName.func_globals
  File "<string>", line 5, in <module>
  File "/home/jenkins/workspace/plone-5.0-python-2.7-at/src/Products.ATContentTypes/Products/ATContentTypes/__init__.py", line 33, in <module>
    import Products.ATContentTypes.content  # noqa
  File "/home/jenkins/workspace/plone-5.0-python-2.7-at/src/Products.ATContentTypes/Products/ATContentTypes/content/__init__.py", line 2, in <module>
    import Products.ATContentTypes.content.link  # noqa
  File "/home/jenkins/workspace/plone-5.0-python-2.7-at/src/Products.ATContentTypes/Products/ATContentTypes/content/link.py", line 3, in <module>
    from Products.Archetypes.atapi import Schema
  File "/home/jenkins/workspace/plone-5.0-python-2.7-at/src/Products.Archetypes/Products/Archetypes/atapi.py", line 32, in <module>
    from Products.Archetypes.BaseObject import BaseObject
  File "/home/jenkins/workspace/plone-5.0-python-2.7-at/src/Products.Archetypes/Products/Archetypes/BaseObject.py", line 114, in <module>
    class BaseObject(Referenceable):
  File "/home/jenkins/workspace/plone-5.0-python-2.7-at/src/Products.Archetypes/Products/Archetypes/BaseObject.py", line 133, in BaseObject
    implements(IBaseObject, IReferenceable)


FAILED:  Products.Archetypes.tests.test_baseunit.Startup

Error Message:
name 'implements' is not defined

Stack Trace:
name 'implements' is not defined

  File "/home/jenkins/workspace/plone-5.0-python-2.7-at/src/Products.Archetypes/Products/Archetypes/tests/test_baseunit.py", line 31, in <module>
    from Products.Archetypes.tests.atsitetestcase import ATSiteTestCase
  File "/home/jenkins/workspace/plone-5.0-python-2.7-at/src/Products.Archetypes/Products/Archetypes/tests/atsitetestcase.py", line 1, in <module>
    from Products.Archetypes.tests.attestcase import ATTestCase as ATSiteTestCase
  File "/home/jenkins/workspace/plone-5.0-python-2.7-at/src/Products.Archetypes/Products/Archetypes/tests/attestcase.py", line 1, in <module>
    from plone.app.testing import bbb
  File "/home/jenkins/.buildout/eggs/plone.app.testing-5.0.6-py2.7.egg/plone/app/testing/__init__.py", line 4, in <module>
    from plone.app.testing.helpers import applyProfile
  File "/home/jenkins/.buildout/eggs/plone.app.testing-5.0.6-py2.7.egg/plone/app/testing/helpers.py", line 5, in <module>
    from plone.app.testing import layers
  File "/home/jenkins/.buildout/eggs/plone.app.testing-5.0.6-py2.7.egg/plone/app/testing/layers.py", line 27, in <module>
    class PloneFixture(Layer):
  File "/home/jenkins/.buildout/eggs/plone.app.testing-5.0.6-py2.7.egg/plone/app/testing/layers.py", line 81, in PloneFixture
    import Products.PasswordResetTool  # noqa
  File "/home/jenkins/.buildout/eggs/Products.PasswordResetTool-2.2.3-py2.7.egg/Products/PasswordResetTool/__init__.py", line 4, in <module>
    import PasswordResetTool
  File "/home/jenkins/.buildout/eggs/Products.PasswordResetTool-2.2.3-py2.7.egg/Products/PasswordResetTool/PasswordResetTool.py", line 24, in <module>
    from Products.CMFPlone.interfaces import ISecuritySchema
  File "/home/jenkins/workspace/plone-5.0-python-2.7-at/src/Products.CMFPlone/Products/CMFPlone/__init__.py", line 228, in <module>
    from Products.CMFPlone import earlypatches  # noqa
  File "/home/jenkins/workspace/plone-5.0-python-2.7-at/src/Products.CMFPlone/Products/CMFPlone/earlypatches/__init__.py", line 2, in <module>
    import security  # noqa
  File "/home/jenkins/workspace/plone-5.0-python-2.7-at/src/Products.CMFPlone/Products/CMFPlone/earlypatches/security.py", line 86, in <module>
    exec code in utils.getToolByName.func_globals
  File "<string>", line 5, in <module>
  File "/home/jenkins/workspace/plone-5.0-python-2.7-at/src/Products.ATContentTypes/Products/ATContentTypes/__init__.py", line 33, in <module>
    import Products.ATContentTypes.content  # noqa
  File "/home/jenkins/workspace/plone-5.0-python-2.7-at/src/Products.ATContentTypes/Products/ATContentTypes/content/__init__.py", line 2, in <module>
    import Products.ATContentTypes.content.link  # noqa
  File "/home/jenkins/workspace/plone-5.0-python-2.7-at/src/Products.ATContentTypes/Products/ATContentTypes/content/link.py", line 3, in <module>
    from Products.Archetypes.atapi import Schema
  File "/home/jenkins/workspace/plone-5.0-python-2.7-at/src/Products.Archetypes/Products/Archetypes/atapi.py", line 32, in <module>
    from Products.Archetypes.BaseObject import BaseObject
  File "/home/jenkins/workspace/plone-5.0-python-2.7-at/src/Products.Archetypes/Products/Archetypes/BaseObject.py", line 114, in <module>
    class BaseObject(Referenceable):
  File "/home/jenkins/workspace/plone-5.0-python-2.7-at/src/Products.Archetypes/Products/Archetypes/BaseObject.py", line 133, in BaseObject
    implements(IBaseObject, IReferenceable)


FAILED:  Products.Archetypes.tests.test_browser_utils.Startup

Error Message:
name 'implements' is not defined

Stack Trace:
name 'implements' is not defined

  File "/home/jenkins/workspace/plone-5.0-python-2.7-at/src/Products.Archetypes/Products/Archetypes/tests/test_browser_utils.py", line 3, in <module>
    from Products.Archetypes.tests.atsitetestcase import ATSiteTestCase
  File "/home/jenkins/workspace/plone-5.0-python-2.7-at/src/Products.Archetypes/Products/Archetypes/tests/atsitetestcase.py", line 1, in <module>
    from Products.Archetypes.tests.attestcase import ATTestCase as ATSiteTestCase
  File "/home/jenkins/workspace/plone-5.0-python-2.7-at/src/Products.Archetypes/Products/Archetypes/tests/attestcase.py", line 1, in <module>
    from plone.app.testing import bbb
  File "/home/jenkins/.buildout/eggs/plone.app.testing-5.0.6-py2.7.egg/plone/app/testing/__init__.py", line 4, in <module>
    from plone.app.testing.helpers import applyProfile
  File "/home/jenkins/.buildout/eggs/plone.app.testing-5.0.6-py2.7.egg/plone/app/testing/helpers.py", line 5, in <module>
    from plone.app.testing import layers
  File "/home/jenkins/.buildout/eggs/plone.app.testing-5.0.6-py2.7.egg/plone/app/testing/layers.py", line 27, in <module>
    class PloneFixture(Layer):
  File "/home/jenkins/.buildout/eggs/plone.app.testing-5.0.6-py2.7.egg/plone/app/testing/layers.py", line 81, in PloneFixture
    import Products.PasswordResetTool  # noqa
  File "/home/jenkins/.buildout/eggs/Products.PasswordResetTool-2.2.3-py2.7.egg/Products/PasswordResetTool/__init__.py", line 4, in <module>
    import PasswordResetTool
  File "/home/jenkins/.buildout/eggs/Products.PasswordResetTool-2.2.3-py2.7.egg/Products/PasswordResetTool/PasswordResetTool.py", line 24, in <module>
    from Products.CMFPlone.interfaces import ISecuritySchema
  File "/home/jenkins/workspace/plone-5.0-python-2.7-at/src/Products.CMFPlone/Products/CMFPlone/__init__.py", line 228, in <module>
    from Products.CMFPlone import earlypatches  # noqa
  File "/home/jenkins/workspace/plone-5.0-python-2.7-at/src/Products.CMFPlone/Products/CMFPlone/earlypatches/__init__.py", line 2, in <module>
    import security  # noqa
  File "/home/jenkins/workspace/plone-5.0-python-2.7-at/src/Products.CMFPlone/Products/CMFPlone/earlypatches/security.py", line 86, in <module>
    exec code in utils.getToolByName.func_globals
  File "<string>", line 5, in <module>
  File "/home/jenkins/workspace/plone-5.0-python-2.7-at/src/Products.ATContentTypes/Products/ATContentTypes/__init__.py", line 33, in <module>
    import Products.ATContentTypes.content  # noqa
  File "/home/jenkins/workspace/plone-5.0-python-2.7-at/src/Products.ATContentTypes/Products/ATContentTypes/content/__init__.py", line 2, in <module>
    import Products.ATContentTypes.content.link  # noqa
  File "/home/jenkins/workspace/plone-5.0-python-2.7-at/src/Products.ATContentTypes/Products/ATContentTypes/content/link.py", line 3, in <module>
    from Products.Archetypes.atapi import Schema
  File "/home/jenkins/workspace/plone-5.0-python-2.7-at/src/Products.Archetypes/Products/Archetypes/atapi.py", line 32, in <module>
    from Products.Archetypes.BaseObject import BaseObject
  File "/home/jenkins/workspace/plone-5.0-python-2.7-at/src/Products.Archetypes/Products/Archetypes/BaseObject.py", line 114, in <module>
    class BaseObject(Referenceable):
  File "/home/jenkins/workspace/plone-5.0-python-2.7-at/src/Products.Archetypes/Products/Archetypes/BaseObject.py", line 133, in BaseObject
    implements(IBaseObject, IReferenceable)


FAILED:  Products.Archetypes.tests.test_classgen.Startup

Error Message:
name 'implements' is not defined

Stack Trace:
name 'implements' is not defined

  File "/home/jenkins/workspace/plone-5.0-python-2.7-at/src/Products.Archetypes/Products/Archetypes/tests/test_classgen.py", line 33, in <module>
    from Products.Archetypes.tests.atsitetestcase import ATSiteTestCase
  File "/home/jenkins/workspace/plone-5.0-python-2.7-at/src/Products.Archetypes/Products/Archetypes/tests/atsitetestcase.py", line 1, in <module>
    from Products.Archetypes.tests.attestcase import ATTestCase as ATSiteTestCase
  File "/home/jenkins/workspace/plone-5.0-python-2.7-at/src/Products.Archetypes/Products/Archetypes/tests/attestcase.py", line 1, in <module>
    from plone.app.testing import bbb
  File "/home/jenkins/.buildout/eggs/plone.app.testing-5.0.6-py2.7.egg/plone/app/testing/__init__.py", line 4, in <module>
    from plone.app.testing.helpers import applyProfile
  File "/home/jenkins/.buildout/eggs/plone.app.testing-5.0.6-py2.7.egg/plone/app/testing/helpers.py", line 5, in <module>
    from plone.app.testing import layers
  File "/home/jenkins/.buildout/eggs/plone.app.testing-5.0.6-py2.7.egg/plone/app/testing/layers.py", line 27, in <module>
    class PloneFixture(Layer):
  File "/home/jenkins/.buildout/eggs/plone.app.testing-5.0.6-py2.7.egg/plone/app/testing/layers.py", line 81, in PloneFixture
    import Products.PasswordResetTool  # noqa
  File "/home/jenkins/.buildout/eggs/Products.PasswordResetTool-2.2.3-py2.7.egg/Products/PasswordResetTool/__init__.py", line 4, in <module>
    import PasswordResetTool
  File "/home/jenkins/.buildout/eggs/Products.PasswordResetTool-2.2.3-py2.7.egg/Products/PasswordResetTool/PasswordResetTool.py", line 24, in <module>
    from Products.CMFPlone.interfaces import ISecuritySchema
  File "/home/jenkins/workspace/plone-5.0-python-2.7-at/src/Products.CMFPlone/Products/CMFPlone/__init__.py", line 228, in <module>
    from Products.CMFPlone import earlypatches  # noqa
  File "/home/jenkins/workspace/plone-5.0-python-2.7-at/src/Products.CMFPlone/Products/CMFPlone/earlypatches/__init__.py", line 2, in <module>
    import security  # noqa
  File "/home/jenkins/workspace/plone-5.0-python-2.7-at/src/Products.CMFPlone/Products/CMFPlone/earlypatches/security.py", line 86, in <module>
    exec code in utils.getToolByName.func_globals
  File "<string>", line 5, in <module>
  File "/home/jenkins/workspace/plone-5.0-python-2.7-at/src/Products.ATContentTypes/Products/ATContentTypes/__init__.py", line 33, in <module>
    import Products.ATContentTypes.content  # noqa
  File "/home/jenkins/workspace/plone-5.0-python-2.7-at/src/Products.ATContentTypes/Products/ATContentTypes/content/__init__.py", line 2, in <module>
    import Products.ATContentTypes.content.link  # noqa
  File "/home/jenkins/workspace/plone-5.0-python-2.7-at/src/Products.ATContentTypes/Products/ATContentTypes/content/link.py", line 3, in <module>
    from Products.Archetypes.atapi import Schema
  File "/home/jenkins/workspace/plone-5.0-python-2.7-at/src/Products.Archetypes/Products/Archetypes/atapi.py", line 32, in <module>
    from Products.Archetypes.BaseObject import BaseObject
  File "/home/jenkins/workspace/plone-5.0-python-2.7-at/src/Products.Archetypes/Products/Archetypes/BaseObject.py", line 114, in <module>
    class BaseObject(Referenceable):
  File "/home/jenkins/workspace/plone-5.0-python-2.7-at/src/Products.Archetypes/Products/Archetypes/BaseObject.py", line 133, in BaseObject
    implements(IBaseObject, IReferenceable)


FAILED:  Products.Archetypes.tests.test_cmfessentials.Startup

Error Message:
name 'implements' is not defined

Stack Trace:
name 'implements' is not defined

  File "/home/jenkins/workspace/plone-5.0-python-2.7-at/src/Products.Archetypes/Products/Archetypes/tests/test_cmfessentials.py", line 29, in <module>
    from Products.Archetypes.tests.attestcase import ATTestCase
  File "/home/jenkins/workspace/plone-5.0-python-2.7-at/src/Products.Archetypes/Products/Archetypes/tests/attestcase.py", line 1, in <module>
    from plone.app.testing import bbb
  File "/home/jenkins/.buildout/eggs/plone.app.testing-5.0.6-py2.7.egg/plone/app/testing/__init__.py", line 4, in <module>
    from plone.app.testing.helpers import applyProfile
  File "/home/jenkins/.buildout/eggs/plone.app.testing-5.0.6-py2.7.egg/plone/app/testing/helpers.py", line 5, in <module>
    from plone.app.testing import layers
  File "/home/jenkins/.buildout/eggs/plone.app.testing-5.0.6-py2.7.egg/plone/app/testing/layers.py", line 27, in <module>
    class PloneFixture(Layer):
  File "/home/jenkins/.buildout/eggs/plone.app.testing-5.0.6-py2.7.egg/plone/app/testing/layers.py", line 81, in PloneFixture
    import Products.PasswordResetTool  # noqa
  File "/home/jenkins/.buildout/eggs/Products.PasswordResetTool-2.2.3-py2.7.egg/Products/PasswordResetTool/__init__.py", line 4, in <module>
    import PasswordResetTool
  File "/home/jenkins/.buildout/eggs/Products.PasswordResetTool-2.2.3-py2.7.egg/Products/PasswordResetTool/PasswordResetTool.py", line 24, in <module>
    from Products.CMFPlone.interfaces import ISecuritySchema
  File "/home/jenkins/workspace/plone-5.0-python-2.7-at/src/Products.CMFPlone/Products/CMFPlone/__init__.py", line 228, in <module>
    from Products.CMFPlone import earlypatches  # noqa
  File "/home/jenkins/workspace/plone-5.0-python-2.7-at/src/Products.CMFPlone/Products/CMFPlone/earlypatches/__init__.py", line 2, in <module>
    import security  # noqa
  File "/home/jenkins/workspace/plone-5.0-python-2.7-at/src/Products.CMFPlone/Products/CMFPlone/earlypatches/security.py", line 86, in <module>
    exec code in utils.getToolByName.func_globals
  File "<string>", line 5, in <module>
  File "/home/jenkins/workspace/plone-5.0-python-2.7-at/src/Products.ATContentTypes/Products/ATContentTypes/__init__.py", line 33, in <module>
    import Products.ATContentTypes.content  # noqa
  File "/home/jenkins/workspace/plone-5.0-python-2.7-at/src/Products.ATContentTypes/Products/ATContentTypes/content/__init__.py", line 2, in <module>
    import Products.ATContentTypes.content.link  # noqa
  File "/home/jenkins/workspace/plone-5.0-python-2.7-at/src/Products.ATContentTypes/Products/ATContentTypes/content/link.py", line 3, in <module>
    from Products.Archetypes.atapi import Schema
  File "/home/jenkins/workspace/plone-5.0-python-2.7-at/src/Products.Archetypes/Products/Archetypes/atapi.py", line 32, in <module>
    from Products.Archetypes.BaseObject import BaseObject
  File "/home/jenkins/workspace/plone-5.0-python-2.7-at/src/Products.Archetypes/Products/Archetypes/BaseObject.py", line 114, in <module>
    class BaseObject(Referenceable):
  File "/home/jenkins/workspace/plone-5.0-python-2.7-at/src/Products.Archetypes/Products/Archetypes/BaseObject.py", line 133, in BaseObject
    implements(IBaseObject, IReferenceable)


FAILED:  Products.Archetypes.tests.test_construction.Startup

Error Message:
name 'implements' is not defined

Stack Trace:
name 'implements' is not defined

  File "/home/jenkins/workspace/plone-5.0-python-2.7-at/src/Products.Archetypes/Products/Archetypes/tests/test_construction.py", line 1, in <module>
    from Products.Archetypes.tests.atsitetestcase import ATSiteTestCase
  File "/home/jenkins/workspace/plone-5.0-python-2.7-at/src/Products.Archetypes/Products/Archetypes/tests/atsitetestcase.py", line 1, in <module>
    from Products.Archetypes.tests.attestcase import ATTestCase as ATSiteTestCase
  File "/home/jenkins/workspace/plone-5.0-python-2.7-at/src/Products.Archetypes/Products/Archetypes/tests/attestcase.py", line 1, in <module>
    from plone.app.testing import bbb
  File "/home/jenkins/.buildout/eggs/plone.app.testing-5.0.6-py2.7.egg/plone/app/testing/__init__.py", line 4, in <module>
    from plone.app.testing.helpers import applyProfile
  File "/home/jenkins/.buildout/eggs/plone.app.testing-5.0.6-py2.7.egg/plone/app/testing/helpers.py", line 5, in <module>
    from plone.app.testing import layers
  File "/home/jenkins/.buildout/eggs/plone.app.testing-5.0.6-py2.7.egg/plone/app/testing/layers.py", line 27, in <module>
    class PloneFixture(Layer):
  File "/home/jenkins/.buildout/eggs/plone.app.testing-5.0.6-py2.7.egg/plone/app/testing/layers.py", line 81, in PloneFixture
    import Products.PasswordResetTool  # noqa
  File "/home/jenkins/.buildout/eggs/Products.PasswordResetTool-2.2.3-py2.7.egg/Products/PasswordResetTool/__init__.py", line 4, in <module>
    import PasswordResetTool
  File "/home/jenkins/.buildout/eggs/Products.PasswordResetTool-2.2.3-py2.7.egg/Products/PasswordResetTool/PasswordResetTool.py", line 24, in <module>
    from Products.CMFPlone.interfaces import ISecuritySchema
  File "/home/jenkins/workspace/plone-5.0-python-2.7-at/src/Products.CMFPlone/Products/CMFPlone/__init__.py", line 228, in <module>
    from Products.CMFPlone import earlypatches  # noqa
  File "/home/jenkins/workspace/plone-5.0-python-2.7-at/src/Products.CMFPlone/Products/CMFPlone/earlypatches/__init__.py", line 2, in <module>
    import security  # noqa
  File "/home/jenkins/workspace/plone-5.0-python-2.7-at/src/Products.CMFPlone/Products/CMFPlone/earlypatches/security.py", line 86, in <module>
    exec code in utils.getToolByName.func_globals
  File "<string>", line 5, in <module>
  File "/home/jenkins/workspace/plone-5.0-python-2.7-at/src/Products.ATContentTypes/Products/ATContentTypes/__init__.py", line 33, in <module>
    import Products.ATContentTypes.content  # noqa
  File "/home/jenkins/workspace/plone-5.0-python-2.7-at/src/Products.ATContentTypes/Products/ATContentTypes/content/__init__.py", line 2, in <module>
    import Products.ATContentTypes.content.link  # noqa
  File "/home/jenkins/workspace/plone-5.0-python-2.7-at/src/Products.ATContentTypes/Products/ATContentTypes/content/link.py", line 3, in <module>
    from Products.Archetypes.atapi import Schema
  File "/home/jenkins/workspace/plone-5.0-python-2.7-at/src/Products.Archetypes/Products/Archetypes/atapi.py", line 32, in <module>
    from Products.Archetypes.BaseObject import BaseObject
  File "/home/jenkins/workspace/plone-5.0-python-2.7-at/src/Products.Archetypes/Products/Archetypes/BaseObject.py", line 114, in <module>
    class BaseObject(Referenceable):
  File "/home/jenkins/workspace/plone-5.0-python-2.7-at/src/Products.Archetypes/Products/Archetypes/BaseObject.py", line 133, in BaseObject
    implements(IBaseObject, IReferenceable)


FAILED:  Products.Archetypes.tests.test_contenttype.Startup

Error Message:
name 'implements' is not defined

Stack Trace:
name 'implements' is not defined

  File "/home/jenkins/workspace/plone-5.0-python-2.7-at/src/Products.Archetypes/Products/Archetypes/tests/test_contenttype.py", line 30, in <module>
    from Products.Archetypes.tests.atsitetestcase import ATSiteTestCase
  File "/home/jenkins/workspace/plone-5.0-python-2.7-at/src/Products.Archetypes/Products/Archetypes/tests/atsitetestcase.py", line 1, in <module>
    from Products.Archetypes.tests.attestcase import ATTestCase as ATSiteTestCase
  File "/home/jenkins/workspace/plone-5.0-python-2.7-at/src/Products.Archetypes/Products/Archetypes/tests/attestcase.py", line 1, in <module>
    from plone.app.testing import bbb
  File "/home/jenkins/.buildout/eggs/plone.app.testing-5.0.6-py2.7.egg/plone/app/testing/__init__.py", line 4, in <module>
    from plone.app.testing.helpers import applyProfile
  File "/home/jenkins/.buildout/eggs/plone.app.testing-5.0.6-py2.7.egg/plone/app/testing/helpers.py", line 5, in <module>
    from plone.app.testing import layers
  File "/home/jenkins/.buildout/eggs/plone.app.testing-5.0.6-py2.7.egg/plone/app/testing/layers.py", line 27, in <module>
    class PloneFixture(Layer):
  File "/home/jenkins/.buildout/eggs/plone.app.testing-5.0.6-py2.7.egg/plone/app/testing/layers.py", line 81, in PloneFixture
    import Products.PasswordResetTool  # noqa
  File "/home/jenkins/.buildout/eggs/Products.PasswordResetTool-2.2.3-py2.7.egg/Products/PasswordResetTool/__init__.py", line 4, in <module>
    import PasswordResetTool
  File "/home/jenkins/.buildout/eggs/Products.PasswordResetTool-2.2.3-py2.7.egg/Products/PasswordResetTool/PasswordResetTool.py", line 24, in <module>
    from Products.CMFPlone.interfaces import ISecuritySchema
  File "/home/jenkins/workspace/plone-5.0-python-2.7-at/src/Products.CMFPlone/Products/CMFPlone/__init__.py", line 228, in <module>
    from Products.CMFPlone import earlypatches  # noqa
  File "/home/jenkins/workspace/plone-5.0-python-2.7-at/src/Products.CMFPlone/Products/CMFPlone/earlypatches/__init__.py", line 2, in <module>
    import security  # noqa
  File "/home/jenkins/workspace/plone-5.0-python-2.7-at/src/Products.CMFPlone/Products/CMFPlone/earlypatches/security.py", line 86, in <module>
    exec code in utils.getToolByName.func_globals
  File "<string>", line 5, in <module>
  File "/home/jenkins/workspace/plone-5.0-python-2.7-at/src/Products.ATContentTypes/Products/ATContentTypes/__init__.py", line 33, in <module>
    import Products.ATContentTypes.content  # noqa
  File "/home/jenkins/workspace/plone-5.0-python-2.7-at/src/Products.ATContentTypes/Products/ATContentTypes/content/__init__.py", line 2, in <module>
    import Products.ATContentTypes.content.link  # noqa
  File "/home/jenkins/workspace/plone-5.0-python-2.7-at/src/Products.ATContentTypes/Products/ATContentTypes/content/link.py", line 3, in <module>
    from Products.Archetypes.atapi import Schema
  File "/home/jenkins/workspace/plone-5.0-python-2.7-at/src/Products.Archetypes/Products/Archetypes/atapi.py", line 32, in <module>
    from Products.Archetypes.BaseObject import BaseObject
  File "/home/jenkins/workspace/plone-5.0-python-2.7-at/src/Products.Archetypes/Products/Archetypes/BaseObject.py", line 114, in <module>
    class BaseObject(Referenceable):
  File "/home/jenkins/workspace/plone-5.0-python-2.7-at/src/Products.Archetypes/Products/Archetypes/BaseObject.py", line 133, in BaseObject
    implements(IBaseObject, IReferenceable)


FAILED:  Products.Archetypes.tests.test_copying.Startup

Error Message:
name 'implements' is not defined

Stack Trace:
name 'implements' is not defined

  File "/home/jenkins/workspace/plone-5.0-python-2.7-at/src/Products.Archetypes/Products/Archetypes/tests/test_copying.py", line 37, in <module>
    from Products.Archetypes.tests.atsitetestcase import ATSiteTestCase
  File "/home/jenkins/workspace/plone-5.0-python-2.7-at/src/Products.Archetypes/Products/Archetypes/tests/atsitetestcase.py", line 1, in <module>
    from Products.Archetypes.tests.attestcase import ATTestCase as ATSiteTestCase
  File "/home/jenkins/workspace/plone-5.0-python-2.7-at/src/Products.Archetypes/Products/Archetypes/tests/attestcase.py", line 1, in <module>
    from plone.app.testing import bbb
  File "/home/jenkins/.buildout/eggs/plone.app.testing-5.0.6-py2.7.egg/plone/app/testing/__init__.py", line 4, in <module>
    from plone.app.testing.helpers import applyProfile
  File "/home/jenkins/.buildout/eggs/plone.app.testing-5.0.6-py2.7.egg/plone/app/testing/helpers.py", line 5, in <module>
    from plone.app.testing import layers
  File "/home/jenkins/.buildout/eggs/plone.app.testing-5.0.6-py2.7.egg/plone/app/testing/layers.py", line 27, in <module>
    class PloneFixture(Layer):
  File "/home/jenkins/.buildout/eggs/plone.app.testing-5.0.6-py2.7.egg/plone/app/testing/layers.py", line 81, in PloneFixture
    import Products.PasswordResetTool  # noqa
  File "/home/jenkins/.buildout/eggs/Products.PasswordResetTool-2.2.3-py2.7.egg/Products/PasswordResetTool/__init__.py", line 4, in <module>
    import PasswordResetTool
  File "/home/jenkins/.buildout/eggs/Products.PasswordResetTool-2.2.3-py2.7.egg/Products/PasswordResetTool/PasswordResetTool.py", line 24, in <module>
    from Products.CMFPlone.interfaces import ISecuritySchema
  File "/home/jenkins/workspace/plone-5.0-python-2.7-at/src/Products.CMFPlone/Products/CMFPlone/__init__.py", line 228, in <module>
    from Products.CMFPlone import earlypatches  # noqa
  File "/home/jenkins/workspace/plone-5.0-python-2.7-at/src/Products.CMFPlone/Products/CMFPlone/earlypatches/__init__.py", line 2, in <module>
    import security  # noqa
  File "/home/jenkins/workspace/plone-5.0-python-2.7-at/src/Products.CMFPlone/Products/CMFPlone/earlypatches/security.py", line 86, in <module>
    exec code in utils.getToolByName.func_globals
  File "<string>", line 5, in <module>
  File "/home/jenkins/workspace/plone-5.0-python-2.7-at/src/Products.ATContentTypes/Products/ATContentTypes/__init__.py", line 33, in <module>
    import Products.ATContentTypes.content  # noqa
  File "/home/jenkins/workspace/plone-5.0-python-2.7-at/src/Products.ATContentTypes/Products/ATContentTypes/content/__init__.py", line 2, in <module>
    import Products.ATContentTypes.content.link  # noqa
  File "/home/jenkins/workspace/plone-5.0-python-2.7-at/src/Products.ATContentTypes/Products/ATContentTypes/content/link.py", line 3, in <module>
    from Products.Archetypes.atapi import Schema
  File "/home/jenkins/workspace/plone-5.0-python-2.7-at/src/Products.Archetypes/Products/Archetypes/atapi.py", line 32, in <module>
    from Products.Archetypes.BaseObject import BaseObject
  File "/home/jenkins/workspace/plone-5.0-python-2.7-at/src/Products.Archetypes/Products/Archetypes/BaseObject.py", line 114, in <module>
    class BaseObject(Referenceable):
  File "/home/jenkins/workspace/plone-5.0-python-2.7-at/src/Products.Archetypes/Products/Archetypes/BaseObject.py", line 133, in BaseObject
    implements(IBaseObject, IReferenceable)


FAILED:  Products.Archetypes.tests.test_datecomponents.Startup

Error Message:
name 'implements' is not defined

Stack Trace:
name 'implements' is not defined

  File "/home/jenkins/workspace/plone-5.0-python-2.7-at/src/Products.Archetypes/Products/Archetypes/tests/test_datecomponents.py", line 1, in <module>
    from Products.Archetypes.tests.atsitetestcase import ATFunctionalSiteTestCase
  File "/home/jenkins/workspace/plone-5.0-python-2.7-at/src/Products.Archetypes/Products/Archetypes/tests/atsitetestcase.py", line 1, in <module>
    from Products.Archetypes.tests.attestcase import ATTestCase as ATSiteTestCase
  File "/home/jenkins/workspace/plone-5.0-python-2.7-at/src/Products.Archetypes/Products/Archetypes/tests/attestcase.py", line 1, in <module>
    from plone.app.testing import bbb
  File "/home/jenkins/.buildout/eggs/plone.app.testing-5.0.6-py2.7.egg/plone/app/testing/__init__.py", line 4, in <module>
    from plone.app.testing.helpers import applyProfile
  File "/home/jenkins/.buildout/eggs/plone.app.testing-5.0.6-py2.7.egg/plone/app/testing/helpers.py", line 5, in <module>
    from plone.app.testing import layers
  File "/home/jenkins/.buildout/eggs/plone.app.testing-5.0.6-py2.7.egg/plone/app/testing/layers.py", line 27, in <module>
    class PloneFixture(Layer):
  File "/home/jenkins/.buildout/eggs/plone.app.testing-5.0.6-py2.7.egg/plone/app/testing/layers.py", line 81, in PloneFixture
    import Products.PasswordResetTool  # noqa
  File "/home/jenkins/.buildout/eggs/Products.PasswordResetTool-2.2.3-py2.7.egg/Products/PasswordResetTool/__init__.py", line 4, in <module>
    import PasswordResetTool
  File "/home/jenkins/.buildout/eggs/Products.PasswordResetTool-2.2.3-py2.7.egg/Products/PasswordResetTool/PasswordResetTool.py", line 24, in <module>
    from Products.CMFPlone.interfaces import ISecuritySchema
  File "/home/jenkins/workspace/plone-5.0-python-2.7-at/src/Products.CMFPlone/Products/CMFPlone/__init__.py", line 228, in <module>
    from Products.CMFPlone import earlypatches  # noqa
  File "/home/jenkins/workspace/plone-5.0-python-2.7-at/src/Products.CMFPlone/Products/CMFPlone/earlypatches/__init__.py", line 2, in <module>
    import security  # noqa
  File "/home/jenkins/workspace/plone-5.0-python-2.7-at/src/Products.CMFPlone/Products/CMFPlone/earlypatches/security.py", line 86, in <module>
    exec code in utils.getToolByName.func_globals
  File "<string>", line 5, in <module>
  File "/home/jenkins/workspace/plone-5.0-python-2.7-at/src/Products.ATContentTypes/Products/ATContentTypes/__init__.py", line 33, in <module>
    import Products.ATContentTypes.content  # noqa
  File "/home/jenkins/workspace/plone-5.0-python-2.7-at/src/Products.ATContentTypes/Products/ATContentTypes/content/__init__.py", line 2, in <module>
    import Products.ATContentTypes.content.link  # noqa
  File "/home/jenkins/workspace/plone-5.0-python-2.7-at/src/Products.ATContentTypes/Products/ATContentTypes/content/link.py", line 3, in <module>
    from Products.Archetypes.atapi import Schema
  File "/home/jenkins/workspace/plone-5.0-python-2.7-at/src/Products.Archetypes/Products/Archetypes/atapi.py", line 32, in <module>
    from Products.Archetypes.BaseObject import BaseObject
  File "/home/jenkins/workspace/plone-5.0-python-2.7-at/src/Products.Archetypes/Products/Archetypes/BaseObject.py", line 114, in <module>
    class BaseObject(Referenceable):
  File "/home/jenkins/workspace/plone-5.0-python-2.7-at/src/Products.Archetypes/Products/Archetypes/BaseObject.py", line 133, in BaseObject
    implements(IBaseObject, IReferenceable)


FAILED:  Products.Archetypes.tests.test_default_mimetypes.Startup

Error Message:
name 'implements' is not defined

Stack Trace:
name 'implements' is not defined

  File "/home/jenkins/workspace/plone-5.0-python-2.7-at/src/Products.Archetypes/Products/Archetypes/tests/test_default_mimetypes.py", line 3, in <module>
    from Products.Archetypes.tests.atsitetestcase import ATSiteTestCase
  File "/home/jenkins/workspace/plone-5.0-python-2.7-at/src/Products.Archetypes/Products/Archetypes/tests/atsitetestcase.py", line 1, in <module>
    from Products.Archetypes.tests.attestcase import ATTestCase as ATSiteTestCase
  File "/home/jenkins/workspace/plone-5.0-python-2.7-at/src/Products.Archetypes/Products/Archetypes/tests/attestcase.py", line 1, in <module>
    from plone.app.testing import bbb
  File "/home/jenkins/.buildout/eggs/plone.app.testing-5.0.6-py2.7.egg/plone/app/testing/__init__.py", line 4, in <module>
    from plone.app.testing.helpers import applyProfile
  File "/home/jenkins/.buildout/eggs/plone.app.testing-5.0.6-py2.7.egg/plone/app/testing/helpers.py", line 5, in <module>
    from plone.app.testing import layers
  File "/home/jenkins/.buildout/eggs/plone.app.testing-5.0.6-py2.7.egg/plone/app/testing/layers.py", line 27, in <module>
    class PloneFixture(Layer):
  File "/home/jenkins/.buildout/eggs/plone.app.testing-5.0.6-py2.7.egg/plone/app/testing/layers.py", line 81, in PloneFixture
    import Products.PasswordResetTool  # noqa
  File "/home/jenkins/.buildout/eggs/Products.PasswordResetTool-2.2.3-py2.7.egg/Products/PasswordResetTool/__init__.py", line 4, in <module>
    import PasswordResetTool
  File "/home/jenkins/.buildout/eggs/Products.PasswordResetTool-2.2.3-py2.7.egg/Products/PasswordResetTool/PasswordResetTool.py", line 24, in <module>
    from Products.CMFPlone.interfaces import ISecuritySchema
  File "/home/jenkins/workspace/plone-5.0-python-2.7-at/src/Products.CMFPlone/Products/CMFPlone/__init__.py", line 228, in <module>
    from Products.CMFPlone import earlypatches  # noqa
  File "/home/jenkins/workspace/plone-5.0-python-2.7-at/src/Products.CMFPlone/Products/CMFPlone/earlypatches/__init__.py", line 2, in <module>
    import security  # noqa
  File "/home/jenkins/workspace/plone-5.0-python-2.7-at/src/Products.CMFPlone/Products/CMFPlone/earlypatches/security.py", line 86, in <module>
    exec code in utils.getToolByName.func_globals
  File "<string>", line 5, in <module>
  File "/home/jenkins/workspace/plone-5.0-python-2.7-at/src/Products.ATContentTypes/Products/ATContentTypes/__init__.py", line 33, in <module>
    import Products.ATContentTypes.content  # noqa
  File "/home/jenkins/workspace/plone-5.0-python-2.7-at/src/Products.ATContentTypes/Products/ATContentTypes/content/__init__.py", line 2, in <module>
    import Products.ATContentTypes.content.link  # noqa
  File "/home/jenkins/workspace/plone-5.0-python-2.7-at/src/Products.ATContentTypes/Products/ATContentTypes/content/link.py", line 3, in <module>
    from Products.Archetypes.atapi import Schema
  File "/home/jenkins/workspace/plone-5.0-python-2.7-at/src/Products.Archetypes/Products/Archetypes/atapi.py", line 32, in <module>
    from Products.Archetypes.BaseObject import BaseObject
  File "/home/jenkins/workspace/plone-5.0-python-2.7-at/src/Products.Archetypes/Products/Archetypes/BaseObject.py", line 114, in <module>
    class BaseObject(Referenceable):
  File "/home/jenkins/workspace/plone-5.0-python-2.7-at/src/Products.Archetypes/Products/Archetypes/BaseObject.py", line 133, in BaseObject
    implements(IBaseObject, IReferenceable)


FAILED:  Products.Archetypes.tests.test_doctests.Startup

Error Message:
name 'implements' is not defined

Stack Trace:
name 'implements' is not defined

  File "/home/jenkins/workspace/plone-5.0-python-2.7-at/src/Products.Archetypes/Products/Archetypes/tests/test_doctests.py", line 5, in <module>
    from .attestcase import AT_FUNCTIONAL_TESTING
  File "/home/jenkins/workspace/plone-5.0-python-2.7-at/src/Products.Archetypes/Products/Archetypes/tests/attestcase.py", line 1, in <module>
    from plone.app.testing import bbb
  File "/home/jenkins/.buildout/eggs/plone.app.testing-5.0.6-py2.7.egg/plone/app/testing/__init__.py", line 4, in <module>
    from plone.app.testing.helpers import applyProfile
  File "/home/jenkins/.buildout/eggs/plone.app.testing-5.0.6-py2.7.egg/plone/app/testing/helpers.py", line 5, in <module>
    from plone.app.testing import layers
  File "/home/jenkins/.buildout/eggs/plone.app.testing-5.0.6-py2.7.egg/plone/app/testing/layers.py", line 27, in <module>
    class PloneFixture(Layer):
  File "/home/jenkins/.buildout/eggs/plone.app.testing-5.0.6-py2.7.egg/plone/app/testing/layers.py", line 81, in PloneFixture
    import Products.PasswordResetTool  # noqa
  File "/home/jenkins/.buildout/eggs/Products.PasswordResetTool-2.2.3-py2.7.egg/Products/PasswordResetTool/__init__.py", line 4, in <module>
    import PasswordResetTool
  File "/home/jenkins/.buildout/eggs/Products.PasswordResetTool-2.2.3-py2.7.egg/Products/PasswordResetTool/PasswordResetTool.py", line 24, in <module>
    from Products.CMFPlone.interfaces import ISecuritySchema
  File "/home/jenkins/workspace/plone-5.0-python-2.7-at/src/Products.CMFPlone/Products/CMFPlone/__init__.py", line 228, in <module>
    from Products.CMFPlone import earlypatches  # noqa
  File "/home/jenkins/workspace/plone-5.0-python-2.7-at/src/Products.CMFPlone/Products/CMFPlone/earlypatches/__init__.py", line 2, in <module>
    import security  # noqa
  File "/home/jenkins/workspace/plone-5.0-python-2.7-at/src/Products.CMFPlone/Products/CMFPlone/earlypatches/security.py", line 86, in <module>
    exec code in utils.getToolByName.func_globals
  File "<string>", line 5, in <module>
  File "/home/jenkins/workspace/plone-5.0-python-2.7-at/src/Products.ATContentTypes/Products/ATContentTypes/__init__.py", line 33, in <module>
    import Products.ATContentTypes.content  # noqa
  File "/home/jenkins/workspace/plone-5.0-python-2.7-at/src/Products.ATContentTypes/Products/ATContentTypes/content/__init__.py", line 2, in <module>
    import Products.ATContentTypes.content.link  # noqa
  File "/home/jenkins/workspace/plone-5.0-python-2.7-at/src/Products.ATContentTypes/Products/ATContentTypes/content/link.py", line 3, in <module>
    from Products.Archetypes.atapi import Schema
  File "/home/jenkins/workspace/plone-5.0-python-2.7-at/src/Products.Archetypes/Products/Archetypes/atapi.py", line 32, in <module>
    from Products.Archetypes.BaseObject import BaseObject
  File "/home/jenkins/workspace/plone-5.0-python-2.7-at/src/Products.Archetypes/Products/Archetypes/BaseObject.py", line 114, in <module>
    class BaseObject(Referenceable):
  File "/home/jenkins/workspace/plone-5.0-python-2.7-at/src/Products.Archetypes/Products/Archetypes/BaseObject.py", line 133, in BaseObject
    implements(IBaseObject, IReferenceable)


FAILED:  Products.Archetypes.tests.test_event.Startup

Error Message:
name 'implements' is not defined

Stack Trace:
name 'implements' is not defined

  File "/home/jenkins/workspace/plone-5.0-python-2.7-at/src/Products.Archetypes/Products/Archetypes/tests/test_event.py", line 8, in <module>
    from Products.Archetypes.tests.atsitetestcase import ATSiteTestCase
  File "/home/jenkins/workspace/plone-5.0-python-2.7-at/src/Products.Archetypes/Products/Archetypes/tests/atsitetestcase.py", line 1, in <module>
    from Products.Archetypes.tests.attestcase import ATTestCase as ATSiteTestCase
  File "/home/jenkins/workspace/plone-5.0-python-2.7-at/src/Products.Archetypes/Products/Archetypes/tests/attestcase.py", line 1, in <module>
    from plone.app.testing import bbb
  File "/home/jenkins/.buildout/eggs/plone.app.testing-5.0.6-py2.7.egg/plone/app/testing/__init__.py", line 4, in <module>
    from plone.app.testing.helpers import applyProfile
  File "/home/jenkins/.buildout/eggs/plone.app.testing-5.0.6-py2.7.egg/plone/app/testing/helpers.py", line 5, in <module>
    from plone.app.testing import layers
  File "/home/jenkins/.buildout/eggs/plone.app.testing-5.0.6-py2.7.egg/plone/app/testing/layers.py", line 27, in <module>
    class PloneFixture(Layer):
  File "/home/jenkins/.buildout/eggs/plone.app.testing-5.0.6-py2.7.egg/plone/app/testing/layers.py", line 81, in PloneFixture
    import Products.PasswordResetTool  # noqa
  File "/home/jenkins/.buildout/eggs/Products.PasswordResetTool-2.2.3-py2.7.egg/Products/PasswordResetTool/__init__.py", line 4, in <module>
    import PasswordResetTool
  File "/home/jenkins/.buildout/eggs/Products.PasswordResetTool-2.2.3-py2.7.egg/Products/PasswordResetTool/PasswordResetTool.py", line 24, in <module>
    from Products.CMFPlone.interfaces import ISecuritySchema
  File "/home/jenkins/workspace/plone-5.0-python-2.7-at/src/Products.CMFPlone/Products/CMFPlone/__init__.py", line 228, in <module>
    from Products.CMFPlone import earlypatches  # noqa
  File "/home/jenkins/workspace/plone-5.0-python-2.7-at/src/Products.CMFPlone/Products/CMFPlone/earlypatches/__init__.py", line 2, in <module>
    import security  # noqa
  File "/home/jenkins/workspace/plone-5.0-python-2.7-at/src/Products.CMFPlone/Products/CMFPlone/earlypatches/security.py", line 86, in <module>
    exec code in utils.getToolByName.func_globals
  File "<string>", line 5, in <module>
  File "/home/jenkins/workspace/plone-5.0-python-2.7-at/src/Products.ATContentTypes/Products/ATContentTypes/__init__.py", line 33, in <module>
    import Products.ATContentTypes.content  # noqa
  File "/home/jenkins/workspace/plone-5.0-python-2.7-at/src/Products.ATContentTypes/Products/ATContentTypes/content/__init__.py", line 2, in <module>
    import Products.ATContentTypes.content.link  # noqa
  File "/home/jenkins/workspace/plone-5.0-python-2.7-at/src/Products.ATContentTypes/Products/ATContentTypes/content/link.py", line 3, in <module>
    from Products.Archetypes.atapi import Schema
  File "/home/jenkins/workspace/plone-5.0-python-2.7-at/src/Products.Archetypes/Products/Archetypes/atapi.py", line 32, in <module>
    from Products.Archetypes.BaseObject import BaseObject
  File "/home/jenkins/workspace/plone-5.0-python-2.7-at/src/Products.Archetypes/Products/Archetypes/BaseObject.py", line 114, in <module>
    class BaseObject(Referenceable):
  File "/home/jenkins/workspace/plone-5.0-python-2.7-at/src/Products.Archetypes/Products/Archetypes/BaseObject.py", line 133, in BaseObject
    implements(IBaseObject, IReferenceable)


FAILED:  Products.Archetypes.tests.test_extensions_utils.Startup

Error Message:
name 'implements' is not defined

Stack Trace:
name 'implements' is not defined

  File "/home/jenkins/workspace/plone-5.0-python-2.7-at/src/Products.Archetypes/Products/Archetypes/tests/test_extensions_utils.py", line 3, in <module>
    from Products.Archetypes.tests.atsitetestcase import ATSiteTestCase
  File "/home/jenkins/workspace/plone-5.0-python-2.7-at/src/Products.Archetypes/Products/Archetypes/tests/atsitetestcase.py", line 1, in <module>
    from Products.Archetypes.tests.attestcase import ATTestCase as ATSiteTestCase
  File "/home/jenkins/workspace/plone-5.0-python-2.7-at/src/Products.Archetypes/Products/Archetypes/tests/attestcase.py", line 1, in <module>
    from plone.app.testing import bbb
  File "/home/jenkins/.buildout/eggs/plone.app.testing-5.0.6-py2.7.egg/plone/app/testing/__init__.py", line 4, in <module>
    from plone.app.testing.helpers import applyProfile
  File "/home/jenkins/.buildout/eggs/plone.app.testing-5.0.6-py2.7.egg/plone/app/testing/helpers.py", line 5, in <module>
    from plone.app.testing import layers
  File "/home/jenkins/.buildout/eggs/plone.app.testing-5.0.6-py2.7.egg/plone/app/testing/layers.py", line 27, in <module>
    class PloneFixture(Layer):
  File "/home/jenkins/.buildout/eggs/plone.app.testing-5.0.6-py2.7.egg/plone/app/testing/layers.py", line 81, in PloneFixture
    import Products.PasswordResetTool  # noqa
  File "/home/jenkins/.buildout/eggs/Products.PasswordResetTool-2.2.3-py2.7.egg/Products/PasswordResetTool/__init__.py", line 4, in <module>
    import PasswordResetTool
  File "/home/jenkins/.buildout/eggs/Products.PasswordResetTool-2.2.3-py2.7.egg/Products/PasswordResetTool/PasswordResetTool.py", line 24, in <module>
    from Products.CMFPlone.interfaces import ISecuritySchema
  File "/home/jenkins/workspace/plone-5.0-python-2.7-at/src/Products.CMFPlone/Products/CMFPlone/__init__.py", line 228, in <module>
    from Products.CMFPlone import earlypatches  # noqa
  File "/home/jenkins/workspace/plone-5.0-python-2.7-at/src/Products.CMFPlone/Products/CMFPlone/earlypatches/__init__.py", line 2, in <module>
    import security  # noqa
  File "/home/jenkins/workspace/plone-5.0-python-2.7-at/src/Products.CMFPlone/Products/CMFPlone/earlypatches/security.py", line 86, in <module>
    exec code in utils.getToolByName.func_globals
  File "<string>", line 5, in <module>
  File "/home/jenkins/workspace/plone-5.0-python-2.7-at/src/Products.ATContentTypes/Products/ATContentTypes/__init__.py", line 33, in <module>
    import Products.ATContentTypes.content  # noqa
  File "/home/jenkins/workspace/plone-5.0-python-2.7-at/src/Products.ATContentTypes/Products/ATContentTypes/content/__init__.py", line 2, in <module>
    import Products.ATContentTypes.content.link  # noqa
  File "/home/jenkins/workspace/plone-5.0-python-2.7-at/src/Products.ATContentTypes/Products/ATContentTypes/content/link.py", line 3, in <module>
    from Products.Archetypes.atapi import Schema
  File "/home/jenkins/workspace/plone-5.0-python-2.7-at/src/Products.Archetypes/Products/Archetypes/atapi.py", line 32, in <module>
    from Products.Archetypes.BaseObject import BaseObject
  File "/home/jenkins/workspace/plone-5.0-python-2.7-at/src/Products.Archetypes/Products/Archetypes/BaseObject.py", line 114, in <module>
    class BaseObject(Referenceable):
  File "/home/jenkins/workspace/plone-5.0-python-2.7-at/src/Products.Archetypes/Products/Archetypes/BaseObject.py", line 133, in BaseObject
    implements(IBaseObject, IReferenceable)


FAILED:  Products.Archetypes.tests.test_externaleditor.Startup

Error Message:
name 'implements' is not defined

Stack Trace:
name 'implements' is not defined

  File "/home/jenkins/workspace/plone-5.0-python-2.7-at/src/Products.Archetypes/Products/Archetypes/tests/test_externaleditor.py", line 26, in <module>
    from Products.Archetypes.tests.atsitetestcase import ATSiteTestCase
  File "/home/jenkins/workspace/plone-5.0-python-2.7-at/src/Products.Archetypes/Products/Archetypes/tests/atsitetestcase.py", line 1, in <module>
    from Products.Archetypes.tests.attestcase import ATTestCase as ATSiteTestCase
  File "/home/jenkins/workspace/plone-5.0-python-2.7-at/src/Products.Archetypes/Products/Archetypes/tests/attestcase.py", line 1, in <module>
    from plone.app.testing import bbb
  File "/home/jenkins/.buildout/eggs/plone.app.testing-5.0.6-py2.7.egg/plone/app/testing/__init__.py", line 4, in <module>
    from plone.app.testing.helpers import applyProfile
  File "/home/jenkins/.buildout/eggs/plone.app.testing-5.0.6-py2.7.egg/plone/app/testing/helpers.py", line 5, in <module>
    from plone.app.testing import layers
  File "/home/jenkins/.buildout/eggs/plone.app.testing-5.0.6-py2.7.egg/plone/app/testing/layers.py", line 27, in <module>
    class PloneFixture(Layer):
  File "/home/jenkins/.buildout/eggs/plone.app.testing-5.0.6-py2.7.egg/plone/app/testing/layers.py", line 81, in PloneFixture
    import Products.PasswordResetTool  # noqa
  File "/home/jenkins/.buildout/eggs/Products.PasswordResetTool-2.2.3-py2.7.egg/Products/PasswordResetTool/__init__.py", line 4, in <module>
    import PasswordResetTool
  File "/home/jenkins/.buildout/eggs/Products.PasswordResetTool-2.2.3-py2.7.egg/Products/PasswordResetTool/PasswordResetTool.py", line 24, in <module>
    from Products.CMFPlone.interfaces import ISecuritySchema
  File "/home/jenkins/workspace/plone-5.0-python-2.7-at/src/Products.CMFPlone/Products/CMFPlone/__init__.py", line 228, in <module>
    from Products.CMFPlone import earlypatches  # noqa
  File "/home/jenkins/workspace/plone-5.0-python-2.7-at/src/Products.CMFPlone/Products/CMFPlone/earlypatches/__init__.py", line 2, in <module>
    import security  # noqa
  File "/home/jenkins/workspace/plone-5.0-python-2.7-at/src/Products.CMFPlone/Products/CMFPlone/earlypatches/security.py", line 86, in <module>
    exec code in utils.getToolByName.func_globals
  File "<string>", line 5, in <module>
  File "/home/jenkins/workspace/plone-5.0-python-2.7-at/src/Products.ATContentTypes/Products/ATContentTypes/__init__.py", line 33, in <module>
    import Products.ATContentTypes.content  # noqa
  File "/home/jenkins/workspace/plone-5.0-python-2.7-at/src/Products.ATContentTypes/Products/ATContentTypes/content/__init__.py", line 2, in <module>
    import Products.ATContentTypes.content.link  # noqa
  File "/home/jenkins/workspace/plone-5.0-python-2.7-at/src/Products.ATContentTypes/Products/ATContentTypes/content/link.py", line 3, in <module>
    from Products.Archetypes.atapi import Schema
  File "/home/jenkins/workspace/plone-5.0-python-2.7-at/src/Products.Archetypes/Products/Archetypes/atapi.py", line 32, in <module>
    from Products.Archetypes.BaseObject import BaseObject
  File "/home/jenkins/workspace/plone-5.0-python-2.7-at/src/Products.Archetypes/Products/Archetypes/BaseObject.py", line 114, in <module>
    class BaseObject(Referenceable):
  File "/home/jenkins/workspace/plone-5.0-python-2.7-at/src/Products.Archetypes/Products/Archetypes/BaseObject.py", line 133, in BaseObject
    implements(IBaseObject, IReferenceable)


FAILED:  Products.Archetypes.tests.test_fields.Startup

Error Message:
name 'implements' is not defined

Stack Trace:
name 'implements' is not defined

  File "/home/jenkins/workspace/plone-5.0-python-2.7-at/src/Products.Archetypes/Products/Archetypes/tests/test_fields.py", line 36, in <module>
    from plone.app.testing import PLONE_SITE_ID as portal_name
  File "/home/jenkins/.buildout/eggs/plone.app.testing-5.0.6-py2.7.egg/plone/app/testing/__init__.py", line 4, in <module>
    from plone.app.testing.helpers import applyProfile
  File "/home/jenkins/.buildout/eggs/plone.app.testing-5.0.6-py2.7.egg/plone/app/testing/helpers.py", line 5, in <module>
    from plone.app.testing import layers
  File "/home/jenkins/.buildout/eggs/plone.app.testing-5.0.6-py2.7.egg/plone/app/testing/layers.py", line 27, in <module>
    class PloneFixture(Layer):
  File "/home/jenkins/.buildout/eggs/plone.app.testing-5.0.6-py2.7.egg/plone/app/testing/layers.py", line 81, in PloneFixture
    import Products.PasswordResetTool  # noqa
  File "/home/jenkins/.buildout/eggs/Products.PasswordResetTool-2.2.3-py2.7.egg/Products/PasswordResetTool/__init__.py", line 4, in <module>
    import PasswordResetTool
  File "/home/jenkins/.buildout/eggs/Products.PasswordResetTool-2.2.3-py2.7.egg/Products/PasswordResetTool/PasswordResetTool.py", line 24, in <module>
    from Products.CMFPlone.interfaces import ISecuritySchema
  File "/home/jenkins/workspace/plone-5.0-python-2.7-at/src/Products.CMFPlone/Products/CMFPlone/__init__.py", line 228, in <module>
    from Products.CMFPlone import earlypatches  # noqa
  File "/home/jenkins/workspace/plone-5.0-python-2.7-at/src/Products.CMFPlone/Products/CMFPlone/earlypatches/__init__.py", line 2, in <module>
    import security  # noqa
  File "/home/jenkins/workspace/plone-5.0-python-2.7-at/src/Products.CMFPlone/Products/CMFPlone/earlypatches/security.py", line 86, in <module>
    exec code in utils.getToolByName.func_globals
  File "<string>", line 5, in <module>
  File "/home/jenkins/workspace/plone-5.0-python-2.7-at/src/Products.ATContentTypes/Products/ATContentTypes/__init__.py", line 33, in <module>
    import Products.ATContentTypes.content  # noqa
  File "/home/jenkins/workspace/plone-5.0-python-2.7-at/src/Products.ATContentTypes/Products/ATContentTypes/content/__init__.py", line 2, in <module>
    import Products.ATContentTypes.content.link  # noqa
  File "/home/jenkins/workspace/plone-5.0-python-2.7-at/src/Products.ATContentTypes/Products/ATContentTypes/content/link.py", line 3, in <module>
    from Products.Archetypes.atapi import Schema
  File "/home/jenkins/workspace/plone-5.0-python-2.7-at/src/Products.Archetypes/Products/Archetypes/atapi.py", line 32, in <module>
    from Products.Archetypes.BaseObject import BaseObject
  File "/home/jenkins/workspace/plone-5.0-python-2.7-at/src/Products.Archetypes/Products/Archetypes/BaseObject.py", line 114, in <module>
    class BaseObject(Referenceable):
  File "/home/jenkins/workspace/plone-5.0-python-2.7-at/src/Products.Archetypes/Products/Archetypes/BaseObject.py", line 133, in BaseObject
    implements(IBaseObject, IReferenceable)


FAILED:  Products.Archetypes.tests.test_fieldvalidation.Startup

Error Message:
name 'implements' is not defined

Stack Trace:
name 'implements' is not defined

  File "/home/jenkins/workspace/plone-5.0-python-2.7-at/src/Products.Archetypes/Products/Archetypes/tests/test_fieldvalidation.py", line 26, in <module>
    from Products.Archetypes.tests.attestcase import ATTestCase
  File "/home/jenkins/workspace/plone-5.0-python-2.7-at/src/Products.Archetypes/Products/Archetypes/tests/attestcase.py", line 1, in <module>
    from plone.app.testing import bbb
  File "/home/jenkins/.buildout/eggs/plone.app.testing-5.0.6-py2.7.egg/plone/app/testing/__init__.py", line 4, in <module>
    from plone.app.testing.helpers import applyProfile
  File "/home/jenkins/.buildout/eggs/plone.app.testing-5.0.6-py2.7.egg/plone/app/testing/helpers.py", line 5, in <module>
    from plone.app.testing import layers
  File "/home/jenkins/.buildout/eggs/plone.app.testing-5.0.6-py2.7.egg/plone/app/testing/layers.py", line 27, in <module>
    class PloneFixture(Layer):
  File "/home/jenkins/.buildout/eggs/plone.app.testing-5.0.6-py2.7.egg/plone/app/testing/layers.py", line 81, in PloneFixture
    import Products.PasswordResetTool  # noqa
  File "/home/jenkins/.buildout/eggs/Products.PasswordResetTool-2.2.3-py2.7.egg/Products/PasswordResetTool/__init__.py", line 4, in <module>
    import PasswordResetTool
  File "/home/jenkins/.buildout/eggs/Products.PasswordResetTool-2.2.3-py2.7.egg/Products/PasswordResetTool/PasswordResetTool.py", line 24, in <module>
    from Products.CMFPlone.interfaces import ISecuritySchema
  File "/home/jenkins/workspace/plone-5.0-python-2.7-at/src/Products.CMFPlone/Products/CMFPlone/__init__.py", line 228, in <module>
    from Products.CMFPlone import earlypatches  # noqa
  File "/home/jenkins/workspace/plone-5.0-python-2.7-at/src/Products.CMFPlone/Products/CMFPlone/earlypatches/__init__.py", line 2, in <module>
    import security  # noqa
  File "/home/jenkins/workspace/plone-5.0-python-2.7-at/src/Products.CMFPlone/Products/CMFPlone/earlypatches/security.py", line 86, in <module>
    exec code in utils.getToolByName.func_globals
  File "<string>", line 5, in <module>
  File "/home/jenkins/workspace/plone-5.0-python-2.7-at/src/Products.ATContentTypes/Products/ATContentTypes/__init__.py", line 33, in <module>
    import Products.ATContentTypes.content  # noqa
  File "/home/jenkins/workspace/plone-5.0-python-2.7-at/src/Products.ATContentTypes/Products/ATContentTypes/content/__init__.py", line 2, in <module>
    import Products.ATContentTypes.content.link  # noqa
  File "/home/jenkins/workspace/plone-5.0-python-2.7-at/src/Products.ATContentTypes/Products/ATContentTypes/content/link.py", line 3, in <module>
    from Products.Archetypes.atapi import Schema
  File "/home/jenkins/workspace/plone-5.0-python-2.7-at/src/Products.Archetypes/Products/Archetypes/atapi.py", line 32, in <module>
    from Products.Archetypes.BaseObject import BaseObject
  File "/home/jenkins/workspace/plone-5.0-python-2.7-at/src/Products.Archetypes/Products/Archetypes/BaseObject.py", line 114, in <module>
    class BaseObject(Referenceable):
  File "/home/jenkins/workspace/plone-5.0-python-2.7-at/src/Products.Archetypes/Products/Archetypes/BaseObject.py", line 133, in BaseObject
    implements(IBaseObject, IReferenceable)


FAILED:  Products.Archetypes.tests.test_file_upload.Startup

Error Message:
name 'implements' is not defined

Stack Trace:
name 'implements' is not defined

  File "/home/jenkins/workspace/plone-5.0-python-2.7-at/src/Products.Archetypes/Products/Archetypes/tests/test_file_upload.py", line 30, in <module>
    from Products.Archetypes.tests.atsitetestcase import ATSiteTestCase
  File "/home/jenkins/workspace/plone-5.0-python-2.7-at/src/Products.Archetypes/Products/Archetypes/tests/atsitetestcase.py", line 1, in <module>
    from Products.Archetypes.tests.attestcase import ATTestCase as ATSiteTestCase
  File "/home/jenkins/workspace/plone-5.0-python-2.7-at/src/Products.Archetypes/Products/Archetypes/tests/attestcase.py", line 1, in <module>
    from plone.app.testing import bbb
  File "/home/jenkins/.buildout/eggs/plone.app.testing-5.0.6-py2.7.egg/plone/app/testing/__init__.py", line 4, in <module>
    from plone.app.testing.helpers import applyProfile
  File "/home/jenkins/.buildout/eggs/plone.app.testing-5.0.6-py2.7.egg/plone/app/testing/helpers.py", line 5, in <module>
    from plone.app.testing import layers
  File "/home/jenkins/.buildout/eggs/plone.app.testing-5.0.6-py2.7.egg/plone/app/testing/layers.py", line 27, in <module>
    class PloneFixture(Layer):
  File "/home/jenkins/.buildout/eggs/plone.app.testing-5.0.6-py2.7.egg/plone/app/testing/layers.py", line 81, in PloneFixture
    import Products.PasswordResetTool  # noqa
  File "/home/jenkins/.buildout/eggs/Products.PasswordResetTool-2.2.3-py2.7.egg/Products/PasswordResetTool/__init__.py", line 4, in <module>
    import PasswordResetTool
  File "/home/jenkins/.buildout/eggs/Products.PasswordResetTool-2.2.3-py2.7.egg/Products/PasswordResetTool/PasswordResetTool.py", line 24, in <module>
    from Products.CMFPlone.interfaces import ISecuritySchema
  File "/home/jenkins/workspace/plone-5.0-python-2.7-at/src/Products.CMFPlone/Products/CMFPlone/__init__.py", line 228, in <module>
    from Products.CMFPlone import earlypatches  # noqa
  File "/home/jenkins/workspace/plone-5.0-python-2.7-at/src/Products.CMFPlone/Products/CMFPlone/earlypatches/__init__.py", line 2, in <module>
    import security  # noqa
  File "/home/jenkins/workspace/plone-5.0-python-2.7-at/src/Products.CMFPlone/Products/CMFPlone/earlypatches/security.py", line 86, in <module>
    exec code in utils.getToolByName.func_globals
  File "<string>", line 5, in <module>
  File "/home/jenkins/workspace/plone-5.0-python-2.7-at/src/Products.ATContentTypes/Products/ATContentTypes/__init__.py", line 33, in <module>
    import Products.ATContentTypes.content  # noqa
  File "/home/jenkins/workspace/plone-5.0-python-2.7-at/src/Products.ATContentTypes/Products/ATContentTypes/content/__init__.py", line 2, in <module>
    import Products.ATContentTypes.content.link  # noqa
  File "/home/jenkins/workspace/plone-5.0-python-2.7-at/src/Products.ATContentTypes/Products/ATContentTypes/content/link.py", line 3, in <module>
    from Products.Archetypes.atapi import Schema
  File "/home/jenkins/workspace/plone-5.0-python-2.7-at/src/Products.Archetypes/Products/Archetypes/atapi.py", line 32, in <module>
    from Products.Archetypes.BaseObject import BaseObject
  File "/home/jenkins/workspace/plone-5.0-python-2.7-at/src/Products.Archetypes/Products/Archetypes/BaseObject.py", line 114, in <module>
    class BaseObject(Referenceable):
  File "/home/jenkins/workspace/plone-5.0-python-2.7-at/src/Products.Archetypes/Products/Archetypes/BaseObject.py", line 133, in BaseObject
    implements(IBaseObject, IReferenceable)


FAILED:  Products.Archetypes.tests.test_filename.Startup

Error Message:
name 'implements' is not defined

Stack Trace:
name 'implements' is not defined

  File "/home/jenkins/workspace/plone-5.0-python-2.7-at/src/Products.Archetypes/Products/Archetypes/tests/test_filename.py", line 31, in <module>
    from Products.Archetypes.tests.atsitetestcase import ATSiteTestCase
  File "/home/jenkins/workspace/plone-5.0-python-2.7-at/src/Products.Archetypes/Products/Archetypes/tests/atsitetestcase.py", line 1, in <module>
    from Products.Archetypes.tests.attestcase import ATTestCase as ATSiteTestCase
  File "/home/jenkins/workspace/plone-5.0-python-2.7-at/src/Products.Archetypes/Products/Archetypes/tests/attestcase.py", line 1, in <module>
    from plone.app.testing import bbb
  File "/home/jenkins/.buildout/eggs/plone.app.testing-5.0.6-py2.7.egg/plone/app/testing/__init__.py", line 4, in <module>
    from plone.app.testing.helpers import applyProfile
  File "/home/jenkins/.buildout/eggs/plone.app.testing-5.0.6-py2.7.egg/plone/app/testing/helpers.py", line 5, in <module>
    from plone.app.testing import layers
  File "/home/jenkins/.buildout/eggs/plone.app.testing-5.0.6-py2.7.egg/plone/app/testing/layers.py", line 27, in <module>
    class PloneFixture(Layer):
  File "/home/jenkins/.buildout/eggs/plone.app.testing-5.0.6-py2.7.egg/plone/app/testing/layers.py", line 81, in PloneFixture
    import Products.PasswordResetTool  # noqa
  File "/home/jenkins/.buildout/eggs/Products.PasswordResetTool-2.2.3-py2.7.egg/Products/PasswordResetTool/__init__.py", line 4, in <module>
    import PasswordResetTool
  File "/home/jenkins/.buildout/eggs/Products.PasswordResetTool-2.2.3-py2.7.egg/Products/PasswordResetTool/PasswordResetTool.py", line 24, in <module>
    from Products.CMFPlone.interfaces import ISecuritySchema
  File "/home/jenkins/workspace/plone-5.0-python-2.7-at/src/Products.CMFPlone/Products/CMFPlone/__init__.py", line 228, in <module>
    from Products.CMFPlone import earlypatches  # noqa
  File "/home/jenkins/workspace/plone-5.0-python-2.7-at/src/Products.CMFPlone/Products/CMFPlone/earlypatches/__init__.py", line 2, in <module>
    import security  # noqa
  File "/home/jenkins/workspace/plone-5.0-python-2.7-at/src/Products.CMFPlone/Products/CMFPlone/earlypatches/security.py", line 86, in <module>
    exec code in utils.getToolByName.func_globals
  File "<string>", line 5, in <module>
  File "/home/jenkins/workspace/plone-5.0-python-2.7-at/src/Products.ATContentTypes/Products/ATContentTypes/__init__.py", line 33, in <module>
    import Products.ATContentTypes.content  # noqa
  File "/home/jenkins/workspace/plone-5.0-python-2.7-at/src/Products.ATContentTypes/Products/ATContentTypes/content/__init__.py", line 2, in <module>
    import Products.ATContentTypes.content.link  # noqa
  File "/home/jenkins/workspace/plone-5.0-python-2.7-at/src/Products.ATContentTypes/Products/ATContentTypes/content/link.py", line 3, in <module>
    from Products.Archetypes.atapi import Schema
  File "/home/jenkins/workspace/plone-5.0-python-2.7-at/src/Products.Archetypes/Products/Archetypes/atapi.py", line 32, in <module>
    from Products.Archetypes.BaseObject import BaseObject
  File "/home/jenkins/workspace/plone-5.0-python-2.7-at/src/Products.Archetypes/Products/Archetypes/BaseObject.py", line 114, in <module>
    class BaseObject(Referenceable):
  File "/home/jenkins/workspace/plone-5.0-python-2.7-at/src/Products.Archetypes/Products/Archetypes/BaseObject.py", line 133, in BaseObject
    implements(IBaseObject, IReferenceable)


FAILED:  Products.Archetypes.tests.test_functional.Startup

Error Message:
name 'implements' is not defined

Stack Trace:
name 'implements' is not defined

  File "/home/jenkins/workspace/plone-5.0-python-2.7-at/src/Products.Archetypes/Products/Archetypes/tests/test_functional.py", line 26, in <module>
    from plone.app.testing import SITE_OWNER_NAME as portal_owner
  File "/home/jenkins/.buildout/eggs/plone.app.testing-5.0.6-py2.7.egg/plone/app/testing/__init__.py", line 4, in <module>
    from plone.app.testing.helpers import applyProfile
  File "/home/jenkins/.buildout/eggs/plone.app.testing-5.0.6-py2.7.egg/plone/app/testing/helpers.py", line 5, in <module>
    from plone.app.testing import layers
  File "/home/jenkins/.buildout/eggs/plone.app.testing-5.0.6-py2.7.egg/plone/app/testing/layers.py", line 27, in <module>
    class PloneFixture(Layer):
  File "/home/jenkins/.buildout/eggs/plone.app.testing-5.0.6-py2.7.egg/plone/app/testing/layers.py", line 81, in PloneFixture
    import Products.PasswordResetTool  # noqa
  File "/home/jenkins/.buildout/eggs/Products.PasswordResetTool-2.2.3-py2.7.egg/Products/PasswordResetTool/__init__.py", line 4, in <module>
    import PasswordResetTool
  File "/home/jenkins/.buildout/eggs/Products.PasswordResetTool-2.2.3-py2.7.egg/Products/PasswordResetTool/PasswordResetTool.py", line 24, in <module>
    from Products.CMFPlone.interfaces import ISecuritySchema
  File "/home/jenkins/workspace/plone-5.0-python-2.7-at/src/Products.CMFPlone/Products/CMFPlone/__init__.py", line 228, in <module>
    from Products.CMFPlone import earlypatches  # noqa
  File "/home/jenkins/workspace/plone-5.0-python-2.7-at/src/Products.CMFPlone/Products/CMFPlone/earlypatches/__init__.py", line 2, in <module>
    import security  # noqa
  File "/home/jenkins/workspace/plone-5.0-python-2.7-at/src/Products.CMFPlone/Products/CMFPlone/earlypatches/security.py", line 86, in <module>
    exec code in utils.getToolByName.func_globals
  File "<string>", line 5, in <module>
  File "/home/jenkins/workspace/plone-5.0-python-2.7-at/src/Products.ATContentTypes/Products/ATContentTypes/__init__.py", line 33, in <module>
    import Products.ATContentTypes.content  # noqa
  File "/home/jenkins/workspace/plone-5.0-python-2.7-at/src/Products.ATContentTypes/Products/ATContentTypes/content/__init__.py", line 2, in <module>
    import Products.ATContentTypes.content.link  # noqa
  File "/home/jenkins/workspace/plone-5.0-python-2.7-at/src/Products.ATContentTypes/Products/ATContentTypes/content/link.py", line 3, in <module>
    from Products.Archetypes.atapi import Schema
  File "/home/jenkins/workspace/plone-5.0-python-2.7-at/src/Products.Archetypes/Products/Archetypes/atapi.py", line 32, in <module>
    from Products.Archetypes.BaseObject import BaseObject
  File "/home/jenkins/workspace/plone-5.0-python-2.7-at/src/Products.Archetypes/Products/Archetypes/BaseObject.py", line 114, in <module>
    class BaseObject(Referenceable):
  File "/home/jenkins/workspace/plone-5.0-python-2.7-at/src/Products.Archetypes/Products/Archetypes/BaseObject.py", line 133, in BaseObject
    implements(IBaseObject, IReferenceable)


FAILED:  Products.Archetypes.tests.test_index.Startup

Error Message:
name 'implements' is not defined

Stack Trace:
name 'implements' is not defined

  File "/home/jenkins/workspace/plone-5.0-python-2.7-at/src/Products.Archetypes/Products/Archetypes/tests/test_index.py", line 28, in <module>
    from Products.Archetypes.tests.atsitetestcase import ATSiteTestCase
  File "/home/jenkins/workspace/plone-5.0-python-2.7-at/src/Products.Archetypes/Products/Archetypes/tests/atsitetestcase.py", line 1, in <module>
    from Products.Archetypes.tests.attestcase import ATTestCase as ATSiteTestCase
  File "/home/jenkins/workspace/plone-5.0-python-2.7-at/src/Products.Archetypes/Products/Archetypes/tests/attestcase.py", line 1, in <module>
    from plone.app.testing import bbb
  File "/home/jenkins/.buildout/eggs/plone.app.testing-5.0.6-py2.7.egg/plone/app/testing/__init__.py", line 4, in <module>
    from plone.app.testing.helpers import applyProfile
  File "/home/jenkins/.buildout/eggs/plone.app.testing-5.0.6-py2.7.egg/plone/app/testing/helpers.py", line 5, in <module>
    from plone.app.testing import layers
  File "/home/jenkins/.buildout/eggs/plone.app.testing-5.0.6-py2.7.egg/plone/app/testing/layers.py", line 27, in <module>
    class PloneFixture(Layer):
  File "/home/jenkins/.buildout/eggs/plone.app.testing-5.0.6-py2.7.egg/plone/app/testing/layers.py", line 81, in PloneFixture
    import Products.PasswordResetTool  # noqa
  File "/home/jenkins/.buildout/eggs/Products.PasswordResetTool-2.2.3-py2.7.egg/Products/PasswordResetTool/__init__.py", line 4, in <module>
    import PasswordResetTool
  File "/home/jenkins/.buildout/eggs/Products.PasswordResetTool-2.2.3-py2.7.egg/Products/PasswordResetTool/PasswordResetTool.py", line 24, in <module>
    from Products.CMFPlone.interfaces import ISecuritySchema
  File "/home/jenkins/workspace/plone-5.0-python-2.7-at/src/Products.CMFPlone/Products/CMFPlone/__init__.py", line 228, in <module>
    from Products.CMFPlone import earlypatches  # noqa
  File "/home/jenkins/workspace/plone-5.0-python-2.7-at/src/Products.CMFPlone/Products/CMFPlone/earlypatches/__init__.py", line 2, in <module>
    import security  # noqa
  File "/home/jenkins/workspace/plone-5.0-python-2.7-at/src/Products.CMFPlone/Products/CMFPlone/earlypatches/security.py", line 86, in <module>
    exec code in utils.getToolByName.func_globals
  File "<string>", line 5, in <module>
  File "/home/jenkins/workspace/plone-5.0-python-2.7-at/src/Products.ATContentTypes/Products/ATContentTypes/__init__.py", line 33, in <module>
    import Products.ATContentTypes.content  # noqa
  File "/home/jenkins/workspace/plone-5.0-python-2.7-at/src/Products.ATContentTypes/Products/ATContentTypes/content/__init__.py", line 2, in <module>
    import Products.ATContentTypes.content.link  # noqa
  File "/home/jenkins/workspace/plone-5.0-python-2.7-at/src/Products.ATContentTypes/Products/ATContentTypes/content/link.py", line 3, in <module>
    from Products.Archetypes.atapi import Schema
  File "/home/jenkins/workspace/plone-5.0-python-2.7-at/src/Products.Archetypes/Products/Archetypes/atapi.py", line 32, in <module>
    from Products.Archetypes.BaseObject import BaseObject
  File "/home/jenkins/workspace/plone-5.0-python-2.7-at/src/Products.Archetypes/Products/Archetypes/BaseObject.py", line 114, in <module>
    class BaseObject(Referenceable):
  File "/home/jenkins/workspace/plone-5.0-python-2.7-at/src/Products.Archetypes/Products/Archetypes/BaseObject.py", line 133, in BaseObject
    implements(IBaseObject, IReferenceable)


FAILED:  Products.Archetypes.tests.test_interfaces.Startup

Error Message:
name 'implements' is not defined

Stack Trace:
name 'implements' is not defined

  File "/home/jenkins/workspace/plone-5.0-python-2.7-at/src/Products.Archetypes/Products/Archetypes/tests/test_interfaces.py", line 36, in <module>
    from Products.Archetypes.BaseObject import BaseObject
  File "/home/jenkins/workspace/plone-5.0-python-2.7-at/src/Products.Archetypes/Products/Archetypes/BaseObject.py", line 114, in <module>
    class BaseObject(Referenceable):
  File "/home/jenkins/workspace/plone-5.0-python-2.7-at/src/Products.Archetypes/Products/Archetypes/BaseObject.py", line 133, in BaseObject
    implements(IBaseObject, IReferenceable)


FAILED:  Products.Archetypes.tests.test_languagevocabulary.Startup

Error Message:
name 'implements' is not defined

Stack Trace:
name 'implements' is not defined

  File "/home/jenkins/workspace/plone-5.0-python-2.7-at/src/Products.Archetypes/Products/Archetypes/tests/test_languagevocabulary.py", line 3, in <module>
    from Products.Archetypes.atapi import BaseSchema
  File "/home/jenkins/workspace/plone-5.0-python-2.7-at/src/Products.Archetypes/Products/Archetypes/atapi.py", line 32, in <module>
    from Products.Archetypes.BaseObject import BaseObject
  File "/home/jenkins/workspace/plone-5.0-python-2.7-at/src/Products.Archetypes/Products/Archetypes/BaseObject.py", line 114, in <module>
    class BaseObject(Referenceable):
  File "/home/jenkins/workspace/plone-5.0-python-2.7-at/src/Products.Archetypes/Products/Archetypes/BaseObject.py", line 133, in BaseObject
    implements(IBaseObject, IReferenceable)


FAILED:  Products.Archetypes.tests.test_marshaller.Startup

Error Message:
name 'implements' is not defined

Stack Trace:
name 'implements' is not defined

  File "/home/jenkins/workspace/plone-5.0-python-2.7-at/src/Products.Archetypes/Products/Archetypes/tests/test_marshaller.py", line 31, in <module>
    from Products.Archetypes.tests.atsitetestcase import ATSiteTestCase
  File "/home/jenkins/workspace/plone-5.0-python-2.7-at/src/Products.Archetypes/Products/Archetypes/tests/atsitetestcase.py", line 1, in <module>
    from Products.Archetypes.tests.attestcase import ATTestCase as ATSiteTestCase
  File "/home/jenkins/workspace/plone-5.0-python-2.7-at/src/Products.Archetypes/Products/Archetypes/tests/attestcase.py", line 1, in <module>
    from plone.app.testing import bbb
  File "/home/jenkins/.buildout/eggs/plone.app.testing-5.0.6-py2.7.egg/plone/app/testing/__init__.py", line 4, in <module>
    from plone.app.testing.helpers import applyProfile
  File "/home/jenkins/.buildout/eggs/plone.app.testing-5.0.6-py2.7.egg/plone/app/testing/helpers.py", line 5, in <module>
    from plone.app.testing import layers
  File "/home/jenkins/.buildout/eggs/plone.app.testing-5.0.6-py2.7.egg/plone/app/testing/layers.py", line 27, in <module>
    class PloneFixture(Layer):
  File "/home/jenkins/.buildout/eggs/plone.app.testing-5.0.6-py2.7.egg/plone/app/testing/layers.py", line 81, in PloneFixture
    import Products.PasswordResetTool  # noqa
  File "/home/jenkins/.buildout/eggs/Products.PasswordResetTool-2.2.3-py2.7.egg/Products/PasswordResetTool/__init__.py", line 4, in <module>
    import PasswordResetTool
  File "/home/jenkins/.buildout/eggs/Products.PasswordResetTool-2.2.3-py2.7.egg/Products/PasswordResetTool/PasswordResetTool.py", line 24, in <module>
    from Products.CMFPlone.interfaces import ISecuritySchema
  File "/home/jenkins/workspace/plone-5.0-python-2.7-at/src/Products.CMFPlone/Products/CMFPlone/__init__.py", line 228, in <module>
    from Products.CMFPlone import earlypatches  # noqa
  File "/home/jenkins/workspace/plone-5.0-python-2.7-at/src/Products.CMFPlone/Products/CMFPlone/earlypatches/__init__.py", line 2, in <module>
    import security  # noqa
  File "/home/jenkins/workspace/plone-5.0-python-2.7-at/src/Products.CMFPlone/Products/CMFPlone/earlypatches/security.py", line 86, in <module>
    exec code in utils.getToolByName.func_globals
  File "<string>", line 5, in <module>
  File "/home/jenkins/workspace/plone-5.0-python-2.7-at/src/Products.ATContentTypes/Products/ATContentTypes/__init__.py", line 33, in <module>
    import Products.ATContentTypes.content  # noqa
  File "/home/jenkins/workspace/plone-5.0-python-2.7-at/src/Products.ATContentTypes/Products/ATContentTypes/content/__init__.py", line 2, in <module>
    import Products.ATContentTypes.content.link  # noqa
  File "/home/jenkins/workspace/plone-5.0-python-2.7-at/src/Products.ATContentTypes/Products/ATContentTypes/content/link.py", line 3, in <module>
    from Products.Archetypes.atapi import Schema
  File "/home/jenkins/workspace/plone-5.0-python-2.7-at/src/Products.Archetypes/Products/Archetypes/atapi.py", line 32, in <module>
    from Products.Archetypes.BaseObject import BaseObject
  File "/home/jenkins/workspace/plone-5.0-python-2.7-at/src/Products.Archetypes/Products/Archetypes/BaseObject.py", line 114, in <module>
    class BaseObject(Referenceable):
  File "/home/jenkins/workspace/plone-5.0-python-2.7-at/src/Products.Archetypes/Products/Archetypes/BaseObject.py", line 133, in BaseObject
    implements(IBaseObject, IReferenceable)


FAILED:  Products.Archetypes.tests.test_metadata.Startup

Error Message:
name 'implements' is not defined

Stack Trace:
name 'implements' is not defined

  File "/home/jenkins/workspace/plone-5.0-python-2.7-at/src/Products.Archetypes/Products/Archetypes/tests/test_metadata.py", line 29, in <module>
    from Products.Archetypes.tests.atsitetestcase import ATSiteTestCase
  File "/home/jenkins/workspace/plone-5.0-python-2.7-at/src/Products.Archetypes/Products/Archetypes/tests/atsitetestcase.py", line 1, in <module>
    from Products.Archetypes.tests.attestcase import ATTestCase as ATSiteTestCase
  File "/home/jenkins/workspace/plone-5.0-python-2.7-at/src/Products.Archetypes/Products/Archetypes/tests/attestcase.py", line 1, in <module>
    from plone.app.testing import bbb
  File "/home/jenkins/.buildout/eggs/plone.app.testing-5.0.6-py2.7.egg/plone/app/testing/__init__.py", line 4, in <module>
    from plone.app.testing.helpers import applyProfile
  File "/home/jenkins/.buildout/eggs/plone.app.testing-5.0.6-py2.7.egg/plone/app/testing/helpers.py", line 5, in <module>
    from plone.app.testing import layers
  File "/home/jenkins/.buildout/eggs/plone.app.testing-5.0.6-py2.7.egg/plone/app/testing/layers.py", line 27, in <module>
    class PloneFixture(Layer):
  File "/home/jenkins/.buildout/eggs/plone.app.testing-5.0.6-py2.7.egg/plone/app/testing/layers.py", line 81, in PloneFixture
    import Products.PasswordResetTool  # noqa
  File "/home/jenkins/.buildout/eggs/Products.PasswordResetTool-2.2.3-py2.7.egg/Products/PasswordResetTool/__init__.py", line 4, in <module>
    import PasswordResetTool
  File "/home/jenkins/.buildout/eggs/Products.PasswordResetTool-2.2.3-py2.7.egg/Products/PasswordResetTool/PasswordResetTool.py", line 24, in <module>
    from Products.CMFPlone.interfaces import ISecuritySchema
  File "/home/jenkins/workspace/plone-5.0-python-2.7-at/src/Products.CMFPlone/Products/CMFPlone/__init__.py", line 228, in <module>
    from Products.CMFPlone import earlypatches  # noqa
  File "/home/jenkins/workspace/plone-5.0-python-2.7-at/src/Products.CMFPlone/Products/CMFPlone/earlypatches/__init__.py", line 2, in <module>
    import security  # noqa
  File "/home/jenkins/workspace/plone-5.0-python-2.7-at/src/Products.CMFPlone/Products/CMFPlone/earlypatches/security.py", line 86, in <module>
    exec code in utils.getToolByName.func_globals
  File "<string>", line 5, in <module>
  File "/home/jenkins/workspace/plone-5.0-python-2.7-at/src/Products.ATContentTypes/Products/ATContentTypes/__init__.py", line 33, in <module>
    import Products.ATContentTypes.content  # noqa
  File "/home/jenkins/workspace/plone-5.0-python-2.7-at/src/Products.ATContentTypes/Products/ATContentTypes/content/__init__.py", line 2, in <module>
    import Products.ATContentTypes.content.link  # noqa
  File "/home/jenkins/workspace/plone-5.0-python-2.7-at/src/Products.ATContentTypes/Products/ATContentTypes/content/link.py", line 3, in <module>
    from Products.Archetypes.atapi import Schema
  File "/home/jenkins/workspace/plone-5.0-python-2.7-at/src/Products.Archetypes/Products/Archetypes/atapi.py", line 32, in <module>
    from Products.Archetypes.BaseObject import BaseObject
  File "/home/jenkins/workspace/plone-5.0-python-2.7-at/src/Products.Archetypes/Products/Archetypes/BaseObject.py", line 114, in <module>
    class BaseObject(Referenceable):
  File "/home/jenkins/workspace/plone-5.0-python-2.7-at/src/Products.Archetypes/Products/Archetypes/BaseObject.py", line 133, in BaseObject
    implements(IBaseObject, IReferenceable)


FAILED:  Products.Archetypes.tests.test_pawidgets.Startup

Error Message:
name 'implements' is not defined

Stack Trace:
name 'implements' is not defined

  File "/home/jenkins/workspace/plone-5.0-python-2.7-at/src/Products.Archetypes/Products/Archetypes/tests/test_pawidgets.py", line 3, in <module>
    from Products.Archetypes.atapi import BaseContent
  File "/home/jenkins/workspace/plone-5.0-python-2.7-at/src/Products.Archetypes/Products/Archetypes/atapi.py", line 32, in <module>
    from Products.Archetypes.BaseObject import BaseObject
  File "/home/jenkins/workspace/plone-5.0-python-2.7-at/src/Products.Archetypes/Products/Archetypes/BaseObject.py", line 114, in <module>
    class BaseObject(Referenceable):
  File "/home/jenkins/workspace/plone-5.0-python-2.7-at/src/Products.Archetypes/Products/Archetypes/BaseObject.py", line 133, in BaseObject
    implements(IBaseObject, IReferenceable)


FAILED:  Products.Archetypes.tests.test_referenceCatalog.Startup

Error Message:
name 'implements' is not defined

Stack Trace:
name 'implements' is not defined

  File "/home/jenkins/workspace/plone-5.0-python-2.7-at/src/Products.Archetypes/Products/Archetypes/tests/test_referenceCatalog.py", line 33, in <module>
    from Products.Archetypes.tests.atsitetestcase import ATSiteTestCase
  File "/home/jenkins/workspace/plone-5.0-python-2.7-at/src/Products.Archetypes/Products/Archetypes/tests/atsitetestcase.py", line 1, in <module>
    from Products.Archetypes.tests.attestcase import ATTestCase as ATSiteTestCase
  File "/home/jenkins/workspace/plone-5.0-python-2.7-at/src/Products.Archetypes/Products/Archetypes/tests/attestcase.py", line 1, in <module>
    from plone.app.testing import bbb
  File "/home/jenkins/.buildout/eggs/plone.app.testing-5.0.6-py2.7.egg/plone/app/testing/__init__.py", line 4, in <module>
    from plone.app.testing.helpers import applyProfile
  File "/home/jenkins/.buildout/eggs/plone.app.testing-5.0.6-py2.7.egg/plone/app/testing/helpers.py", line 5, in <module>
    from plone.app.testing import layers
  File "/home/jenkins/.buildout/eggs/plone.app.testing-5.0.6-py2.7.egg/plone/app/testing/layers.py", line 27, in <module>
    class PloneFixture(Layer):
  File "/home/jenkins/.buildout/eggs/plone.app.testing-5.0.6-py2.7.egg/plone/app/testing/layers.py", line 81, in PloneFixture
    import Products.PasswordResetTool  # noqa
  File "/home/jenkins/.buildout/eggs/Products.PasswordResetTool-2.2.3-py2.7.egg/Products/PasswordResetTool/__init__.py", line 4, in <module>
    import PasswordResetTool
  File "/home/jenkins/.buildout/eggs/Products.PasswordResetTool-2.2.3-py2.7.egg/Products/PasswordResetTool/PasswordResetTool.py", line 24, in <module>
    from Products.CMFPlone.interfaces import ISecuritySchema
  File "/home/jenkins/workspace/plone-5.0-python-2.7-at/src/Products.CMFPlone/Products/CMFPlone/__init__.py", line 228, in <module>
    from Products.CMFPlone import earlypatches  # noqa
  File "/home/jenkins/workspace/plone-5.0-python-2.7-at/src/Products.CMFPlone/Products/CMFPlone/earlypatches/__init__.py", line 2, in <module>
    import security  # noqa
  File "/home/jenkins/workspace/plone-5.0-python-2.7-at/src/Products.CMFPlone/Products/CMFPlone/earlypatches/security.py", line 86, in <module>
    exec code in utils.getToolByName.func_globals
  File "<string>", line 5, in <module>
  File "/home/jenkins/workspace/plone-5.0-python-2.7-at/src/Products.ATContentTypes/Products/ATContentTypes/__init__.py", line 33, in <module>
    import Products.ATContentTypes.content  # noqa
  File "/home/jenkins/workspace/plone-5.0-python-2.7-at/src/Products.ATContentTypes/Products/ATContentTypes/content/__init__.py", line 2, in <module>
    import Products.ATContentTypes.content.link  # noqa
  File "/home/jenkins/workspace/plone-5.0-python-2.7-at/src/Products.ATContentTypes/Products/ATContentTypes/content/link.py", line 3, in <module>
    from Products.Archetypes.atapi import Schema
  File "/home/jenkins/workspace/plone-5.0-python-2.7-at/src/Products.Archetypes/Products/Archetypes/atapi.py", line 32, in <module>
    from Products.Archetypes.BaseObject import BaseObject
  File "/home/jenkins/workspace/plone-5.0-python-2.7-at/src/Products.Archetypes/Products/Archetypes/BaseObject.py", line 114, in <module>
    class BaseObject(Referenceable):
  File "/home/jenkins/workspace/plone-5.0-python-2.7-at/src/Products.Archetypes/Products/Archetypes/BaseObject.py", line 133, in BaseObject
    implements(IBaseObject, IReferenceable)


FAILED:  Products.Archetypes.tests.test_reference_optimizations.Startup

Error Message:
name 'implements' is not defined

Stack Trace:
name 'implements' is not defined

  File "/home/jenkins/workspace/plone-5.0-python-2.7-at/src/Products.Archetypes/Products/Archetypes/tests/test_reference_optimizations.py", line 3, in <module>
    from Products.Archetypes.tests.attestcase import ATTestCase
  File "/home/jenkins/workspace/plone-5.0-python-2.7-at/src/Products.Archetypes/Products/Archetypes/tests/attestcase.py", line 1, in <module>
    from plone.app.testing import bbb
  File "/home/jenkins/.buildout/eggs/plone.app.testing-5.0.6-py2.7.egg/plone/app/testing/__init__.py", line 4, in <module>
    from plone.app.testing.helpers import applyProfile
  File "/home/jenkins/.buildout/eggs/plone.app.testing-5.0.6-py2.7.egg/plone/app/testing/helpers.py", line 5, in <module>
    from plone.app.testing import layers
  File "/home/jenkins/.buildout/eggs/plone.app.testing-5.0.6-py2.7.egg/plone/app/testing/layers.py", line 27, in <module>
    class PloneFixture(Layer):
  File "/home/jenkins/.buildout/eggs/plone.app.testing-5.0.6-py2.7.egg/plone/app/testing/layers.py", line 81, in PloneFixture
    import Products.PasswordResetTool  # noqa
  File "/home/jenkins/.buildout/eggs/Products.PasswordResetTool-2.2.3-py2.7.egg/Products/PasswordResetTool/__init__.py", line 4, in <module>
    import PasswordResetTool
  File "/home/jenkins/.buildout/eggs/Products.PasswordResetTool-2.2.3-py2.7.egg/Products/PasswordResetTool/PasswordResetTool.py", line 24, in <module>
    from Products.CMFPlone.interfaces import ISecuritySchema
  File "/home/jenkins/workspace/plone-5.0-python-2.7-at/src/Products.CMFPlone/Products/CMFPlone/__init__.py", line 228, in <module>
    from Products.CMFPlone import earlypatches  # noqa
  File "/home/jenkins/workspace/plone-5.0-python-2.7-at/src/Products.CMFPlone/Products/CMFPlone/earlypatches/__init__.py", line 2, in <module>
    import security  # noqa
  File "/home/jenkins/workspace/plone-5.0-python-2.7-at/src/Products.CMFPlone/Products/CMFPlone/earlypatches/security.py", line 86, in <module>
    exec code in utils.getToolByName.func_globals
  File "<string>", line 5, in <module>
  File "/home/jenkins/workspace/plone-5.0-python-2.7-at/src/Products.ATContentTypes/Products/ATContentTypes/__init__.py", line 33, in <module>
    import Products.ATContentTypes.content  # noqa
  File "/home/jenkins/workspace/plone-5.0-python-2.7-at/src/Products.ATContentTypes/Products/ATContentTypes/content/__init__.py", line 2, in <module>
    import Products.ATContentTypes.content.link  # noqa
  File "/home/jenkins/workspace/plone-5.0-python-2.7-at/src/Products.ATContentTypes/Products/ATContentTypes/content/link.py", line 3, in <module>
    from Products.Archetypes.atapi import Schema
  File "/home/jenkins/workspace/plone-5.0-python-2.7-at/src/Products.Archetypes/Products/Archetypes/atapi.py", line 32, in <module>
    from Products.Archetypes.BaseObject import BaseObject
  File "/home/jenkins/workspace/plone-5.0-python-2.7-at/src/Products.Archetypes/Products/Archetypes/BaseObject.py", line 114, in <module>
    class BaseObject(Referenceable):
  File "/home/jenkins/workspace/plone-5.0-python-2.7-at/src/Products.Archetypes/Products/Archetypes/BaseObject.py", line 133, in BaseObject
    implements(IBaseObject, IReferenceable)


FAILED:  Products.Archetypes.tests.test_referenceable.Startup

Error Message:
name 'implements' is not defined

Stack Trace:
name 'implements' is not defined

  File "/home/jenkins/workspace/plone-5.0-python-2.7-at/src/Products.Archetypes/Products/Archetypes/tests/test_referenceable.py", line 29, in <module>
    from Products.Archetypes.tests.atsitetestcase import ATSiteTestCase
  File "/home/jenkins/workspace/plone-5.0-python-2.7-at/src/Products.Archetypes/Products/Archetypes/tests/atsitetestcase.py", line 1, in <module>
    from Products.Archetypes.tests.attestcase import ATTestCase as ATSiteTestCase
  File "/home/jenkins/workspace/plone-5.0-python-2.7-at/src/Products.Archetypes/Products/Archetypes/tests/attestcase.py", line 1, in <module>
    from plone.app.testing import bbb
  File "/home/jenkins/.buildout/eggs/plone.app.testing-5.0.6-py2.7.egg/plone/app/testing/__init__.py", line 4, in <module>
    from plone.app.testing.helpers import applyProfile
  File "/home/jenkins/.buildout/eggs/plone.app.testing-5.0.6-py2.7.egg/plone/app/testing/helpers.py", line 5, in <module>
    from plone.app.testing import layers
  File "/home/jenkins/.buildout/eggs/plone.app.testing-5.0.6-py2.7.egg/plone/app/testing/layers.py", line 27, in <module>
    class PloneFixture(Layer):
  File "/home/jenkins/.buildout/eggs/plone.app.testing-5.0.6-py2.7.egg/plone/app/testing/layers.py", line 81, in PloneFixture
    import Products.PasswordResetTool  # noqa
  File "/home/jenkins/.buildout/eggs/Products.PasswordResetTool-2.2.3-py2.7.egg/Products/PasswordResetTool/__init__.py", line 4, in <module>
    import PasswordResetTool
  File "/home/jenkins/.buildout/eggs/Products.PasswordResetTool-2.2.3-py2.7.egg/Products/PasswordResetTool/PasswordResetTool.py", line 24, in <module>
    from Products.CMFPlone.interfaces import ISecuritySchema
  File "/home/jenkins/workspace/plone-5.0-python-2.7-at/src/Products.CMFPlone/Products/CMFPlone/__init__.py", line 228, in <module>
    from Products.CMFPlone import earlypatches  # noqa
  File "/home/jenkins/workspace/plone-5.0-python-2.7-at/src/Products.CMFPlone/Products/CMFPlone/earlypatches/__init__.py", line 2, in <module>
    import security  # noqa
  File "/home/jenkins/workspace/plone-5.0-python-2.7-at/src/Products.CMFPlone/Products/CMFPlone/earlypatches/security.py", line 86, in <module>
    exec code in utils.getToolByName.func_globals
  File "<string>", line 5, in <module>
  File "/home/jenkins/workspace/plone-5.0-python-2.7-at/src/Products.ATContentTypes/Products/ATContentTypes/__init__.py", line 33, in <module>
    import Products.ATContentTypes.content  # noqa
  File "/home/jenkins/workspace/plone-5.0-python-2.7-at/src/Products.ATContentTypes/Products/ATContentTypes/content/__init__.py", line 2, in <module>
    import Products.ATContentTypes.content.link  # noqa
  File "/home/jenkins/workspace/plone-5.0-python-2.7-at/src/Products.ATContentTypes/Products/ATContentTypes/content/link.py", line 3, in <module>
    from Products.Archetypes.atapi import Schema
  File "/home/jenkins/workspace/plone-5.0-python-2.7-at/src/Products.Archetypes/Products/Archetypes/atapi.py", line 32, in <module>
    from Products.Archetypes.BaseObject import BaseObject
  File "/home/jenkins/workspace/plone-5.0-python-2.7-at/src/Products.Archetypes/Products/Archetypes/BaseObject.py", line 114, in <module>
    class BaseObject(Referenceable):
  File "/home/jenkins/workspace/plone-5.0-python-2.7-at/src/Products.Archetypes/Products/Archetypes/BaseObject.py", line 133, in BaseObject
    implements(IBaseObject, IReferenceable)


FAILED:  Products.Archetypes.tests.test_rename.Startup

Error Message:
name 'implements' is not defined

Stack Trace:
name 'implements' is not defined

  File "/home/jenkins/workspace/plone-5.0-python-2.7-at/src/Products.Archetypes/Products/Archetypes/tests/test_rename.py", line 26, in <module>
    from Products.Archetypes.tests.atsitetestcase import ATSiteTestCase
  File "/home/jenkins/workspace/plone-5.0-python-2.7-at/src/Products.Archetypes/Products/Archetypes/tests/atsitetestcase.py", line 1, in <module>
    from Products.Archetypes.tests.attestcase import ATTestCase as ATSiteTestCase
  File "/home/jenkins/workspace/plone-5.0-python-2.7-at/src/Products.Archetypes/Products/Archetypes/tests/attestcase.py", line 1, in <module>
    from plone.app.testing import bbb
  File "/home/jenkins/.buildout/eggs/plone.app.testing-5.0.6-py2.7.egg/plone/app/testing/__init__.py", line 4, in <module>
    from plone.app.testing.helpers import applyProfile
  File "/home/jenkins/.buildout/eggs/plone.app.testing-5.0.6-py2.7.egg/plone/app/testing/helpers.py", line 5, in <module>
    from plone.app.testing import layers
  File "/home/jenkins/.buildout/eggs/plone.app.testing-5.0.6-py2.7.egg/plone/app/testing/layers.py", line 27, in <module>
    class PloneFixture(Layer):
  File "/home/jenkins/.buildout/eggs/plone.app.testing-5.0.6-py2.7.egg/plone/app/testing/layers.py", line 81, in PloneFixture
    import Products.PasswordResetTool  # noqa
  File "/home/jenkins/.buildout/eggs/Products.PasswordResetTool-2.2.3-py2.7.egg/Products/PasswordResetTool/__init__.py", line 4, in <module>
    import PasswordResetTool
  File "/home/jenkins/.buildout/eggs/Products.PasswordResetTool-2.2.3-py2.7.egg/Products/PasswordResetTool/PasswordResetTool.py", line 24, in <module>
    from Products.CMFPlone.interfaces import ISecuritySchema
  File "/home/jenkins/workspace/plone-5.0-python-2.7-at/src/Products.CMFPlone/Products/CMFPlone/__init__.py", line 228, in <module>
    from Products.CMFPlone import earlypatches  # noqa
  File "/home/jenkins/workspace/plone-5.0-python-2.7-at/src/Products.CMFPlone/Products/CMFPlone/earlypatches/__init__.py", line 2, in <module>
    import security  # noqa
  File "/home/jenkins/workspace/plone-5.0-python-2.7-at/src/Products.CMFPlone/Products/CMFPlone/earlypatches/security.py", line 86, in <module>
    exec code in utils.getToolByName.func_globals
  File "<string>", line 5, in <module>
  File "/home/jenkins/workspace/plone-5.0-python-2.7-at/src/Products.ATContentTypes/Products/ATContentTypes/__init__.py", line 33, in <module>
    import Products.ATContentTypes.content  # noqa
  File "/home/jenkins/workspace/plone-5.0-python-2.7-at/src/Products.ATContentTypes/Products/ATContentTypes/content/__init__.py", line 2, in <module>
    import Products.ATContentTypes.content.link  # noqa
  File "/home/jenkins/workspace/plone-5.0-python-2.7-at/src/Products.ATContentTypes/Products/ATContentTypes/content/link.py", line 3, in <module>
    from Products.Archetypes.atapi import Schema
  File "/home/jenkins/workspace/plone-5.0-python-2.7-at/src/Products.Archetypes/Products/Archetypes/atapi.py", line 32, in <module>
    from Products.Archetypes.BaseObject import BaseObject
  File "/home/jenkins/workspace/plone-5.0-python-2.7-at/src/Products.Archetypes/Products/Archetypes/BaseObject.py", line 114, in <module>
    class BaseObject(Referenceable):
  File "/home/jenkins/workspace/plone-5.0-python-2.7-at/src/Products.Archetypes/Products/Archetypes/BaseObject.py", line 133, in BaseObject
    implements(IBaseObject, IReferenceable)


FAILED:  Products.Archetypes.tests.test_schemata.Startup

Error Message:
name 'implements' is not defined

Stack Trace:
name 'implements' is not defined

  File "/home/jenkins/workspace/plone-5.0-python-2.7-at/src/Products.Archetypes/Products/Archetypes/tests/test_schemata.py", line 28, in <module>
    from Products.Archetypes.tests.atsitetestcase import ATSiteTestCase
  File "/home/jenkins/workspace/plone-5.0-python-2.7-at/src/Products.Archetypes/Products/Archetypes/tests/atsitetestcase.py", line 1, in <module>
    from Products.Archetypes.tests.attestcase import ATTestCase as ATSiteTestCase
  File "/home/jenkins/workspace/plone-5.0-python-2.7-at/src/Products.Archetypes/Products/Archetypes/tests/attestcase.py", line 1, in <module>
    from plone.app.testing import bbb
  File "/home/jenkins/.buildout/eggs/plone.app.testing-5.0.6-py2.7.egg/plone/app/testing/__init__.py", line 4, in <module>
    from plone.app.testing.helpers import applyProfile
  File "/home/jenkins/.buildout/eggs/plone.app.testing-5.0.6-py2.7.egg/plone/app/testing/helpers.py", line 5, in <module>
    from plone.app.testing import layers
  File "/home/jenkins/.buildout/eggs/plone.app.testing-5.0.6-py2.7.egg/plone/app/testing/layers.py", line 27, in <module>
    class PloneFixture(Layer):
  File "/home/jenkins/.buildout/eggs/plone.app.testing-5.0.6-py2.7.egg/plone/app/testing/layers.py", line 81, in PloneFixture
    import Products.PasswordResetTool  # noqa
  File "/home/jenkins/.buildout/eggs/Products.PasswordResetTool-2.2.3-py2.7.egg/Products/PasswordResetTool/__init__.py", line 4, in <module>
    import PasswordResetTool
  File "/home/jenkins/.buildout/eggs/Products.PasswordResetTool-2.2.3-py2.7.egg/Products/PasswordResetTool/PasswordResetTool.py", line 24, in <module>
    from Products.CMFPlone.interfaces import ISecuritySchema
  File "/home/jenkins/workspace/plone-5.0-python-2.7-at/src/Products.CMFPlone/Products/CMFPlone/__init__.py", line 228, in <module>
    from Products.CMFPlone import earlypatches  # noqa
  File "/home/jenkins/workspace/plone-5.0-python-2.7-at/src/Products.CMFPlone/Products/CMFPlone/earlypatches/__init__.py", line 2, in <module>
    import security  # noqa
  File "/home/jenkins/workspace/plone-5.0-python-2.7-at/src/Products.CMFPlone/Products/CMFPlone/earlypatches/security.py", line 86, in <module>
    exec code in utils.getToolByName.func_globals
  File "<string>", line 5, in <module>
  File "/home/jenkins/workspace/plone-5.0-python-2.7-at/src/Products.ATContentTypes/Products/ATContentTypes/__init__.py", line 33, in <module>
    import Products.ATContentTypes.content  # noqa
  File "/home/jenkins/workspace/plone-5.0-python-2.7-at/src/Products.ATContentTypes/Products/ATContentTypes/content/__init__.py", line 2, in <module>
    import Products.ATContentTypes.content.link  # noqa
  File "/home/jenkins/workspace/plone-5.0-python-2.7-at/src/Products.ATContentTypes/Products/ATContentTypes/content/link.py", line 3, in <module>
    from Products.Archetypes.atapi import Schema
  File "/home/jenkins/workspace/plone-5.0-python-2.7-at/src/Products.Archetypes/Products/Archetypes/atapi.py", line 32, in <module>
    from Products.Archetypes.BaseObject import BaseObject
  File "/home/jenkins/workspace/plone-5.0-python-2.7-at/src/Products.Archetypes/Products/Archetypes/BaseObject.py", line 114, in <module>
    class BaseObject(Referenceable):
  File "/home/jenkins/workspace/plone-5.0-python-2.7-at/src/Products.Archetypes/Products/Archetypes/BaseObject.py", line 133, in BaseObject
    implements(IBaseObject, IReferenceable)


FAILED:  Products.Archetypes.tests.test_schemata_manipulation.Startup

Error Message:
name 'implements' is not defined

Stack Trace:
name 'implements' is not defined

  File "/home/jenkins/workspace/plone-5.0-python-2.7-at/src/Products.Archetypes/Products/Archetypes/tests/test_schemata_manipulation.py", line 28, in <module>
    from Products.Archetypes.tests.attestcase import ATTestCase
  File "/home/jenkins/workspace/plone-5.0-python-2.7-at/src/Products.Archetypes/Products/Archetypes/tests/attestcase.py", line 1, in <module>
    from plone.app.testing import bbb
  File "/home/jenkins/.buildout/eggs/plone.app.testing-5.0.6-py2.7.egg/plone/app/testing/__init__.py", line 4, in <module>
    from plone.app.testing.helpers import applyProfile
  File "/home/jenkins/.buildout/eggs/plone.app.testing-5.0.6-py2.7.egg/plone/app/testing/helpers.py", line 5, in <module>
    from plone.app.testing import layers
  File "/home/jenkins/.buildout/eggs/plone.app.testing-5.0.6-py2.7.egg/plone/app/testing/layers.py", line 27, in <module>
    class PloneFixture(Layer):
  File "/home/jenkins/.buildout/eggs/plone.app.testing-5.0.6-py2.7.egg/plone/app/testing/layers.py", line 81, in PloneFixture
    import Products.PasswordResetTool  # noqa
  File "/home/jenkins/.buildout/eggs/Products.PasswordResetTool-2.2.3-py2.7.egg/Products/PasswordResetTool/__init__.py", line 4, in <module>
    import PasswordResetTool
  File "/home/jenkins/.buildout/eggs/Products.PasswordResetTool-2.2.3-py2.7.egg/Products/PasswordResetTool/PasswordResetTool.py", line 24, in <module>
    from Products.CMFPlone.interfaces import ISecuritySchema
  File "/home/jenkins/workspace/plone-5.0-python-2.7-at/src/Products.CMFPlone/Products/CMFPlone/__init__.py", line 228, in <module>
    from Products.CMFPlone import earlypatches  # noqa
  File "/home/jenkins/workspace/plone-5.0-python-2.7-at/src/Products.CMFPlone/Products/CMFPlone/earlypatches/__init__.py", line 2, in <module>
    import security  # noqa
  File "/home/jenkins/workspace/plone-5.0-python-2.7-at/src/Products.CMFPlone/Products/CMFPlone/earlypatches/security.py", line 86, in <module>
    exec code in utils.getToolByName.func_globals
  File "<string>", line 5, in <module>
  File "/home/jenkins/workspace/plone-5.0-python-2.7-at/src/Products.ATContentTypes/Products/ATContentTypes/__init__.py", line 33, in <module>
    import Products.ATContentTypes.content  # noqa
  File "/home/jenkins/workspace/plone-5.0-python-2.7-at/src/Products.ATContentTypes/Products/ATContentTypes/content/__init__.py", line 2, in <module>
    import Products.ATContentTypes.content.link  # noqa
  File "/home/jenkins/workspace/plone-5.0-python-2.7-at/src/Products.ATContentTypes/Products/ATContentTypes/content/link.py", line 3, in <module>
    from Products.Archetypes.atapi import Schema
  File "/home/jenkins/workspace/plone-5.0-python-2.7-at/src/Products.Archetypes/Products/Archetypes/atapi.py", line 32, in <module>
    from Products.Archetypes.BaseObject import BaseObject
  File "/home/jenkins/workspace/plone-5.0-python-2.7-at/src/Products.Archetypes/Products/Archetypes/BaseObject.py", line 114, in <module>
    class BaseObject(Referenceable):
  File "/home/jenkins/workspace/plone-5.0-python-2.7-at/src/Products.Archetypes/Products/Archetypes/BaseObject.py", line 133, in BaseObject
    implements(IBaseObject, IReferenceable)


FAILED:  Products.Archetypes.tests.test_security.Startup

Error Message:
name 'implements' is not defined

Stack Trace:
name 'implements' is not defined

  File "/home/jenkins/workspace/plone-5.0-python-2.7-at/src/Products.Archetypes/Products/Archetypes/tests/test_security.py", line 4, in <module>
    from Products.Archetypes.tests.atsitetestcase import ATSiteTestCase
  File "/home/jenkins/workspace/plone-5.0-python-2.7-at/src/Products.Archetypes/Products/Archetypes/tests/atsitetestcase.py", line 1, in <module>
    from Products.Archetypes.tests.attestcase import ATTestCase as ATSiteTestCase
  File "/home/jenkins/workspace/plone-5.0-python-2.7-at/src/Products.Archetypes/Products/Archetypes/tests/attestcase.py", line 1, in <module>
    from plone.app.testing import bbb
  File "/home/jenkins/.buildout/eggs/plone.app.testing-5.0.6-py2.7.egg/plone/app/testing/__init__.py", line 4, in <module>
    from plone.app.testing.helpers import applyProfile
  File "/home/jenkins/.buildout/eggs/plone.app.testing-5.0.6-py2.7.egg/plone/app/testing/helpers.py", line 5, in <module>
    from plone.app.testing import layers
  File "/home/jenkins/.buildout/eggs/plone.app.testing-5.0.6-py2.7.egg/plone/app/testing/layers.py", line 27, in <module>
    class PloneFixture(Layer):
  File "/home/jenkins/.buildout/eggs/plone.app.testing-5.0.6-py2.7.egg/plone/app/testing/layers.py", line 81, in PloneFixture
    import Products.PasswordResetTool  # noqa
  File "/home/jenkins/.buildout/eggs/Products.PasswordResetTool-2.2.3-py2.7.egg/Products/PasswordResetTool/__init__.py", line 4, in <module>
    import PasswordResetTool
  File "/home/jenkins/.buildout/eggs/Products.PasswordResetTool-2.2.3-py2.7.egg/Products/PasswordResetTool/PasswordResetTool.py", line 24, in <module>
    from Products.CMFPlone.interfaces import ISecuritySchema
  File "/home/jenkins/workspace/plone-5.0-python-2.7-at/src/Products.CMFPlone/Products/CMFPlone/__init__.py", line 228, in <module>
    from Products.CMFPlone import earlypatches  # noqa
  File "/home/jenkins/workspace/plone-5.0-python-2.7-at/src/Products.CMFPlone/Products/CMFPlone/earlypatches/__init__.py", line 2, in <module>
    import security  # noqa
  File "/home/jenkins/workspace/plone-5.0-python-2.7-at/src/Products.CMFPlone/Products/CMFPlone/earlypatches/security.py", line 86, in <module>
    exec code in utils.getToolByName.func_globals
  File "<string>", line 5, in <module>
  File "/home/jenkins/workspace/plone-5.0-python-2.7-at/src/Products.ATContentTypes/Products/ATContentTypes/__init__.py", line 33, in <module>
    import Products.ATContentTypes.content  # noqa
  File "/home/jenkins/workspace/plone-5.0-python-2.7-at/src/Products.ATContentTypes/Products/ATContentTypes/content/__init__.py", line 2, in <module>
    import Products.ATContentTypes.content.link  # noqa
  File "/home/jenkins/workspace/plone-5.0-python-2.7-at/src/Products.ATContentTypes/Products/ATContentTypes/content/link.py", line 3, in <module>
    from Products.Archetypes.atapi import Schema
  File "/home/jenkins/workspace/plone-5.0-python-2.7-at/src/Products.Archetypes/Products/Archetypes/atapi.py", line 32, in <module>
    from Products.Archetypes.BaseObject import BaseObject
  File "/home/jenkins/workspace/plone-5.0-python-2.7-at/src/Products.Archetypes/Products/Archetypes/BaseObject.py", line 114, in <module>
    class BaseObject(Referenceable):
  File "/home/jenkins/workspace/plone-5.0-python-2.7-at/src/Products.Archetypes/Products/Archetypes/BaseObject.py", line 133, in BaseObject
    implements(IBaseObject, IReferenceable)


FAILED:  Products.Archetypes.tests.test_storage.Startup

Error Message:
name 'implements' is not defined

Stack Trace:
name 'implements' is not defined

  File "/home/jenkins/workspace/plone-5.0-python-2.7-at/src/Products.Archetypes/Products/Archetypes/tests/test_storage.py", line 28, in <module>
    from Products.Archetypes.atapi import AttributeStorage, MetadataStorage
  File "/home/jenkins/workspace/plone-5.0-python-2.7-at/src/Products.Archetypes/Products/Archetypes/atapi.py", line 32, in <module>
    from Products.Archetypes.BaseObject import BaseObject
  File "/home/jenkins/workspace/plone-5.0-python-2.7-at/src/Products.Archetypes/Products/Archetypes/BaseObject.py", line 114, in <module>
    class BaseObject(Referenceable):
  File "/home/jenkins/workspace/plone-5.0-python-2.7-at/src/Products.Archetypes/Products/Archetypes/BaseObject.py", line 133, in BaseObject
    implements(IBaseObject, IReferenceable)


FAILED:  Products.Archetypes.tests.test_templatemixin.Startup

Error Message:
name 'implements' is not defined

Stack Trace:
name 'implements' is not defined

  File "/home/jenkins/workspace/plone-5.0-python-2.7-at/src/Products.Archetypes/Products/Archetypes/tests/test_templatemixin.py", line 27, in <module>
    from Products.Archetypes.tests.atsitetestcase import ATSiteTestCase
  File "/home/jenkins/workspace/plone-5.0-python-2.7-at/src/Products.Archetypes/Products/Archetypes/tests/atsitetestcase.py", line 1, in <module>
    from Products.Archetypes.tests.attestcase import ATTestCase as ATSiteTestCase
  File "/home/jenkins/workspace/plone-5.0-python-2.7-at/src/Products.Archetypes/Products/Archetypes/tests/attestcase.py", line 1, in <module>
    from plone.app.testing import bbb
  File "/home/jenkins/.buildout/eggs/plone.app.testing-5.0.6-py2.7.egg/plone/app/testing/__init__.py", line 4, in <module>
    from plone.app.testing.helpers import applyProfile
  File "/home/jenkins/.buildout/eggs/plone.app.testing-5.0.6-py2.7.egg/plone/app/testing/helpers.py", line 5, in <module>
    from plone.app.testing import layers
  File "/home/jenkins/.buildout/eggs/plone.app.testing-5.0.6-py2.7.egg/plone/app/testing/layers.py", line 27, in <module>
    class PloneFixture(Layer):
  File "/home/jenkins/.buildout/eggs/plone.app.testing-5.0.6-py2.7.egg/plone/app/testing/layers.py", line 81, in PloneFixture
    import Products.PasswordResetTool  # noqa
  File "/home/jenkins/.buildout/eggs/Products.PasswordResetTool-2.2.3-py2.7.egg/Products/PasswordResetTool/__init__.py", line 4, in <module>
    import PasswordResetTool
  File "/home/jenkins/.buildout/eggs/Products.PasswordResetTool-2.2.3-py2.7.egg/Products/PasswordResetTool/PasswordResetTool.py", line 24, in <module>
    from Products.CMFPlone.interfaces import ISecuritySchema
  File "/home/jenkins/workspace/plone-5.0-python-2.7-at/src/Products.CMFPlone/Products/CMFPlone/__init__.py", line 228, in <module>
    from Products.CMFPlone import earlypatches  # noqa
  File "/home/jenkins/workspace/plone-5.0-python-2.7-at/src/Products.CMFPlone/Products/CMFPlone/earlypatches/__init__.py", line 2, in <module>
    import security  # noqa
  File "/home/jenkins/workspace/plone-5.0-python-2.7-at/src/Products.CMFPlone/Products/CMFPlone/earlypatches/security.py", line 86, in <module>
    exec code in utils.getToolByName.func_globals
  File "<string>", line 5, in <module>
  File "/home/jenkins/workspace/plone-5.0-python-2.7-at/src/Products.ATContentTypes/Products/ATContentTypes/__init__.py", line 33, in <module>
    import Products.ATContentTypes.content  # noqa
  File "/home/jenkins/workspace/plone-5.0-python-2.7-at/src/Products.ATContentTypes/Products/ATContentTypes/content/__init__.py", line 2, in <module>
    import Products.ATContentTypes.content.link  # noqa
  File "/home/jenkins/workspace/plone-5.0-python-2.7-at/src/Products.ATContentTypes/Products/ATContentTypes/content/link.py", line 3, in <module>
    from Products.Archetypes.atapi import Schema
  File "/home/jenkins/workspace/plone-5.0-python-2.7-at/src/Products.Archetypes/Products/Archetypes/atapi.py", line 32, in <module>
    from Products.Archetypes.BaseObject import BaseObject
  File "/home/jenkins/workspace/plone-5.0-python-2.7-at/src/Products.Archetypes/Products/Archetypes/BaseObject.py", line 114, in <module>
    class BaseObject(Referenceable):
  File "/home/jenkins/workspace/plone-5.0-python-2.7-at/src/Products.Archetypes/Products/Archetypes/BaseObject.py", line 133, in BaseObject
    implements(IBaseObject, IReferenceable)


FAILED:  Products.Archetypes.tests.test_traverse.Startup

Error Message:
name 'implements' is not defined

Stack Trace:
name 'implements' is not defined

  File "/home/jenkins/workspace/plone-5.0-python-2.7-at/src/Products.Archetypes/Products/Archetypes/tests/test_traverse.py", line 4, in <module>
    from Products.Archetypes.traverse import ImageTraverser
  File "/home/jenkins/workspace/plone-5.0-python-2.7-at/src/Products.Archetypes/Products/Archetypes/traverse.py", line 5, in <module>
    from Products.Archetypes.atapi import ImageField
  File "/home/jenkins/workspace/plone-5.0-python-2.7-at/src/Products.Archetypes/Products/Archetypes/atapi.py", line 32, in <module>
    from Products.Archetypes.BaseObject import BaseObject
  File "/home/jenkins/workspace/plone-5.0-python-2.7-at/src/Products.Archetypes/Products/Archetypes/BaseObject.py", line 114, in <module>
    class BaseObject(Referenceable):
  File "/home/jenkins/workspace/plone-5.0-python-2.7-at/src/Products.Archetypes/Products/Archetypes/BaseObject.py", line 133, in BaseObject
    implements(IBaseObject, IReferenceable)


FAILED:  Products.Archetypes.tests.test_unicode.Startup

Error Message:
name 'implements' is not defined

Stack Trace:
name 'implements' is not defined

  File "/home/jenkins/workspace/plone-5.0-python-2.7-at/src/Products.Archetypes/Products/Archetypes/tests/test_unicode.py", line 32, in <module>
    from Products.Archetypes.tests.atsitetestcase import ATSiteTestCase
  File "/home/jenkins/workspace/plone-5.0-python-2.7-at/src/Products.Archetypes/Products/Archetypes/tests/atsitetestcase.py", line 1, in <module>
    from Products.Archetypes.tests.attestcase import ATTestCase as ATSiteTestCase
  File "/home/jenkins/workspace/plone-5.0-python-2.7-at/src/Products.Archetypes/Products/Archetypes/tests/attestcase.py", line 1, in <module>
    from plone.app.testing import bbb
  File "/home/jenkins/.buildout/eggs/plone.app.testing-5.0.6-py2.7.egg/plone/app/testing/__init__.py", line 4, in <module>
    from plone.app.testing.helpers import applyProfile
  File "/home/jenkins/.buildout/eggs/plone.app.testing-5.0.6-py2.7.egg/plone/app/testing/helpers.py", line 5, in <module>
    from plone.app.testing import layers
  File "/home/jenkins/.buildout/eggs/plone.app.testing-5.0.6-py2.7.egg/plone/app/testing/layers.py", line 27, in <module>
    class PloneFixture(Layer):
  File "/home/jenkins/.buildout/eggs/plone.app.testing-5.0.6-py2.7.egg/plone/app/testing/layers.py", line 81, in PloneFixture
    import Products.PasswordResetTool  # noqa
  File "/home/jenkins/.buildout/eggs/Products.PasswordResetTool-2.2.3-py2.7.egg/Products/PasswordResetTool/__init__.py", line 4, in <module>
    import PasswordResetTool
  File "/home/jenkins/.buildout/eggs/Products.PasswordResetTool-2.2.3-py2.7.egg/Products/PasswordResetTool/PasswordResetTool.py", line 24, in <module>
    from Products.CMFPlone.interfaces import ISecuritySchema
  File "/home/jenkins/workspace/plone-5.0-python-2.7-at/src/Products.CMFPlone/Products/CMFPlone/__init__.py", line 228, in <module>
    from Products.CMFPlone import earlypatches  # noqa
  File "/home/jenkins/workspace/plone-5.0-python-2.7-at/src/Products.CMFPlone/Products/CMFPlone/earlypatches/__init__.py", line 2, in <module>
    import security  # noqa
  File "/home/jenkins/workspace/plone-5.0-python-2.7-at/src/Products.CMFPlone/Products/CMFPlone/earlypatches/security.py", line 86, in <module>
    exec code in utils.getToolByName.func_globals
  File "<string>", line 5, in <module>
  File "/home/jenkins/workspace/plone-5.0-python-2.7-at/src/Products.ATContentTypes/Products/ATContentTypes/__init__.py", line 33, in <module>
    import Products.ATContentTypes.content  # noqa
  File "/home/jenkins/workspace/plone-5.0-python-2.7-at/src/Products.ATContentTypes/Products/ATContentTypes/content/__init__.py", line 2, in <module>
    import Products.ATContentTypes.content.link  # noqa
  File "/home/jenkins/workspace/plone-5.0-python-2.7-at/src/Products.ATContentTypes/Products/ATContentTypes/content/link.py", line 3, in <module>
    from Products.Archetypes.atapi import Schema
  File "/home/jenkins/workspace/plone-5.0-python-2.7-at/src/Products.Archetypes/Products/Archetypes/atapi.py", line 32, in <module>
    from Products.Archetypes.BaseObject import BaseObject
  File "/home/jenkins/workspace/plone-5.0-python-2.7-at/src/Products.Archetypes/Products/Archetypes/BaseObject.py", line 114, in <module>
    class BaseObject(Referenceable):
  File "/home/jenkins/workspace/plone-5.0-python-2.7-at/src/Products.Archetypes/Products/Archetypes/BaseObject.py", line 133, in BaseObject
    implements(IBaseObject, IReferenceable)


FAILED:  Products.Archetypes.tests.test_update_schema.Startup

Error Message:
name 'implements' is not defined

Stack Trace:
name 'implements' is not defined

  File "/home/jenkins/workspace/plone-5.0-python-2.7-at/src/Products.Archetypes/Products/Archetypes/tests/test_update_schema.py", line 30, in <module>
    from Products.Archetypes.tests.atsitetestcase import ATSiteTestCase
  File "/home/jenkins/workspace/plone-5.0-python-2.7-at/src/Products.Archetypes/Products/Archetypes/tests/atsitetestcase.py", line 1, in <module>
    from Products.Archetypes.tests.attestcase import ATTestCase as ATSiteTestCase
  File "/home/jenkins/workspace/plone-5.0-python-2.7-at/src/Products.Archetypes/Products/Archetypes/tests/attestcase.py", line 1, in <module>
    from plone.app.testing import bbb
  File "/home/jenkins/.buildout/eggs/plone.app.testing-5.0.6-py2.7.egg/plone/app/testing/__init__.py", line 4, in <module>
    from plone.app.testing.helpers import applyProfile
  File "/home/jenkins/.buildout/eggs/plone.app.testing-5.0.6-py2.7.egg/plone/app/testing/helpers.py", line 5, in <module>
    from plone.app.testing import layers
  File "/home/jenkins/.buildout/eggs/plone.app.testing-5.0.6-py2.7.egg/plone/app/testing/layers.py", line 27, in <module>
    class PloneFixture(Layer):
  File "/home/jenkins/.buildout/eggs/plone.app.testing-5.0.6-py2.7.egg/plone/app/testing/layers.py", line 81, in PloneFixture
    import Products.PasswordResetTool  # noqa
  File "/home/jenkins/.buildout/eggs/Products.PasswordResetTool-2.2.3-py2.7.egg/Products/PasswordResetTool/__init__.py", line 4, in <module>
    import PasswordResetTool
  File "/home/jenkins/.buildout/eggs/Products.PasswordResetTool-2.2.3-py2.7.egg/Products/PasswordResetTool/PasswordResetTool.py", line 24, in <module>
    from Products.CMFPlone.interfaces import ISecuritySchema
  File "/home/jenkins/workspace/plone-5.0-python-2.7-at/src/Products.CMFPlone/Products/CMFPlone/__init__.py", line 228, in <module>
    from Products.CMFPlone import earlypatches  # noqa
  File "/home/jenkins/workspace/plone-5.0-python-2.7-at/src/Products.CMFPlone/Products/CMFPlone/earlypatches/__init__.py", line 2, in <module>
    import security  # noqa
  File "/home/jenkins/workspace/plone-5.0-python-2.7-at/src/Products.CMFPlone/Products/CMFPlone/earlypatches/security.py", line 86, in <module>
    exec code in utils.getToolByName.func_globals
  File "<string>", line 5, in <module>
  File "/home/jenkins/workspace/plone-5.0-python-2.7-at/src/Products.ATContentTypes/Products/ATContentTypes/__init__.py", line 33, in <module>
    import Products.ATContentTypes.content  # noqa
  File "/home/jenkins/workspace/plone-5.0-python-2.7-at/src/Products.ATContentTypes/Products/ATContentTypes/content/__init__.py", line 2, in <module>
    import Products.ATContentTypes.content.link  # noqa
  File "/home/jenkins/workspace/plone-5.0-python-2.7-at/src/Products.ATContentTypes/Products/ATContentTypes/content/link.py", line 3, in <module>
    from Products.Archetypes.atapi import Schema
  File "/home/jenkins/workspace/plone-5.0-python-2.7-at/src/Products.Archetypes/Products/Archetypes/atapi.py", line 32, in <module>
    from Products.Archetypes.BaseObject import BaseObject
  File "/home/jenkins/workspace/plone-5.0-python-2.7-at/src/Products.Archetypes/Products/Archetypes/BaseObject.py", line 114, in <module>
    class BaseObject(Referenceable):
  File "/home/jenkins/workspace/plone-5.0-python-2.7-at/src/Products.Archetypes/Products/Archetypes/BaseObject.py", line 133, in BaseObject
    implements(IBaseObject, IReferenceable)


FAILED:  Products.Archetypes.tests.test_utils.Startup

Error Message:
name 'implements' is not defined

Stack Trace:
name 'implements' is not defined

  File "/home/jenkins/workspace/plone-5.0-python-2.7-at/src/Products.Archetypes/Products/Archetypes/tests/test_utils.py", line 30, in <module>
    from Products.Archetypes.tests.attestcase import ATTestCase
  File "/home/jenkins/workspace/plone-5.0-python-2.7-at/src/Products.Archetypes/Products/Archetypes/tests/attestcase.py", line 1, in <module>
    from plone.app.testing import bbb
  File "/home/jenkins/.buildout/eggs/plone.app.testing-5.0.6-py2.7.egg/plone/app/testing/__init__.py", line 4, in <module>
    from plone.app.testing.helpers import applyProfile
  File "/home/jenkins/.buildout/eggs/plone.app.testing-5.0.6-py2.7.egg/plone/app/testing/helpers.py", line 5, in <module>
    from plone.app.testing import layers
  File "/home/jenkins/.buildout/eggs/plone.app.testing-5.0.6-py2.7.egg/plone/app/testing/layers.py", line 27, in <module>
    class PloneFixture(Layer):
  File "/home/jenkins/.buildout/eggs/plone.app.testing-5.0.6-py2.7.egg/plone/app/testing/layers.py", line 81, in PloneFixture
    import Products.PasswordResetTool  # noqa
  File "/home/jenkins/.buildout/eggs/Products.PasswordResetTool-2.2.3-py2.7.egg/Products/PasswordResetTool/__init__.py", line 4, in <module>
    import PasswordResetTool
  File "/home/jenkins/.buildout/eggs/Products.PasswordResetTool-2.2.3-py2.7.egg/Products/PasswordResetTool/PasswordResetTool.py", line 24, in <module>
    from Products.CMFPlone.interfaces import ISecuritySchema
  File "/home/jenkins/workspace/plone-5.0-python-2.7-at/src/Products.CMFPlone/Products/CMFPlone/__init__.py", line 228, in <module>
    from Products.CMFPlone import earlypatches  # noqa
  File "/home/jenkins/workspace/plone-5.0-python-2.7-at/src/Products.CMFPlone/Products/CMFPlone/earlypatches/__init__.py", line 2, in <module>
    import security  # noqa
  File "/home/jenkins/workspace/plone-5.0-python-2.7-at/src/Products.CMFPlone/Products/CMFPlone/earlypatches/security.py", line 86, in <module>
    exec code in utils.getToolByName.func_globals
  File "<string>", line 5, in <module>
  File "/home/jenkins/workspace/plone-5.0-python-2.7-at/src/Products.ATContentTypes/Products/ATContentTypes/__init__.py", line 33, in <module>
    import Products.ATContentTypes.content  # noqa
  File "/home/jenkins/workspace/plone-5.0-python-2.7-at/src/Products.ATContentTypes/Products/ATContentTypes/content/__init__.py", line 2, in <module>
    import Products.ATContentTypes.content.link  # noqa
  File "/home/jenkins/workspace/plone-5.0-python-2.7-at/src/Products.ATContentTypes/Products/ATContentTypes/content/link.py", line 3, in <module>
    from Products.Archetypes.atapi import Schema
  File "/home/jenkins/workspace/plone-5.0-python-2.7-at/src/Products.Archetypes/Products/Archetypes/atapi.py", line 32, in <module>
    from Products.Archetypes.BaseObject import BaseObject
  File "/home/jenkins/workspace/plone-5.0-python-2.7-at/src/Products.Archetypes/Products/Archetypes/BaseObject.py", line 114, in <module>
    class BaseObject(Referenceable):
  File "/home/jenkins/workspace/plone-5.0-python-2.7-at/src/Products.Archetypes/Products/Archetypes/BaseObject.py", line 133, in BaseObject
    implements(IBaseObject, IReferenceable)


FAILED:  Products.Archetypes.tests.test_utils2.Startup

Error Message:
name 'implements' is not defined

Stack Trace:
name 'implements' is not defined

  File "/home/jenkins/workspace/plone-5.0-python-2.7-at/src/Products.Archetypes/Products/Archetypes/tests/test_utils2.py", line 29, in <module>
    from Products.Archetypes.tests.attestcase import ATTestCase
  File "/home/jenkins/workspace/plone-5.0-python-2.7-at/src/Products.Archetypes/Products/Archetypes/tests/attestcase.py", line 1, in <module>
    from plone.app.testing import bbb
  File "/home/jenkins/.buildout/eggs/plone.app.testing-5.0.6-py2.7.egg/plone/app/testing/__init__.py", line 4, in <module>
    from plone.app.testing.helpers import applyProfile
  File "/home/jenkins/.buildout/eggs/plone.app.testing-5.0.6-py2.7.egg/plone/app/testing/helpers.py", line 5, in <module>
    from plone.app.testing import layers
  File "/home/jenkins/.buildout/eggs/plone.app.testing-5.0.6-py2.7.egg/plone/app/testing/layers.py", line 27, in <module>
    class PloneFixture(Layer):
  File "/home/jenkins/.buildout/eggs/plone.app.testing-5.0.6-py2.7.egg/plone/app/testing/layers.py", line 81, in PloneFixture
    import Products.PasswordResetTool  # noqa
  File "/home/jenkins/.buildout/eggs/Products.PasswordResetTool-2.2.3-py2.7.egg/Products/PasswordResetTool/__init__.py", line 4, in <module>
    import PasswordResetTool
  File "/home/jenkins/.buildout/eggs/Products.PasswordResetTool-2.2.3-py2.7.egg/Products/PasswordResetTool/PasswordResetTool.py", line 24, in <module>
    from Products.CMFPlone.interfaces import ISecuritySchema
  File "/home/jenkins/workspace/plone-5.0-python-2.7-at/src/Products.CMFPlone/Products/CMFPlone/__init__.py", line 228, in <module>
    from Products.CMFPlone import earlypatches  # noqa
  File "/home/jenkins/workspace/plone-5.0-python-2.7-at/src/Products.CMFPlone/Products/CMFPlone/earlypatches/__init__.py", line 2, in <module>
    import security  # noqa
  File "/home/jenkins/workspace/plone-5.0-python-2.7-at/src/Products.CMFPlone/Products/CMFPlone/earlypatches/security.py", line 86, in <module>
    exec code in utils.getToolByName.func_globals
  File "<string>", line 5, in <module>
  File "/home/jenkins/workspace/plone-5.0-python-2.7-at/src/Products.ATContentTypes/Products/ATContentTypes/__init__.py", line 33, in <module>
    import Products.ATContentTypes.content  # noqa
  File "/home/jenkins/workspace/plone-5.0-python-2.7-at/src/Products.ATContentTypes/Products/ATContentTypes/content/__init__.py", line 2, in <module>
    import Products.ATContentTypes.content.link  # noqa
  File "/home/jenkins/workspace/plone-5.0-python-2.7-at/src/Products.ATContentTypes/Products/ATContentTypes/content/link.py", line 3, in <module>
    from Products.Archetypes.atapi import Schema
  File "/home/jenkins/workspace/plone-5.0-python-2.7-at/src/Products.Archetypes/Products/Archetypes/atapi.py", line 32, in <module>
    from Products.Archetypes.BaseObject import BaseObject
  File "/home/jenkins/workspace/plone-5.0-python-2.7-at/src/Products.Archetypes/Products/Archetypes/BaseObject.py", line 114, in <module>
    class BaseObject(Referenceable):
  File "/home/jenkins/workspace/plone-5.0-python-2.7-at/src/Products.Archetypes/Products/Archetypes/BaseObject.py", line 133, in BaseObject
    implements(IBaseObject, IReferenceable)


FAILED:  Products.Archetypes.tests.test_validation.Startup

Error Message:
name 'implements' is not defined

Stack Trace:
name 'implements' is not defined

  File "/home/jenkins/workspace/plone-5.0-python-2.7-at/src/Products.Archetypes/Products/Archetypes/tests/test_validation.py", line 26, in <module>
    from Products.Archetypes.tests.attestcase import ATTestCase
  File "/home/jenkins/workspace/plone-5.0-python-2.7-at/src/Products.Archetypes/Products/Archetypes/tests/attestcase.py", line 1, in <module>
    from plone.app.testing import bbb
  File "/home/jenkins/.buildout/eggs/plone.app.testing-5.0.6-py2.7.egg/plone/app/testing/__init__.py", line 4, in <module>
    from plone.app.testing.helpers import applyProfile
  File "/home/jenkins/.buildout/eggs/plone.app.testing-5.0.6-py2.7.egg/plone/app/testing/helpers.py", line 5, in <module>
    from plone.app.testing import layers
  File "/home/jenkins/.buildout/eggs/plone.app.testing-5.0.6-py2.7.egg/plone/app/testing/layers.py", line 27, in <module>
    class PloneFixture(Layer):
  File "/home/jenkins/.buildout/eggs/plone.app.testing-5.0.6-py2.7.egg/plone/app/testing/layers.py", line 81, in PloneFixture
    import Products.PasswordResetTool  # noqa
  File "/home/jenkins/.buildout/eggs/Products.PasswordResetTool-2.2.3-py2.7.egg/Products/PasswordResetTool/__init__.py", line 4, in <module>
    import PasswordResetTool
  File "/home/jenkins/.buildout/eggs/Products.PasswordResetTool-2.2.3-py2.7.egg/Products/PasswordResetTool/PasswordResetTool.py", line 24, in <module>
    from Products.CMFPlone.interfaces import ISecuritySchema
  File "/home/jenkins/workspace/plone-5.0-python-2.7-at/src/Products.CMFPlone/Products/CMFPlone/__init__.py", line 228, in <module>
    from Products.CMFPlone import earlypatches  # noqa
  File "/home/jenkins/workspace/plone-5.0-python-2.7-at/src/Products.CMFPlone/Products/CMFPlone/earlypatches/__init__.py", line 2, in <module>
    import security  # noqa
  File "/home/jenkins/workspace/plone-5.0-python-2.7-at/src/Products.CMFPlone/Products/CMFPlone/earlypatches/security.py", line 86, in <module>
    exec code in utils.getToolByName.func_globals
  File "<string>", line 5, in <module>
  File "/home/jenkins/workspace/plone-5.0-python-2.7-at/src/Products.ATContentTypes/Products/ATContentTypes/__init__.py", line 33, in <module>
    import Products.ATContentTypes.content  # noqa
  File "/home/jenkins/workspace/plone-5.0-python-2.7-at/src/Products.ATContentTypes/Products/ATContentTypes/content/__init__.py", line 2, in <module>
    import Products.ATContentTypes.content.link  # noqa
  File "/home/jenkins/workspace/plone-5.0-python-2.7-at/src/Products.ATContentTypes/Products/ATContentTypes/content/link.py", line 3, in <module>
    from Products.Archetypes.atapi import Schema
  File "/home/jenkins/workspace/plone-5.0-python-2.7-at/src/Products.Archetypes/Products/Archetypes/atapi.py", line 32, in <module>
    from Products.Archetypes.BaseObject import BaseObject
  File "/home/jenkins/workspace/plone-5.0-python-2.7-at/src/Products.Archetypes/Products/Archetypes/BaseObject.py", line 114, in <module>
    class BaseObject(Referenceable):
  File "/home/jenkins/workspace/plone-5.0-python-2.7-at/src/Products.Archetypes/Products/Archetypes/BaseObject.py", line 133, in BaseObject
    implements(IBaseObject, IReferenceable)


FAILED:  Products.Archetypes.tests.test_varschema.Startup

Error Message:
name 'implements' is not defined

Stack Trace:
name 'implements' is not defined

  File "/home/jenkins/workspace/plone-5.0-python-2.7-at/src/Products.Archetypes/Products/Archetypes/tests/test_varschema.py", line 26, in <module>
    from Products.Archetypes.tests.attestcase import ATTestCase
  File "/home/jenkins/workspace/plone-5.0-python-2.7-at/src/Products.Archetypes/Products/Archetypes/tests/attestcase.py", line 1, in <module>
    from plone.app.testing import bbb
  File "/home/jenkins/.buildout/eggs/plone.app.testing-5.0.6-py2.7.egg/plone/app/testing/__init__.py", line 4, in <module>
    from plone.app.testing.helpers import applyProfile
  File "/home/jenkins/.buildout/eggs/plone.app.testing-5.0.6-py2.7.egg/plone/app/testing/helpers.py", line 5, in <module>
    from plone.app.testing import layers
  File "/home/jenkins/.buildout/eggs/plone.app.testing-5.0.6-py2.7.egg/plone/app/testing/layers.py", line 27, in <module>
    class PloneFixture(Layer):
  File "/home/jenkins/.buildout/eggs/plone.app.testing-5.0.6-py2.7.egg/plone/app/testing/layers.py", line 81, in PloneFixture
    import Products.PasswordResetTool  # noqa
  File "/home/jenkins/.buildout/eggs/Products.PasswordResetTool-2.2.3-py2.7.egg/Products/PasswordResetTool/__init__.py", line 4, in <module>
    import PasswordResetTool
  File "/home/jenkins/.buildout/eggs/Products.PasswordResetTool-2.2.3-py2.7.egg/Products/PasswordResetTool/PasswordResetTool.py", line 24, in <module>
    from Products.CMFPlone.interfaces import ISecuritySchema
  File "/home/jenkins/workspace/plone-5.0-python-2.7-at/src/Products.CMFPlone/Products/CMFPlone/__init__.py", line 228, in <module>
    from Products.CMFPlone import earlypatches  # noqa
  File "/home/jenkins/workspace/plone-5.0-python-2.7-at/src/Products.CMFPlone/Products/CMFPlone/earlypatches/__init__.py", line 2, in <module>
    import security  # noqa
  File "/home/jenkins/workspace/plone-5.0-python-2.7-at/src/Products.CMFPlone/Products/CMFPlone/earlypatches/security.py", line 86, in <module>
    exec code in utils.getToolByName.func_globals
  File "<string>", line 5, in <module>
  File "/home/jenkins/workspace/plone-5.0-python-2.7-at/src/Products.ATContentTypes/Products/ATContentTypes/__init__.py", line 33, in <module>
    import Products.ATContentTypes.content  # noqa
  File "/home/jenkins/workspace/plone-5.0-python-2.7-at/src/Products.ATContentTypes/Products/ATContentTypes/content/__init__.py", line 2, in <module>
    import Products.ATContentTypes.content.link  # noqa
  File "/home/jenkins/workspace/plone-5.0-python-2.7-at/src/Products.ATContentTypes/Products/ATContentTypes/content/link.py", line 3, in <module>
    from Products.Archetypes.atapi import Schema
  File "/home/jenkins/workspace/plone-5.0-python-2.7-at/src/Products.Archetypes/Products/Archetypes/atapi.py", line 32, in <module>
    from Products.Archetypes.BaseObject import BaseObject
  File "/home/jenkins/workspace/plone-5.0-python-2.7-at/src/Products.Archetypes/Products/Archetypes/BaseObject.py", line 114, in <module>
    class BaseObject(Referenceable):
  File "/home/jenkins/workspace/plone-5.0-python-2.7-at/src/Products.Archetypes/Products/Archetypes/BaseObject.py", line 133, in BaseObject
    implements(IBaseObject, IReferenceable)


FAILED:  Products.Archetypes.tests.test_widgets.Startup

Error Message:
name 'implements' is not defined

Stack Trace:
name 'implements' is not defined

  File "/home/jenkins/workspace/plone-5.0-python-2.7-at/src/Products.Archetypes/Products/Archetypes/tests/test_widgets.py", line 31, in <module>
    from Products.Archetypes.tests.attestcase import ATTestCase
  File "/home/jenkins/workspace/plone-5.0-python-2.7-at/src/Products.Archetypes/Products/Archetypes/tests/attestcase.py", line 1, in <module>
    from plone.app.testing import bbb
  File "/home/jenkins/.buildout/eggs/plone.app.testing-5.0.6-py2.7.egg/plone/app/testing/__init__.py", line 4, in <module>
    from plone.app.testing.helpers import applyProfile
  File "/home/jenkins/.buildout/eggs/plone.app.testing-5.0.6-py2.7.egg/plone/app/testing/helpers.py", line 5, in <module>
    from plone.app.testing import layers
  File "/home/jenkins/.buildout/eggs/plone.app.testing-5.0.6-py2.7.egg/plone/app/testing/layers.py", line 27, in <module>
    class PloneFixture(Layer):
  File "/home/jenkins/.buildout/eggs/plone.app.testing-5.0.6-py2.7.egg/plone/app/testing/layers.py", line 81, in PloneFixture
    import Products.PasswordResetTool  # noqa
  File "/home/jenkins/.buildout/eggs/Products.PasswordResetTool-2.2.3-py2.7.egg/Products/PasswordResetTool/__init__.py", line 4, in <module>
    import PasswordResetTool
  File "/home/jenkins/.buildout/eggs/Products.PasswordResetTool-2.2.3-py2.7.egg/Products/PasswordResetTool/PasswordResetTool.py", line 24, in <module>
    from Products.CMFPlone.interfaces import ISecuritySchema
  File "/home/jenkins/workspace/plone-5.0-python-2.7-at/src/Products.CMFPlone/Products/CMFPlone/__init__.py", line 228, in <module>
    from Products.CMFPlone import earlypatches  # noqa
  File "/home/jenkins/workspace/plone-5.0-python-2.7-at/src/Products.CMFPlone/Products/CMFPlone/earlypatches/__init__.py", line 2, in <module>
    import security  # noqa
  File "/home/jenkins/workspace/plone-5.0-python-2.7-at/src/Products.CMFPlone/Products/CMFPlone/earlypatches/security.py", line 86, in <module>
    exec code in utils.getToolByName.func_globals
  File "<string>", line 5, in <module>
  File "/home/jenkins/workspace/plone-5.0-python-2.7-at/src/Products.ATContentTypes/Products/ATContentTypes/__init__.py", line 33, in <module>
    import Products.ATContentTypes.content  # noqa
  File "/home/jenkins/workspace/plone-5.0-python-2.7-at/src/Products.ATContentTypes/Products/ATContentTypes/content/__init__.py", line 2, in <module>
    import Products.ATContentTypes.content.link  # noqa
  File "/home/jenkins/workspace/plone-5.0-python-2.7-at/src/Products.ATContentTypes/Products/ATContentTypes/content/link.py", line 3, in <module>
    from Products.Archetypes.atapi import Schema
  File "/home/jenkins/workspace/plone-5.0-python-2.7-at/src/Products.Archetypes/Products/Archetypes/atapi.py", line 32, in <module>
    from Products.Archetypes.BaseObject import BaseObject
  File "/home/jenkins/workspace/plone-5.0-python-2.7-at/src/Products.Archetypes/Products/Archetypes/BaseObject.py", line 114, in <module>
    class BaseObject(Referenceable):
  File "/home/jenkins/workspace/plone-5.0-python-2.7-at/src/Products.Archetypes/Products/Archetypes/BaseObject.py", line 133, in BaseObject
    implements(IBaseObject, IReferenceable)


FAILED:  Products.CMFDynamicViewFTI.tests.test_browserdefault.Startup

Error Message:
name 'implements' is not defined

Stack Trace:
name 'implements' is not defined

  File "/home/jenkins/.buildout/eggs/Products.CMFDynamicViewFTI-4.1.5-py2.7.egg/Products/CMFDynamicViewFTI/tests/test_browserdefault.py", line 6, in <module>
    from Products.CMFDynamicViewFTI.tests import CMFDVFTITestCase
  File "/home/jenkins/.buildout/eggs/Products.CMFDynamicViewFTI-4.1.5-py2.7.egg/Products/CMFDynamicViewFTI/tests/CMFDVFTITestCase.py", line 5, in <module>
    from plone.app import testing
  File "/home/jenkins/.buildout/eggs/plone.app.testing-5.0.6-py2.7.egg/plone/app/testing/__init__.py", line 4, in <module>
    from plone.app.testing.helpers import applyProfile
  File "/home/jenkins/.buildout/eggs/plone.app.testing-5.0.6-py2.7.egg/plone/app/testing/helpers.py", line 5, in <module>
    from plone.app.testing import layers
  File "/home/jenkins/.buildout/eggs/plone.app.testing-5.0.6-py2.7.egg/plone/app/testing/layers.py", line 27, in <module>
    class PloneFixture(Layer):
  File "/home/jenkins/.buildout/eggs/plone.app.testing-5.0.6-py2.7.egg/plone/app/testing/layers.py", line 81, in PloneFixture
    import Products.PasswordResetTool  # noqa
  File "/home/jenkins/.buildout/eggs/Products.PasswordResetTool-2.2.3-py2.7.egg/Products/PasswordResetTool/__init__.py", line 4, in <module>
    import PasswordResetTool
  File "/home/jenkins/.buildout/eggs/Products.PasswordResetTool-2.2.3-py2.7.egg/Products/PasswordResetTool/PasswordResetTool.py", line 24, in <module>
    from Products.CMFPlone.interfaces import ISecuritySchema
  File "/home/jenkins/workspace/plone-5.0-python-2.7-at/src/Products.CMFPlone/Products/CMFPlone/__init__.py", line 228, in <module>
    from Products.CMFPlone import earlypatches  # noqa
  File "/home/jenkins/workspace/plone-5.0-python-2.7-at/src/Products.CMFPlone/Products/CMFPlone/earlypatches/__init__.py", line 2, in <module>
    import security  # noqa
  File "/home/jenkins/workspace/plone-5.0-python-2.7-at/src/Products.CMFPlone/Products/CMFPlone/earlypatches/security.py", line 86, in <module>
    exec code in utils.getToolByName.func_globals
  File "<string>", line 5, in <module>
  File "/home/jenkins/workspace/plone-5.0-python-2.7-at/src/Products.ATContentTypes/Products/ATContentTypes/__init__.py", line 33, in <module>
    import Products.ATContentTypes.content  # noqa
  File "/home/jenkins/workspace/plone-5.0-python-2.7-at/src/Products.ATContentTypes/Products/ATContentTypes/content/__init__.py", line 2, in <module>
    import Products.ATContentTypes.content.link  # noqa
  File "/home/jenkins/workspace/plone-5.0-python-2.7-at/src/Products.ATContentTypes/Products/ATContentTypes/content/link.py", line 3, in <module>
    from Products.Archetypes.atapi import Schema
  File "/home/jenkins/workspace/plone-5.0-python-2.7-at/src/Products.Archetypes/Products/Archetypes/atapi.py", line 32, in <module>
    from Products.Archetypes.BaseObject import BaseObject
  File "/home/jenkins/workspace/plone-5.0-python-2.7-at/src/Products.Archetypes/Products/Archetypes/BaseObject.py", line 114, in <module>
    class BaseObject(Referenceable):
  File "/home/jenkins/workspace/plone-5.0-python-2.7-at/src/Products.Archetypes/Products/Archetypes/BaseObject.py", line 133, in BaseObject
    implements(IBaseObject, IReferenceable)


FAILED:  Products.CMFDynamicViewFTI.tests.test_fti.Startup

Error Message:
name 'implements' is not defined

Stack Trace:
name 'implements' is not defined

  File "/home/jenkins/.buildout/eggs/Products.CMFDynamicViewFTI-4.1.5-py2.7.egg/Products/CMFDynamicViewFTI/tests/test_fti.py", line 2, in <module>
    from plone.app.testing import TEST_USER_NAME
  File "/home/jenkins/.buildout/eggs/plone.app.testing-5.0.6-py2.7.egg/plone/app/testing/__init__.py", line 4, in <module>
    from plone.app.testing.helpers import applyProfile
  File "/home/jenkins/.buildout/eggs/plone.app.testing-5.0.6-py2.7.egg/plone/app/testing/helpers.py", line 5, in <module>
    from plone.app.testing import layers
  File "/home/jenkins/.buildout/eggs/plone.app.testing-5.0.6-py2.7.egg/plone/app/testing/layers.py", line 27, in <module>
    class PloneFixture(Layer):
  File "/home/jenkins/.buildout/eggs/plone.app.testing-5.0.6-py2.7.egg/plone/app/testing/layers.py", line 81, in PloneFixture
    import Products.PasswordResetTool  # noqa
  File "/home/jenkins/.buildout/eggs/Products.PasswordResetTool-2.2.3-py2.7.egg/Products/PasswordResetTool/__init__.py", line 4, in <module>
    import PasswordResetTool
  File "/home/jenkins/.buildout/eggs/Products.PasswordResetTool-2.2.3-py2.7.egg/Products/PasswordResetTool/PasswordResetTool.py", line 24, in <module>
    from Products.CMFPlone.interfaces import ISecuritySchema
  File "/home/jenkins/workspace/plone-5.0-python-2.7-at/src/Products.CMFPlone/Products/CMFPlone/__init__.py", line 228, in <module>
    from Products.CMFPlone import earlypatches  # noqa
  File "/home/jenkins/workspace/plone-5.0-python-2.7-at/src/Products.CMFPlone/Products/CMFPlone/earlypatches/__init__.py", line 2, in <module>
    import security  # noqa
  File "/home/jenkins/workspace/plone-5.0-python-2.7-at/src/Products.CMFPlone/Products/CMFPlone/earlypatches/security.py", line 86, in <module>
    exec code in utils.getToolByName.func_globals
  File "<string>", line 5, in <module>
  File "/home/jenkins/workspace/plone-5.0-python-2.7-at/src/Products.ATContentTypes/Products/ATContentTypes/__init__.py", line 33, in <module>
    import Products.ATContentTypes.content  # noqa
  File "/home/jenkins/workspace/plone-5.0-python-2.7-at/src/Products.ATContentTypes/Products/ATContentTypes/content/__init__.py", line 2, in <module>
    import Products.ATContentTypes.content.link  # noqa
  File "/home/jenkins/workspace/plone-5.0-python-2.7-at/src/Products.ATContentTypes/Products/ATContentTypes/content/link.py", line 3, in <module>
    from Products.Archetypes.atapi import Schema
  File "/home/jenkins/workspace/plone-5.0-python-2.7-at/src/Products.Archetypes/Products/Archetypes/atapi.py", line 32, in <module>
    from Products.Archetypes.BaseObject import BaseObject
  File "/home/jenkins/workspace/plone-5.0-python-2.7-at/src/Products.Archetypes/Products/Archetypes/BaseObject.py", line 114, in <module>
    class BaseObject(Referenceable):
  File "/home/jenkins/workspace/plone-5.0-python-2.7-at/src/Products.Archetypes/Products/Archetypes/BaseObject.py", line 133, in BaseObject
    implements(IBaseObject, IReferenceable)


FAILED:  Products.CMFFormController.tests.testCopyRename.Startup

Error Message:
name 'implements' is not defined

Stack Trace:
name 'implements' is not defined

  File "/home/jenkins/.buildout/eggs/Products.CMFFormController-3.0.8-py2.7.egg/Products/CMFFormController/tests/testCopyRename.py", line 5, in <module>
    from plone.app.testing.bbb import PloneTestCase
  File "/home/jenkins/.buildout/eggs/plone.app.testing-5.0.6-py2.7.egg/plone/app/testing/__init__.py", line 4, in <module>
    from plone.app.testing.helpers import applyProfile
  File "/home/jenkins/.buildout/eggs/plone.app.testing-5.0.6-py2.7.egg/plone/app/testing/helpers.py", line 5, in <module>
    from plone.app.testing import layers
  File "/home/jenkins/.buildout/eggs/plone.app.testing-5.0.6-py2.7.egg/plone/app/testing/layers.py", line 27, in <module>
    class PloneFixture(Layer):
  File "/home/jenkins/.buildout/eggs/plone.app.testing-5.0.6-py2.7.egg/plone/app/testing/layers.py", line 81, in PloneFixture
    import Products.PasswordResetTool  # noqa
  File "/home/jenkins/.buildout/eggs/Products.PasswordResetTool-2.2.3-py2.7.egg/Products/PasswordResetTool/__init__.py", line 4, in <module>
    import PasswordResetTool
  File "/home/jenkins/.buildout/eggs/Products.PasswordResetTool-2.2.3-py2.7.egg/Products/PasswordResetTool/PasswordResetTool.py", line 24, in <module>
    from Products.CMFPlone.interfaces import ISecuritySchema
  File "/home/jenkins/workspace/plone-5.0-python-2.7-at/src/Products.CMFPlone/Products/CMFPlone/__init__.py", line 228, in <module>
    from Products.CMFPlone import earlypatches  # noqa
  File "/home/jenkins/workspace/plone-5.0-python-2.7-at/src/Products.CMFPlone/Products/CMFPlone/earlypatches/__init__.py", line 2, in <module>
    import security  # noqa
  File "/home/jenkins/workspace/plone-5.0-python-2.7-at/src/Products.CMFPlone/Products/CMFPlone/earlypatches/security.py", line 86, in <module>
    exec code in utils.getToolByName.func_globals
  File "<string>", line 5, in <module>
  File "/home/jenkins/workspace/plone-5.0-python-2.7-at/src/Products.ATContentTypes/Products/ATContentTypes/__init__.py", line 33, in <module>
    import Products.ATContentTypes.content  # noqa
  File "/home/jenkins/workspace/plone-5.0-python-2.7-at/src/Products.ATContentTypes/Products/ATContentTypes/content/__init__.py", line 2, in <module>
    import Products.ATContentTypes.content.link  # noqa
  File "/home/jenkins/workspace/plone-5.0-python-2.7-at/src/Products.ATContentTypes/Products/ATContentTypes/content/link.py", line 3, in <module>
    from Products.Archetypes.atapi import Schema
  File "/home/jenkins/workspace/plone-5.0-python-2.7-at/src/Products.Archetypes/Products/Archetypes/atapi.py", line 32, in <module>
    from Products.Archetypes.BaseObject import BaseObject
  File "/home/jenkins/workspace/plone-5.0-python-2.7-at/src/Products.Archetypes/Products/Archetypes/BaseObject.py", line 114, in <module>
    class BaseObject(Referenceable):
  File "/home/jenkins/workspace/plone-5.0-python-2.7-at/src/Products.Archetypes/Products/Archetypes/BaseObject.py", line 133, in BaseObject
    implements(IBaseObject, IReferenceable)


FAILED:  Products.CMFFormController.tests.testRedirectTo.Startup

Error Message:
name 'implements' is not defined

Stack Trace:
name 'implements' is not defined

  File "/home/jenkins/.buildout/eggs/Products.CMFFormController-3.0.8-py2.7.egg/Products/CMFFormController/tests/testRedirectTo.py", line 5, in <module>
    from plone.app.testing import setRoles
  File "/home/jenkins/.buildout/eggs/plone.app.testing-5.0.6-py2.7.egg/plone/app/testing/__init__.py", line 4, in <module>
    from plone.app.testing.helpers import applyProfile
  File "/home/jenkins/.buildout/eggs/plone.app.testing-5.0.6-py2.7.egg/plone/app/testing/helpers.py", line 5, in <module>
    from plone.app.testing import layers
  File "/home/jenkins/.buildout/eggs/plone.app.testing-5.0.6-py2.7.egg/plone/app/testing/layers.py", line 27, in <module>
    class PloneFixture(Layer):
  File "/home/jenkins/.buildout/eggs/plone.app.testing-5.0.6-py2.7.egg/plone/app/testing/layers.py", line 81, in PloneFixture
    import Products.PasswordResetTool  # noqa
  File "/home/jenkins/.buildout/eggs/Products.PasswordResetTool-2.2.3-py2.7.egg/Products/PasswordResetTool/__init__.py", line 4, in <module>
    import PasswordResetTool
  File "/home/jenkins/.buildout/eggs/Products.PasswordResetTool-2.2.3-py2.7.egg/Products/PasswordResetTool/PasswordResetTool.py", line 24, in <module>
    from Products.CMFPlone.interfaces import ISecuritySchema
  File "/home/jenkins/workspace/plone-5.0-python-2.7-at/src/Products.CMFPlone/Products/CMFPlone/__init__.py", line 228, in <module>
    from Products.CMFPlone import earlypatches  # noqa
  File "/home/jenkins/workspace/plone-5.0-python-2.7-at/src/Products.CMFPlone/Products/CMFPlone/earlypatches/__init__.py", line 2, in <module>
    import security  # noqa
  File "/home/jenkins/workspace/plone-5.0-python-2.7-at/src/Products.CMFPlone/Products/CMFPlone/earlypatches/security.py", line 86, in <module>
    exec code in utils.getToolByName.func_globals
  File "<string>", line 5, in <module>
  File "/home/jenkins/workspace/plone-5.0-python-2.7-at/src/Products.ATContentTypes/Products/ATContentTypes/__init__.py", line 33, in <module>
    import Products.ATContentTypes.content  # noqa
  File "/home/jenkins/workspace/plone-5.0-python-2.7-at/src/Products.ATContentTypes/Products/ATContentTypes/content/__init__.py", line 2, in <module>
    import Products.ATContentTypes.content.link  # noqa
  File "/home/jenkins/workspace/plone-5.0-python-2.7-at/src/Products.ATContentTypes/Products/ATContentTypes/content/link.py", line 3, in <module>
    from Products.Archetypes.atapi import Schema
  File "/home/jenkins/workspace/plone-5.0-python-2.7-at/src/Products.Archetypes/Products/Archetypes/atapi.py", line 32, in <module>
    from Products.Archetypes.BaseObject import BaseObject
  File "/home/jenkins/workspace/plone-5.0-python-2.7-at/src/Products.Archetypes/Products/Archetypes/BaseObject.py", line 114, in <module>
    class BaseObject(Referenceable):
  File "/home/jenkins/workspace/plone-5.0-python-2.7-at/src/Products.Archetypes/Products/Archetypes/BaseObject.py", line 133, in BaseObject
    implements(IBaseObject, IReferenceable)


FAILED:  Products.MimetypesRegistry.tests.test_encoding.Startup

Error Message:
name 'implements' is not defined

Stack Trace:
name 'implements' is not defined

  File "/home/jenkins/.buildout/eggs/Products.MimetypesRegistry-2.0.10-py2.7.egg/Products/MimetypesRegistry/tests/test_encoding.py", line 2, in <module>
    from plone.app.testing.bbb import PloneTestCase as ATSiteTestCase
  File "/home/jenkins/.buildout/eggs/plone.app.testing-5.0.6-py2.7.egg/plone/app/testing/__init__.py", line 4, in <module>
    from plone.app.testing.helpers import applyProfile
  File "/home/jenkins/.buildout/eggs/plone.app.testing-5.0.6-py2.7.egg/plone/app/testing/helpers.py", line 5, in <module>
    from plone.app.testing import layers
  File "/home/jenkins/.buildout/eggs/plone.app.testing-5.0.6-py2.7.egg/plone/app/testing/layers.py", line 27, in <module>
    class PloneFixture(Layer):
  File "/home/jenkins/.buildout/eggs/plone.app.testing-5.0.6-py2.7.egg/plone/app/testing/layers.py", line 81, in PloneFixture
    import Products.PasswordResetTool  # noqa
  File "/home/jenkins/.buildout/eggs/Products.PasswordResetTool-2.2.3-py2.7.egg/Products/PasswordResetTool/__init__.py", line 4, in <module>
    import PasswordResetTool
  File "/home/jenkins/.buildout/eggs/Products.PasswordResetTool-2.2.3-py2.7.egg/Products/PasswordResetTool/PasswordResetTool.py", line 24, in <module>
    from Products.CMFPlone.interfaces import ISecuritySchema
  File "/home/jenkins/workspace/plone-5.0-python-2.7-at/src/Products.CMFPlone/Products/CMFPlone/__init__.py", line 228, in <module>
    from Products.CMFPlone import earlypatches  # noqa
  File "/home/jenkins/workspace/plone-5.0-python-2.7-at/src/Products.CMFPlone/Products/CMFPlone/earlypatches/__init__.py", line 2, in <module>
    import security  # noqa
  File "/home/jenkins/workspace/plone-5.0-python-2.7-at/src/Products.CMFPlone/Products/CMFPlone/earlypatches/security.py", line 86, in <module>
    exec code in utils.getToolByName.func_globals
  File "<string>", line 5, in <module>
  File "/home/jenkins/workspace/plone-5.0-python-2.7-at/src/Products.ATContentTypes/Products/ATContentTypes/__init__.py", line 33, in <module>
    import Products.ATContentTypes.content  # noqa
  File "/home/jenkins/workspace/plone-5.0-python-2.7-at/src/Products.ATContentTypes/Products/ATContentTypes/content/__init__.py", line 2, in <module>
    import Products.ATContentTypes.content.link  # noqa
  File "/home/jenkins/workspace/plone-5.0-python-2.7-at/src/Products.ATContentTypes/Products/ATContentTypes/content/link.py", line 3, in <module>
    from Products.Archetypes.atapi import Schema
  File "/home/jenkins/workspace/plone-5.0-python-2.7-at/src/Products.Archetypes/Products/Archetypes/atapi.py", line 32, in <module>
    from Products.Archetypes.BaseObject import BaseObject
  File "/home/jenkins/workspace/plone-5.0-python-2.7-at/src/Products.Archetypes/Products/Archetypes/BaseObject.py", line 114, in <module>
    class BaseObject(Referenceable):
  File "/home/jenkins/workspace/plone-5.0-python-2.7-at/src/Products.Archetypes/Products/Archetypes/BaseObject.py", line 133, in BaseObject
    implements(IBaseObject, IReferenceable)


FAILED:  Products.MimetypesRegistry.tests.test_magic.Startup

Error Message:
name 'implements' is not defined

Stack Trace:
name 'implements' is not defined

  File "/home/jenkins/.buildout/eggs/Products.MimetypesRegistry-2.0.10-py2.7.egg/Products/MimetypesRegistry/tests/test_magic.py", line 4, in <module>
    from plone.app.testing.bbb import PloneTestCase as ATSiteTestCase
  File "/home/jenkins/.buildout/eggs/plone.app.testing-5.0.6-py2.7.egg/plone/app/testing/__init__.py", line 4, in <module>
    from plone.app.testing.helpers import applyProfile
  File "/home/jenkins/.buildout/eggs/plone.app.testing-5.0.6-py2.7.egg/plone/app/testing/helpers.py", line 5, in <module>
    from plone.app.testing import layers
  File "/home/jenkins/.buildout/eggs/plone.app.testing-5.0.6-py2.7.egg/plone/app/testing/layers.py", line 27, in <module>
    class PloneFixture(Layer):
  File "/home/jenkins/.buildout/eggs/plone.app.testing-5.0.6-py2.7.egg/plone/app/testing/layers.py", line 81, in PloneFixture
    import Products.PasswordResetTool  # noqa
  File "/home/jenkins/.buildout/eggs/Products.PasswordResetTool-2.2.3-py2.7.egg/Products/PasswordResetTool/__init__.py", line 4, in <module>
    import PasswordResetTool
  File "/home/jenkins/.buildout/eggs/Products.PasswordResetTool-2.2.3-py2.7.egg/Products/PasswordResetTool/PasswordResetTool.py", line 24, in <module>
    from Products.CMFPlone.interfaces import ISecuritySchema
  File "/home/jenkins/workspace/plone-5.0-python-2.7-at/src/Products.CMFPlone/Products/CMFPlone/__init__.py", line 228, in <module>
    from Products.CMFPlone import earlypatches  # noqa
  File "/home/jenkins/workspace/plone-5.0-python-2.7-at/src/Products.CMFPlone/Products/CMFPlone/earlypatches/__init__.py", line 2, in <module>
    import security  # noqa
  File "/home/jenkins/workspace/plone-5.0-python-2.7-at/src/Products.CMFPlone/Products/CMFPlone/earlypatches/security.py", line 86, in <module>
    exec code in utils.getToolByName.func_globals
  File "<string>", line 5, in <module>
  File "/home/jenkins/workspace/plone-5.0-python-2.7-at/src/Products.ATContentTypes/Products/ATContentTypes/__init__.py", line 33, in <module>
    import Products.ATContentTypes.content  # noqa
  File "/home/jenkins/workspace/plone-5.0-python-2.7-at/src/Products.ATContentTypes/Products/ATContentTypes/content/__init__.py", line 2, in <module>
    import Products.ATContentTypes.content.link  # noqa
  File "/home/jenkins/workspace/plone-5.0-python-2.7-at/src/Products.ATContentTypes/Products/ATContentTypes/content/link.py", line 3, in <module>
    from Products.Archetypes.atapi import Schema
  File "/home/jenkins/workspace/plone-5.0-python-2.7-at/src/Products.Archetypes/Products/Archetypes/atapi.py", line 32, in <module>
    from Products.Archetypes.BaseObject import BaseObject
  File "/home/jenkins/workspace/plone-5.0-python-2.7-at/src/Products.Archetypes/Products/Archetypes/BaseObject.py", line 114, in <module>
    class BaseObject(Referenceable):
  File "/home/jenkins/workspace/plone-5.0-python-2.7-at/src/Products.Archetypes/Products/Archetypes/BaseObject.py", line 133, in BaseObject
    implements(IBaseObject, IReferenceable)


FAILED:  Products.MimetypesRegistry.tests.test_mimetypes.Startup

Error Message:
name 'implements' is not defined

Stack Trace:
name 'implements' is not defined

  File "/home/jenkins/.buildout/eggs/Products.MimetypesRegistry-2.0.10-py2.7.egg/Products/MimetypesRegistry/tests/test_mimetypes.py", line 6, in <module>
    from plone.app.testing.bbb import PloneTestCase as ATSiteTestCase
  File "/home/jenkins/.buildout/eggs/plone.app.testing-5.0.6-py2.7.egg/plone/app/testing/__init__.py", line 4, in <module>
    from plone.app.testing.helpers import applyProfile
  File "/home/jenkins/.buildout/eggs/plone.app.testing-5.0.6-py2.7.egg/plone/app/testing/helpers.py", line 5, in <module>
    from plone.app.testing import layers
  File "/home/jenkins/.buildout/eggs/plone.app.testing-5.0.6-py2.7.egg/plone/app/testing/layers.py", line 27, in <module>
    class PloneFixture(Layer):
  File "/home/jenkins/.buildout/eggs/plone.app.testing-5.0.6-py2.7.egg/plone/app/testing/layers.py", line 81, in PloneFixture
    import Products.PasswordResetTool  # noqa
  File "/home/jenkins/.buildout/eggs/Products.PasswordResetTool-2.2.3-py2.7.egg/Products/PasswordResetTool/__init__.py", line 4, in <module>
    import PasswordResetTool
  File "/home/jenkins/.buildout/eggs/Products.PasswordResetTool-2.2.3-py2.7.egg/Products/PasswordResetTool/PasswordResetTool.py", line 24, in <module>
    from Products.CMFPlone.interfaces import ISecuritySchema
  File "/home/jenkins/workspace/plone-5.0-python-2.7-at/src/Products.CMFPlone/Products/CMFPlone/__init__.py", line 228, in <module>
    from Products.CMFPlone import earlypatches  # noqa
  File "/home/jenkins/workspace/plone-5.0-python-2.7-at/src/Products.CMFPlone/Products/CMFPlone/earlypatches/__init__.py", line 2, in <module>
    import security  # noqa
  File "/home/jenkins/workspace/plone-5.0-python-2.7-at/src/Products.CMFPlone/Products/CMFPlone/earlypatches/security.py", line 86, in <module>
    exec code in utils.getToolByName.func_globals
  File "<string>", line 5, in <module>
  File "/home/jenkins/workspace/plone-5.0-python-2.7-at/src/Products.ATContentTypes/Products/ATContentTypes/__init__.py", line 33, in <module>
    import Products.ATContentTypes.content  # noqa
  File "/home/jenkins/workspace/plone-5.0-python-2.7-at/src/Products.ATContentTypes/Products/ATContentTypes/content/__init__.py", line 2, in <module>
    import Products.ATContentTypes.content.link  # noqa
  File "/home/jenkins/workspace/plone-5.0-python-2.7-at/src/Products.ATContentTypes/Products/ATContentTypes/content/link.py", line 3, in <module>
    from Products.Archetypes.atapi import Schema
  File "/home/jenkins/workspace/plone-5.0-python-2.7-at/src/Products.Archetypes/Products/Archetypes/atapi.py", line 32, in <module>
    from Products.Archetypes.BaseObject import BaseObject
  File "/home/jenkins/workspace/plone-5.0-python-2.7-at/src/Products.Archetypes/Products/Archetypes/BaseObject.py", line 114, in <module>
    class BaseObject(Referenceable):
  File "/home/jenkins/workspace/plone-5.0-python-2.7-at/src/Products.Archetypes/Products/Archetypes/BaseObject.py", line 133, in BaseObject
    implements(IBaseObject, IReferenceable)


FAILED:  Products.PortalTransforms.tests.test_engine.Startup

Error Message:
name 'implements' is not defined

Stack Trace:
name 'implements' is not defined

  File "/home/jenkins/.buildout/eggs/Products.PortalTransforms-2.2.1-py2.7.egg/Products/PortalTransforms/tests/test_engine.py", line 2, in <module>
    from Products.Archetypes.tests.atsitetestcase import ATSiteTestCase
  File "/home/jenkins/workspace/plone-5.0-python-2.7-at/src/Products.Archetypes/Products/Archetypes/tests/atsitetestcase.py", line 1, in <module>
    from Products.Archetypes.tests.attestcase import ATTestCase as ATSiteTestCase
  File "/home/jenkins/workspace/plone-5.0-python-2.7-at/src/Products.Archetypes/Products/Archetypes/tests/attestcase.py", line 1, in <module>
    from plone.app.testing import bbb
  File "/home/jenkins/.buildout/eggs/plone.app.testing-5.0.6-py2.7.egg/plone/app/testing/__init__.py", line 4, in <module>
    from plone.app.testing.helpers import applyProfile
  File "/home/jenkins/.buildout/eggs/plone.app.testing-5.0.6-py2.7.egg/plone/app/testing/helpers.py", line 5, in <module>
    from plone.app.testing import layers
  File "/home/jenkins/.buildout/eggs/plone.app.testing-5.0.6-py2.7.egg/plone/app/testing/layers.py", line 27, in <module>
    class PloneFixture(Layer):
  File "/home/jenkins/.buildout/eggs/plone.app.testing-5.0.6-py2.7.egg/plone/app/testing/layers.py", line 81, in PloneFixture
    import Products.PasswordResetTool  # noqa
  File "/home/jenkins/.buildout/eggs/Products.PasswordResetTool-2.2.3-py2.7.egg/Products/PasswordResetTool/__init__.py", line 4, in <module>
    import PasswordResetTool
  File "/home/jenkins/.buildout/eggs/Products.PasswordResetTool-2.2.3-py2.7.egg/Products/PasswordResetTool/PasswordResetTool.py", line 24, in <module>
    from Products.CMFPlone.interfaces import ISecuritySchema
  File "/home/jenkins/workspace/plone-5.0-python-2.7-at/src/Products.CMFPlone/Products/CMFPlone/__init__.py", line 228, in <module>
    from Products.CMFPlone import earlypatches  # noqa
  File "/home/jenkins/workspace/plone-5.0-python-2.7-at/src/Products.CMFPlone/Products/CMFPlone/earlypatches/__init__.py", line 2, in <module>
    import security  # noqa
  File "/home/jenkins/workspace/plone-5.0-python-2.7-at/src/Products.CMFPlone/Products/CMFPlone/earlypatches/security.py", line 86, in <module>
    exec code in utils.getToolByName.func_globals
  File "<string>", line 5, in <module>
  File "/home/jenkins/workspace/plone-5.0-python-2.7-at/src/Products.ATContentTypes/Products/ATContentTypes/__init__.py", line 33, in <module>
    import Products.ATContentTypes.content  # noqa
  File "/home/jenkins/workspace/plone-5.0-python-2.7-at/src/Products.ATContentTypes/Products/ATContentTypes/content/__init__.py", line 2, in <module>
    import Products.ATContentTypes.content.link  # noqa
  File "/home/jenkins/workspace/plone-5.0-python-2.7-at/src/Products.ATContentTypes/Products/ATContentTypes/content/link.py", line 3, in <module>
    from Products.Archetypes.atapi import Schema
  File "/home/jenkins/workspace/plone-5.0-python-2.7-at/src/Products.Archetypes/Products/Archetypes/atapi.py", line 32, in <module>
    from Products.Archetypes.BaseObject import BaseObject
  File "/home/jenkins/workspace/plone-5.0-python-2.7-at/src/Products.Archetypes/Products/Archetypes/BaseObject.py", line 114, in <module>
    class BaseObject(Referenceable):
  File "/home/jenkins/workspace/plone-5.0-python-2.7-at/src/Products.Archetypes/Products/Archetypes/BaseObject.py", line 133, in BaseObject
    implements(IBaseObject, IReferenceable)


FAILED:  Products.PortalTransforms.tests.test_graph.Startup

Error Message:
name 'implements' is not defined

Stack Trace:
name 'implements' is not defined

  File "/home/jenkins/.buildout/eggs/Products.PortalTransforms-2.2.1-py2.7.egg/Products/PortalTransforms/tests/test_graph.py", line 2, in <module>
    from Products.Archetypes.tests.atsitetestcase import ATSiteTestCase
  File "/home/jenkins/workspace/plone-5.0-python-2.7-at/src/Products.Archetypes/Products/Archetypes/tests/atsitetestcase.py", line 1, in <module>
    from Products.Archetypes.tests.attestcase import ATTestCase as ATSiteTestCase
  File "/home/jenkins/workspace/plone-5.0-python-2.7-at/src/Products.Archetypes/Products/Archetypes/tests/attestcase.py", line 1, in <module>
    from plone.app.testing import bbb
  File "/home/jenkins/.buildout/eggs/plone.app.testing-5.0.6-py2.7.egg/plone/app/testing/__init__.py", line 4, in <module>
    from plone.app.testing.helpers import applyProfile
  File "/home/jenkins/.buildout/eggs/plone.app.testing-5.0.6-py2.7.egg/plone/app/testing/helpers.py", line 5, in <module>
    from plone.app.testing import layers
  File "/home/jenkins/.buildout/eggs/plone.app.testing-5.0.6-py2.7.egg/plone/app/testing/layers.py", line 27, in <module>
    class PloneFixture(Layer):
  File "/home/jenkins/.buildout/eggs/plone.app.testing-5.0.6-py2.7.egg/plone/app/testing/layers.py", line 81, in PloneFixture
    import Products.PasswordResetTool  # noqa
  File "/home/jenkins/.buildout/eggs/Products.PasswordResetTool-2.2.3-py2.7.egg/Products/PasswordResetTool/__init__.py", line 4, in <module>
    import PasswordResetTool
  File "/home/jenkins/.buildout/eggs/Products.PasswordResetTool-2.2.3-py2.7.egg/Products/PasswordResetTool/PasswordResetTool.py", line 24, in <module>
    from Products.CMFPlone.interfaces import ISecuritySchema
  File "/home/jenkins/workspace/plone-5.0-python-2.7-at/src/Products.CMFPlone/Products/CMFPlone/__init__.py", line 228, in <module>
    from Products.CMFPlone import earlypatches  # noqa
  File "/home/jenkins/workspace/plone-5.0-python-2.7-at/src/Products.CMFPlone/Products/CMFPlone/earlypatches/__init__.py", line 2, in <module>
    import security  # noqa
  File "/home/jenkins/workspace/plone-5.0-python-2.7-at/src/Products.CMFPlone/Products/CMFPlone/earlypatches/security.py", line 86, in <module>
    exec code in utils.getToolByName.func_globals
  File "<string>", line 5, in <module>
  File "/home/jenkins/workspace/plone-5.0-python-2.7-at/src/Products.ATContentTypes/Products/ATContentTypes/__init__.py", line 33, in <module>
    import Products.ATContentTypes.content  # noqa
  File "/home/jenkins/workspace/plone-5.0-python-2.7-at/src/Products.ATContentTypes/Products/ATContentTypes/content/__init__.py", line 2, in <module>
    import Products.ATContentTypes.content.link  # noqa
  File "/home/jenkins/workspace/plone-5.0-python-2.7-at/src/Products.ATContentTypes/Products/ATContentTypes/content/link.py", line 3, in <module>
    from Products.Archetypes.atapi import Schema
  File "/home/jenkins/workspace/plone-5.0-python-2.7-at/src/Products.Archetypes/Products/Archetypes/atapi.py", line 32, in <module>
    from Products.Archetypes.BaseObject import BaseObject
  File "/home/jenkins/workspace/plone-5.0-python-2.7-at/src/Products.Archetypes/Products/Archetypes/BaseObject.py", line 114, in <module>
    class BaseObject(Referenceable):
  File "/home/jenkins/workspace/plone-5.0-python-2.7-at/src/Products.Archetypes/Products/Archetypes/BaseObject.py", line 133, in BaseObject
    implements(IBaseObject, IReferenceable)


FAILED:  Products.PortalTransforms.tests.test_intelligenttext.Startup

Error Message:
name 'implements' is not defined

Stack Trace:
name 'implements' is not defined

  File "/home/jenkins/.buildout/eggs/Products.PortalTransforms-2.2.1-py2.7.egg/Products/PortalTransforms/tests/test_intelligenttext.py", line 2, in <module>
    from Products.Archetypes.tests.atsitetestcase import ATSiteTestCase
  File "/home/jenkins/workspace/plone-5.0-python-2.7-at/src/Products.Archetypes/Products/Archetypes/tests/atsitetestcase.py", line 1, in <module>
    from Products.Archetypes.tests.attestcase import ATTestCase as ATSiteTestCase
  File "/home/jenkins/workspace/plone-5.0-python-2.7-at/src/Products.Archetypes/Products/Archetypes/tests/attestcase.py", line 1, in <module>
    from plone.app.testing import bbb
  File "/home/jenkins/.buildout/eggs/plone.app.testing-5.0.6-py2.7.egg/plone/app/testing/__init__.py", line 4, in <module>
    from plone.app.testing.helpers import applyProfile
  File "/home/jenkins/.buildout/eggs/plone.app.testing-5.0.6-py2.7.egg/plone/app/testing/helpers.py", line 5, in <module>
    from plone.app.testing import layers
  File "/home/jenkins/.buildout/eggs/plone.app.testing-5.0.6-py2.7.egg/plone/app/testing/layers.py", line 27, in <module>
    class PloneFixture(Layer):
  File "/home/jenkins/.buildout/eggs/plone.app.testing-5.0.6-py2.7.egg/plone/app/testing/layers.py", line 81, in PloneFixture
    import Products.PasswordResetTool  # noqa
  File "/home/jenkins/.buildout/eggs/Products.PasswordResetTool-2.2.3-py2.7.egg/Products/PasswordResetTool/__init__.py", line 4, in <module>
    import PasswordResetTool
  File "/home/jenkins/.buildout/eggs/Products.PasswordResetTool-2.2.3-py2.7.egg/Products/PasswordResetTool/PasswordResetTool.py", line 24, in <module>
    from Products.CMFPlone.interfaces import ISecuritySchema
  File "/home/jenkins/workspace/plone-5.0-python-2.7-at/src/Products.CMFPlone/Products/CMFPlone/__init__.py", line 228, in <module>
    from Products.CMFPlone import earlypatches  # noqa
  File "/home/jenkins/workspace/plone-5.0-python-2.7-at/src/Products.CMFPlone/Products/CMFPlone/earlypatches/__init__.py", line 2, in <module>
    import security  # noqa
  File "/home/jenkins/workspace/plone-5.0-python-2.7-at/src/Products.CMFPlone/Products/CMFPlone/earlypatches/security.py", line 86, in <module>
    exec code in utils.getToolByName.func_globals
  File "<string>", line 5, in <module>
  File "/home/jenkins/workspace/plone-5.0-python-2.7-at/src/Products.ATContentTypes/Products/ATContentTypes/__init__.py", line 33, in <module>
    import Products.ATContentTypes.content  # noqa
  File "/home/jenkins/workspace/plone-5.0-python-2.7-at/src/Products.ATContentTypes/Products/ATContentTypes/content/__init__.py", line 2, in <module>
    import Products.ATContentTypes.content.link  # noqa
  File "/home/jenkins/workspace/plone-5.0-python-2.7-at/src/Products.ATContentTypes/Products/ATContentTypes/content/link.py", line 3, in <module>
    from Products.Archetypes.atapi import Schema
  File "/home/jenkins/workspace/plone-5.0-python-2.7-at/src/Products.Archetypes/Products/Archetypes/atapi.py", line 32, in <module>
    from Products.Archetypes.BaseObject import BaseObject
  File "/home/jenkins/workspace/plone-5.0-python-2.7-at/src/Products.Archetypes/Products/Archetypes/BaseObject.py", line 114, in <module>
    class BaseObject(Referenceable):
  File "/home/jenkins/workspace/plone-5.0-python-2.7-at/src/Products.Archetypes/Products/Archetypes/BaseObject.py", line 133, in BaseObject
    implements(IBaseObject, IReferenceable)


FAILED:  Products.PortalTransforms.tests.test_transforms.Startup

Error Message:
name 'implements' is not defined

Stack Trace:
name 'implements' is not defined

  File "/home/jenkins/.buildout/eggs/Products.PortalTransforms-2.2.1-py2.7.egg/Products/PortalTransforms/tests/test_transforms.py", line 3, in <module>
    from Products.Archetypes.tests.atsitetestcase import ATSiteTestCase
  File "/home/jenkins/workspace/plone-5.0-python-2.7-at/src/Products.Archetypes/Products/Archetypes/tests/atsitetestcase.py", line 1, in <module>
    from Products.Archetypes.tests.attestcase import ATTestCase as ATSiteTestCase
  File "/home/jenkins/workspace/plone-5.0-python-2.7-at/src/Products.Archetypes/Products/Archetypes/tests/attestcase.py", line 1, in <module>
    from plone.app.testing import bbb
  File "/home/jenkins/.buildout/eggs/plone.app.testing-5.0.6-py2.7.egg/plone/app/testing/__init__.py", line 4, in <module>
    from plone.app.testing.helpers import applyProfile
  File "/home/jenkins/.buildout/eggs/plone.app.testing-5.0.6-py2.7.egg/plone/app/testing/helpers.py", line 5, in <module>
    from plone.app.testing import layers
  File "/home/jenkins/.buildout/eggs/plone.app.testing-5.0.6-py2.7.egg/plone/app/testing/layers.py", line 27, in <module>
    class PloneFixture(Layer):
  File "/home/jenkins/.buildout/eggs/plone.app.testing-5.0.6-py2.7.egg/plone/app/testing/layers.py", line 81, in PloneFixture
    import Products.PasswordResetTool  # noqa
  File "/home/jenkins/.buildout/eggs/Products.PasswordResetTool-2.2.3-py2.7.egg/Products/PasswordResetTool/__init__.py", line 4, in <module>
    import PasswordResetTool
  File "/home/jenkins/.buildout/eggs/Products.PasswordResetTool-2.2.3-py2.7.egg/Products/PasswordResetTool/PasswordResetTool.py", line 24, in <module>
    from Products.CMFPlone.interfaces import ISecuritySchema
  File "/home/jenkins/workspace/plone-5.0-python-2.7-at/src/Products.CMFPlone/Products/CMFPlone/__init__.py", line 228, in <module>
    from Products.CMFPlone import earlypatches  # noqa
  File "/home/jenkins/workspace/plone-5.0-python-2.7-at/src/Products.CMFPlone/Products/CMFPlone/earlypatches/__init__.py", line 2, in <module>
    import security  # noqa
  File "/home/jenkins/workspace/plone-5.0-python-2.7-at/src/Products.CMFPlone/Products/CMFPlone/earlypatches/security.py", line 86, in <module>
    exec code in utils.getToolByName.func_globals
  File "<string>", line 5, in <module>
  File "/home/jenkins/workspace/plone-5.0-python-2.7-at/src/Products.ATContentTypes/Products/ATContentTypes/__init__.py", line 33, in <module>
    import Products.ATContentTypes.content  # noqa
  File "/home/jenkins/workspace/plone-5.0-python-2.7-at/src/Products.ATContentTypes/Products/ATContentTypes/content/__init__.py", line 2, in <module>
    import Products.ATContentTypes.content.link  # noqa
  File "/home/jenkins/workspace/plone-5.0-python-2.7-at/src/Products.ATContentTypes/Products/ATContentTypes/content/link.py", line 3, in <module>
    from Products.Archetypes.atapi import Schema
  File "/home/jenkins/workspace/plone-5.0-python-2.7-at/src/Products.Archetypes/Products/Archetypes/atapi.py", line 32, in <module>
    from Products.Archetypes.BaseObject import BaseObject
  File "/home/jenkins/workspace/plone-5.0-python-2.7-at/src/Products.Archetypes/Products/Archetypes/BaseObject.py", line 114, in <module>
    class BaseObject(Referenceable):
  File "/home/jenkins/workspace/plone-5.0-python-2.7-at/src/Products.Archetypes/Products/Archetypes/BaseObject.py", line 133, in BaseObject
    implements(IBaseObject, IReferenceable)


FAILED:  Products.PortalTransforms.tests.test_xss.Startup

Error Message:
name 'implements' is not defined

Stack Trace:
name 'implements' is not defined

  File "/home/jenkins/.buildout/eggs/Products.PortalTransforms-2.2.1-py2.7.egg/Products/PortalTransforms/tests/test_xss.py", line 2, in <module>
    from Products.Archetypes.tests.atsitetestcase import ATSiteTestCase
  File "/home/jenkins/workspace/plone-5.0-python-2.7-at/src/Products.Archetypes/Products/Archetypes/tests/atsitetestcase.py", line 1, in <module>
    from Products.Archetypes.tests.attestcase import ATTestCase as ATSiteTestCase
  File "/home/jenkins/workspace/plone-5.0-python-2.7-at/src/Products.Archetypes/Products/Archetypes/tests/attestcase.py", line 1, in <module>
    from plone.app.testing import bbb
  File "/home/jenkins/.buildout/eggs/plone.app.testing-5.0.6-py2.7.egg/plone/app/testing/__init__.py", line 4, in <module>
    from plone.app.testing.helpers import applyProfile
  File "/home/jenkins/.buildout/eggs/plone.app.testing-5.0.6-py2.7.egg/plone/app/testing/helpers.py", line 5, in <module>
    from plone.app.testing import layers
  File "/home/jenkins/.buildout/eggs/plone.app.testing-5.0.6-py2.7.egg/plone/app/testing/layers.py", line 27, in <module>
    class PloneFixture(Layer):
  File "/home/jenkins/.buildout/eggs/plone.app.testing-5.0.6-py2.7.egg/plone/app/testing/layers.py", line 81, in PloneFixture
    import Products.PasswordResetTool  # noqa
  File "/home/jenkins/.buildout/eggs/Products.PasswordResetTool-2.2.3-py2.7.egg/Products/PasswordResetTool/__init__.py", line 4, in <module>
    import PasswordResetTool
  File "/home/jenkins/.buildout/eggs/Products.PasswordResetTool-2.2.3-py2.7.egg/Products/PasswordResetTool/PasswordResetTool.py", line 24, in <module>
    from Products.CMFPlone.interfaces import ISecuritySchema
  File "/home/jenkins/workspace/plone-5.0-python-2.7-at/src/Products.CMFPlone/Products/CMFPlone/__init__.py", line 228, in <module>
    from Products.CMFPlone import earlypatches  # noqa
  File "/home/jenkins/workspace/plone-5.0-python-2.7-at/src/Products.CMFPlone/Products/CMFPlone/earlypatches/__init__.py", line 2, in <module>
    import security  # noqa
  File "/home/jenkins/workspace/plone-5.0-python-2.7-at/src/Products.CMFPlone/Products/CMFPlone/earlypatches/security.py", line 86, in <module>
    exec code in utils.getToolByName.func_globals
  File "<string>", line 5, in <module>
  File "/home/jenkins/workspace/plone-5.0-python-2.7-at/src/Products.ATContentTypes/Products/ATContentTypes/__init__.py", line 33, in <module>
    import Products.ATContentTypes.content  # noqa
  File "/home/jenkins/workspace/plone-5.0-python-2.7-at/src/Products.ATContentTypes/Products/ATContentTypes/content/__init__.py", line 2, in <module>
    import Products.ATContentTypes.content.link  # noqa
  File "/home/jenkins/workspace/plone-5.0-python-2.7-at/src/Products.ATContentTypes/Products/ATContentTypes/content/link.py", line 3, in <module>
    from Products.Archetypes.atapi import Schema
  File "/home/jenkins/workspace/plone-5.0-python-2.7-at/src/Products.Archetypes/Products/Archetypes/atapi.py", line 32, in <module>
    from Products.Archetypes.BaseObject import BaseObject
  File "/home/jenkins/workspace/plone-5.0-python-2.7-at/src/Products.Archetypes/Products/Archetypes/BaseObject.py", line 114, in <module>
    class BaseObject(Referenceable):
  File "/home/jenkins/workspace/plone-5.0-python-2.7-at/src/Products.Archetypes/Products/Archetypes/BaseObject.py", line 133, in BaseObject
    implements(IBaseObject, IReferenceable)


FAILED:  Products.contentmigration.tests.testATFieldMigration.Startup

Error Message:
name 'implements' is not defined

Stack Trace:
name 'implements' is not defined

  File "/home/jenkins/.buildout/eggs/Products.contentmigration-2.1.16-py2.7.egg/Products/contentmigration/tests/testATFieldMigration.py", line 1, in <module>
    from Products.contentmigration.tests.cmtc import ContentMigratorTestCase
  File "/home/jenkins/.buildout/eggs/Products.contentmigration-2.1.16-py2.7.egg/Products/contentmigration/tests/cmtc.py", line 3, in <module>
    from Products.contentmigration.tests.layer import TestLayer
  File "/home/jenkins/.buildout/eggs/Products.contentmigration-2.1.16-py2.7.egg/Products/contentmigration/tests/layer.py", line 1, in <module>
    from plone.app.testing import bbb
  File "/home/jenkins/.buildout/eggs/plone.app.testing-5.0.6-py2.7.egg/plone/app/testing/__init__.py", line 4, in <module>
    from plone.app.testing.helpers import applyProfile
  File "/home/jenkins/.buildout/eggs/plone.app.testing-5.0.6-py2.7.egg/plone/app/testing/helpers.py", line 5, in <module>
    from plone.app.testing import layers
  File "/home/jenkins/.buildout/eggs/plone.app.testing-5.0.6-py2.7.egg/plone/app/testing/layers.py", line 27, in <module>
    class PloneFixture(Layer):
  File "/home/jenkins/.buildout/eggs/plone.app.testing-5.0.6-py2.7.egg/plone/app/testing/layers.py", line 81, in PloneFixture
    import Products.PasswordResetTool  # noqa
  File "/home/jenkins/.buildout/eggs/Products.PasswordResetTool-2.2.3-py2.7.egg/Products/PasswordResetTool/__init__.py", line 4, in <module>
    import PasswordResetTool
  File "/home/jenkins/.buildout/eggs/Products.PasswordResetTool-2.2.3-py2.7.egg/Products/PasswordResetTool/PasswordResetTool.py", line 24, in <module>
    from Products.CMFPlone.interfaces import ISecuritySchema
  File "/home/jenkins/workspace/plone-5.0-python-2.7-at/src/Products.CMFPlone/Products/CMFPlone/__init__.py", line 228, in <module>
    from Products.CMFPlone import earlypatches  # noqa
  File "/home/jenkins/workspace/plone-5.0-python-2.7-at/src/Products.CMFPlone/Products/CMFPlone/earlypatches/__init__.py", line 2, in <module>
    import security  # noqa
  File "/home/jenkins/workspace/plone-5.0-python-2.7-at/src/Products.CMFPlone/Products/CMFPlone/earlypatches/security.py", line 86, in <module>
    exec code in utils.getToolByName.func_globals
  File "<string>", line 5, in <module>
  File "/home/jenkins/workspace/plone-5.0-python-2.7-at/src/Products.ATContentTypes/Products/ATContentTypes/__init__.py", line 33, in <module>
    import Products.ATContentTypes.content  # noqa
  File "/home/jenkins/workspace/plone-5.0-python-2.7-at/src/Products.ATContentTypes/Products/ATContentTypes/content/__init__.py", line 2, in <module>
    import Products.ATContentTypes.content.link  # noqa
  File "/home/jenkins/workspace/plone-5.0-python-2.7-at/src/Products.ATContentTypes/Products/ATContentTypes/content/link.py", line 3, in <module>
    from Products.Archetypes.atapi import Schema
  File "/home/jenkins/workspace/plone-5.0-python-2.7-at/src/Products.Archetypes/Products/Archetypes/atapi.py", line 32, in <module>
    from Products.Archetypes.BaseObject import BaseObject
  File "/home/jenkins/workspace/plone-5.0-python-2.7-at/src/Products.Archetypes/Products/Archetypes/BaseObject.py", line 114, in <module>
    class BaseObject(Referenceable):
  File "/home/jenkins/workspace/plone-5.0-python-2.7-at/src/Products.Archetypes/Products/Archetypes/BaseObject.py", line 133, in BaseObject
    implements(IBaseObject, IReferenceable)


FAILED:  Products.contentmigration.tests.test_doctests.Startup

Error Message:
name 'implements' is not defined

Stack Trace:
name 'implements' is not defined

  File "/home/jenkins/.buildout/eggs/Products.contentmigration-2.1.16-py2.7.egg/Products/contentmigration/tests/test_doctests.py", line 11, in <module>
    from Products.contentmigration.tests.layer import TestLayer
  File "/home/jenkins/.buildout/eggs/Products.contentmigration-2.1.16-py2.7.egg/Products/contentmigration/tests/layer.py", line 1, in <module>
    from plone.app.testing import bbb
  File "/home/jenkins/.buildout/eggs/plone.app.testing-5.0.6-py2.7.egg/plone/app/testing/__init__.py", line 4, in <module>
    from plone.app.testing.helpers import applyProfile
  File "/home/jenkins/.buildout/eggs/plone.app.testing-5.0.6-py2.7.egg/plone/app/testing/helpers.py", line 5, in <module>
    from plone.app.testing import layers
  File "/home/jenkins/.buildout/eggs/plone.app.testing-5.0.6-py2.7.egg/plone/app/testing/layers.py", line 27, in <module>
    class PloneFixture(Layer):
  File "/home/jenkins/.buildout/eggs/plone.app.testing-5.0.6-py2.7.egg/plone/app/testing/layers.py", line 81, in PloneFixture
    import Products.PasswordResetTool  # noqa
  File "/home/jenkins/.buildout/eggs/Products.PasswordResetTool-2.2.3-py2.7.egg/Products/PasswordResetTool/__init__.py", line 4, in <module>
    import PasswordResetTool
  File "/home/jenkins/.buildout/eggs/Products.PasswordResetTool-2.2.3-py2.7.egg/Products/PasswordResetTool/PasswordResetTool.py", line 24, in <module>
    from Products.CMFPlone.interfaces import ISecuritySchema
  File "/home/jenkins/workspace/plone-5.0-python-2.7-at/src/Products.CMFPlone/Products/CMFPlone/__init__.py", line 228, in <module>
    from Products.CMFPlone import earlypatches  # noqa
  File "/home/jenkins/workspace/plone-5.0-python-2.7-at/src/Products.CMFPlone/Products/CMFPlone/earlypatches/__init__.py", line 2, in <module>
    import security  # noqa
  File "/home/jenkins/workspace/plone-5.0-python-2.7-at/src/Products.CMFPlone/Products/CMFPlone/earlypatches/security.py", line 86, in <module>
    exec code in utils.getToolByName.func_globals
  File "<string>", line 5, in <module>
  File "/home/jenkins/workspace/plone-5.0-python-2.7-at/src/Products.ATContentTypes/Products/ATContentTypes/__init__.py", line 33, in <module>
    import Products.ATContentTypes.content  # noqa
  File "/home/jenkins/workspace/plone-5.0-python-2.7-at/src/Products.ATContentTypes/Products/ATContentTypes/content/__init__.py", line 2, in <module>
    import Products.ATContentTypes.content.link  # noqa
  File "/home/jenkins/workspace/plone-5.0-python-2.7-at/src/Products.ATContentTypes/Products/ATContentTypes/content/link.py", line 3, in <module>
    from Products.Archetypes.atapi import Schema
  File "/home/jenkins/workspace/plone-5.0-python-2.7-at/src/Products.Archetypes/Products/Archetypes/atapi.py", line 32, in <module>
    from Products.Archetypes.BaseObject import BaseObject
  File "/home/jenkins/workspace/plone-5.0-python-2.7-at/src/Products.Archetypes/Products/Archetypes/BaseObject.py", line 114, in <module>
    class BaseObject(Referenceable):
  File "/home/jenkins/workspace/plone-5.0-python-2.7-at/src/Products.Archetypes/Products/Archetypes/BaseObject.py", line 133, in BaseObject
    implements(IBaseObject, IReferenceable)


FAILED:  Products.statusmessages.tests.test_adapter.Startup

Error Message:
name 'implements' is not defined

Stack Trace:
name 'implements' is not defined

  File "/home/jenkins/.buildout/eggs/Products.statusmessages-4.1.2-py2.7.egg/Products/statusmessages/tests/test_adapter.py", line 6, in <module>
    from plone.app.testing import PLONE_INTEGRATION_TESTING
  File "/home/jenkins/.buildout/eggs/plone.app.testing-5.0.6-py2.7.egg/plone/app/testing/__init__.py", line 4, in <module>
    from plone.app.testing.helpers import applyProfile
  File "/home/jenkins/.buildout/eggs/plone.app.testing-5.0.6-py2.7.egg/plone/app/testing/helpers.py", line 5, in <module>
    from plone.app.testing import layers
  File "/home/jenkins/.buildout/eggs/plone.app.testing-5.0.6-py2.7.egg/plone/app/testing/layers.py", line 27, in <module>
    class PloneFixture(Layer):
  File "/home/jenkins/.buildout/eggs/plone.app.testing-5.0.6-py2.7.egg/plone/app/testing/layers.py", line 81, in PloneFixture
    import Products.PasswordResetTool  # noqa
  File "/home/jenkins/.buildout/eggs/Products.PasswordResetTool-2.2.3-py2.7.egg/Products/PasswordResetTool/__init__.py", line 4, in <module>
    import PasswordResetTool
  File "/home/jenkins/.buildout/eggs/Products.PasswordResetTool-2.2.3-py2.7.egg/Products/PasswordResetTool/PasswordResetTool.py", line 24, in <module>
    from Products.CMFPlone.interfaces import ISecuritySchema
  File "/home/jenkins/workspace/plone-5.0-python-2.7-at/src/Products.CMFPlone/Products/CMFPlone/__init__.py", line 228, in <module>
    from Products.CMFPlone import earlypatches  # noqa
  File "/home/jenkins/workspace/plone-5.0-python-2.7-at/src/Products.CMFPlone/Products/CMFPlone/earlypatches/__init__.py", line 2, in <module>
    import security  # noqa
  File "/home/jenkins/workspace/plone-5.0-python-2.7-at/src/Products.CMFPlone/Products/CMFPlone/earlypatches/security.py", line 86, in <module>
    exec code in utils.getToolByName.func_globals
  File "<string>", line 5, in <module>
  File "/home/jenkins/workspace/plone-5.0-python-2.7-at/src/Products.ATContentTypes/Products/ATContentTypes/__init__.py", line 33, in <module>
    import Products.ATContentTypes.content  # noqa
  File "/home/jenkins/workspace/plone-5.0-python-2.7-at/src/Products.ATContentTypes/Products/ATContentTypes/content/__init__.py", line 2, in <module>
    import Products.ATContentTypes.content.link  # noqa
  File "/home/jenkins/workspace/plone-5.0-python-2.7-at/src/Products.ATContentTypes/Products/ATContentTypes/content/link.py", line 3, in <module>
    from Products.Archetypes.atapi import Schema
  File "/home/jenkins/workspace/plone-5.0-python-2.7-at/src/Products.Archetypes/Products/Archetypes/atapi.py", line 32, in <module>
    from Products.Archetypes.BaseObject import BaseObject
  File "/home/jenkins/workspace/plone-5.0-python-2.7-at/src/Products.Archetypes/Products/Archetypes/BaseObject.py", line 114, in <module>
    class BaseObject(Referenceable):
  File "/home/jenkins/workspace/plone-5.0-python-2.7-at/src/Products.Archetypes/Products/Archetypes/BaseObject.py", line 133, in BaseObject
    implements(IBaseObject, IReferenceable)


FAILED:  Products.statusmessages.tests.test_encoding.Startup

Error Message:
name 'implements' is not defined

Stack Trace:
name 'implements' is not defined

  File "/home/jenkins/.buildout/eggs/Products.statusmessages-4.1.2-py2.7.egg/Products/statusmessages/tests/test_encoding.py", line 6, in <module>
    from plone.app.testing import PLONE_INTEGRATION_TESTING
  File "/home/jenkins/.buildout/eggs/plone.app.testing-5.0.6-py2.7.egg/plone/app/testing/__init__.py", line 4, in <module>
    from plone.app.testing.helpers import applyProfile
  File "/home/jenkins/.buildout/eggs/plone.app.testing-5.0.6-py2.7.egg/plone/app/testing/helpers.py", line 5, in <module>
    from plone.app.testing import layers
  File "/home/jenkins/.buildout/eggs/plone.app.testing-5.0.6-py2.7.egg/plone/app/testing/layers.py", line 27, in <module>
    class PloneFixture(Layer):
  File "/home/jenkins/.buildout/eggs/plone.app.testing-5.0.6-py2.7.egg/plone/app/testing/layers.py", line 81, in PloneFixture
    import Products.PasswordResetTool  # noqa
  File "/home/jenkins/.buildout/eggs/Products.PasswordResetTool-2.2.3-py2.7.egg/Products/PasswordResetTool/__init__.py", line 4, in <module>
    import PasswordResetTool
  File "/home/jenkins/.buildout/eggs/Products.PasswordResetTool-2.2.3-py2.7.egg/Products/PasswordResetTool/PasswordResetTool.py", line 24, in <module>
    from Products.CMFPlone.interfaces import ISecuritySchema
  File "/home/jenkins/workspace/plone-5.0-python-2.7-at/src/Products.CMFPlone/Products/CMFPlone/__init__.py", line 228, in <module>
    from Products.CMFPlone import earlypatches  # noqa
  File "/home/jenkins/workspace/plone-5.0-python-2.7-at/src/Products.CMFPlone/Products/CMFPlone/earlypatches/__init__.py", line 2, in <module>
    import security  # noqa
  File "/home/jenkins/workspace/plone-5.0-python-2.7-at/src/Products.CMFPlone/Products/CMFPlone/earlypatches/security.py", line 86, in <module>
    exec code in utils.getToolByName.func_globals
  File "<string>", line 5, in <module>
  File "/home/jenkins/workspace/plone-5.0-python-2.7-at/src/Products.ATContentTypes/Products/ATContentTypes/__init__.py", line 33, in <module>
    import Products.ATContentTypes.content  # noqa
  File "/home/jenkins/workspace/plone-5.0-python-2.7-at/src/Products.ATContentTypes/Products/ATContentTypes/content/__init__.py", line 2, in <module>
    import Products.ATContentTypes.content.link  # noqa
  File "/home/jenkins/workspace/plone-5.0-python-2.7-at/src/Products.ATContentTypes/Products/ATContentTypes/content/link.py", line 3, in <module>
    from Products.Archetypes.atapi import Schema
  File "/home/jenkins/workspace/plone-5.0-python-2.7-at/src/Products.Archetypes/Products/Archetypes/atapi.py", line 32, in <module>
    from Products.Archetypes.BaseObject import BaseObject
  File "/home/jenkins/workspace/plone-5.0-python-2.7-at/src/Products.Archetypes/Products/Archetypes/BaseObject.py", line 114, in <module>
    class BaseObject(Referenceable):
  File "/home/jenkins/workspace/plone-5.0-python-2.7-at/src/Products.Archetypes/Products/Archetypes/BaseObject.py", line 133, in BaseObject
    implements(IBaseObject, IReferenceable)


FAILED:  Products.validation.tests.test_validation.Startup

Error Message:
name 'implements' is not defined

Stack Trace:
name 'implements' is not defined

  File "/home/jenkins/.buildout/eggs/Products.validation-2.0.2-py2.7.egg/Products/validation/tests/test_validation.py", line 3, in <module>
    from Products.Archetypes.tests.atsitetestcase import ATSiteTestCase
  File "/home/jenkins/workspace/plone-5.0-python-2.7-at/src/Products.Archetypes/Products/Archetypes/tests/atsitetestcase.py", line 1, in <module>
    from Products.Archetypes.tests.attestcase import ATTestCase as ATSiteTestCase
  File "/home/jenkins/workspace/plone-5.0-python-2.7-at/src/Products.Archetypes/Products/Archetypes/tests/attestcase.py", line 1, in <module>
    from plone.app.testing import bbb
  File "/home/jenkins/.buildout/eggs/plone.app.testing-5.0.6-py2.7.egg/plone/app/testing/__init__.py", line 4, in <module>
    from plone.app.testing.helpers import applyProfile
  File "/home/jenkins/.buildout/eggs/plone.app.testing-5.0.6-py2.7.egg/plone/app/testing/helpers.py", line 5, in <module>
    from plone.app.testing import layers
  File "/home/jenkins/.buildout/eggs/plone.app.testing-5.0.6-py2.7.egg/plone/app/testing/layers.py", line 27, in <module>
    class PloneFixture(Layer):
  File "/home/jenkins/.buildout/eggs/plone.app.testing-5.0.6-py2.7.egg/plone/app/testing/layers.py", line 81, in PloneFixture
    import Products.PasswordResetTool  # noqa
  File "/home/jenkins/.buildout/eggs/Products.PasswordResetTool-2.2.3-py2.7.egg/Products/PasswordResetTool/__init__.py", line 4, in <module>
    import PasswordResetTool
  File "/home/jenkins/.buildout/eggs/Products.PasswordResetTool-2.2.3-py2.7.egg/Products/PasswordResetTool/PasswordResetTool.py", line 24, in <module>
    from Products.CMFPlone.interfaces import ISecuritySchema
  File "/home/jenkins/workspace/plone-5.0-python-2.7-at/src/Products.CMFPlone/Products/CMFPlone/__init__.py", line 228, in <module>
    from Products.CMFPlone import earlypatches  # noqa
  File "/home/jenkins/workspace/plone-5.0-python-2.7-at/src/Products.CMFPlone/Products/CMFPlone/earlypatches/__init__.py", line 2, in <module>
    import security  # noqa
  File "/home/jenkins/workspace/plone-5.0-python-2.7-at/src/Products.CMFPlone/Products/CMFPlone/earlypatches/security.py", line 86, in <module>
    exec code in utils.getToolByName.func_globals
  File "<string>", line 5, in <module>
  File "/home/jenkins/workspace/plone-5.0-python-2.7-at/src/Products.ATContentTypes/Products/ATContentTypes/__init__.py", line 33, in <module>
    import Products.ATContentTypes.content  # noqa
  File "/home/jenkins/workspace/plone-5.0-python-2.7-at/src/Products.ATContentTypes/Products/ATContentTypes/content/__init__.py", line 2, in <module>
    import Products.ATContentTypes.content.link  # noqa
  File "/home/jenkins/workspace/plone-5.0-python-2.7-at/src/Products.ATContentTypes/Products/ATContentTypes/content/link.py", line 3, in <module>
    from Products.Archetypes.atapi import Schema
  File "/home/jenkins/workspace/plone-5.0-python-2.7-at/src/Products.Archetypes/Products/Archetypes/atapi.py", line 32, in <module>
    from Products.Archetypes.BaseObject import BaseObject
  File "/home/jenkins/workspace/plone-5.0-python-2.7-at/src/Products.Archetypes/Products/Archetypes/BaseObject.py", line 114, in <module>
    class BaseObject(Referenceable):
  File "/home/jenkins/workspace/plone-5.0-python-2.7-at/src/Products.Archetypes/Products/Archetypes/BaseObject.py", line 133, in BaseObject
    implements(IBaseObject, IReferenceable)


FAILED:  archetypes.multilingual.tests.test_doctests.Startup

Error Message:
name 'implements' is not defined

Stack Trace:
name 'implements' is not defined

  File "/home/jenkins/workspace/plone-5.0-python-2.7-at/src/archetypes.multilingual/archetypes/multilingual/tests/test_doctests.py", line 2, in <module>
    from archetypes.multilingual.testing import \
  File "/home/jenkins/workspace/plone-5.0-python-2.7-at/src/archetypes.multilingual/archetypes/multilingual/testing.py", line 4, in <module>
    from plone.app.testing import FunctionalTesting
  File "/home/jenkins/.buildout/eggs/plone.app.testing-5.0.6-py2.7.egg/plone/app/testing/__init__.py", line 4, in <module>
    from plone.app.testing.helpers import applyProfile
  File "/home/jenkins/.buildout/eggs/plone.app.testing-5.0.6-py2.7.egg/plone/app/testing/helpers.py", line 5, in <module>
    from plone.app.testing import layers
  File "/home/jenkins/.buildout/eggs/plone.app.testing-5.0.6-py2.7.egg/plone/app/testing/layers.py", line 27, in <module>
    class PloneFixture(Layer):
  File "/home/jenkins/.buildout/eggs/plone.app.testing-5.0.6-py2.7.egg/plone/app/testing/layers.py", line 81, in PloneFixture
    import Products.PasswordResetTool  # noqa
  File "/home/jenkins/.buildout/eggs/Products.PasswordResetTool-2.2.3-py2.7.egg/Products/PasswordResetTool/__init__.py", line 4, in <module>
    import PasswordResetTool
  File "/home/jenkins/.buildout/eggs/Products.PasswordResetTool-2.2.3-py2.7.egg/Products/PasswordResetTool/PasswordResetTool.py", line 24, in <module>
    from Products.CMFPlone.interfaces import ISecuritySchema
  File "/home/jenkins/workspace/plone-5.0-python-2.7-at/src/Products.CMFPlone/Products/CMFPlone/__init__.py", line 228, in <module>
    from Products.CMFPlone import earlypatches  # noqa
  File "/home/jenkins/workspace/plone-5.0-python-2.7-at/src/Products.CMFPlone/Products/CMFPlone/earlypatches/__init__.py", line 2, in <module>
    import security  # noqa
  File "/home/jenkins/workspace/plone-5.0-python-2.7-at/src/Products.CMFPlone/Products/CMFPlone/earlypatches/security.py", line 86, in <module>
    exec code in utils.getToolByName.func_globals
  File "<string>", line 5, in <module>
  File "/home/jenkins/workspace/plone-5.0-python-2.7-at/src/Products.ATContentTypes/Products/ATContentTypes/__init__.py", line 33, in <module>
    import Products.ATContentTypes.content  # noqa
  File "/home/jenkins/workspace/plone-5.0-python-2.7-at/src/Products.ATContentTypes/Products/ATContentTypes/content/__init__.py", line 2, in <module>
    import Products.ATContentTypes.content.link  # noqa
  File "/home/jenkins/workspace/plone-5.0-python-2.7-at/src/Products.ATContentTypes/Products/ATContentTypes/content/link.py", line 3, in <module>
    from Products.Archetypes.atapi import Schema
  File "/home/jenkins/workspace/plone-5.0-python-2.7-at/src/Products.Archetypes/Products/Archetypes/atapi.py", line 32, in <module>
    from Products.Archetypes.BaseObject import BaseObject
  File "/home/jenkins/workspace/plone-5.0-python-2.7-at/src/Products.Archetypes/Products/Archetypes/BaseObject.py", line 114, in <module>
    class BaseObject(Referenceable):
  File "/home/jenkins/workspace/plone-5.0-python-2.7-at/src/Products.Archetypes/Products/Archetypes/BaseObject.py", line 133, in BaseObject
    implements(IBaseObject, IReferenceable)


FAILED:  archetypes.multilingual.tests.test_language_inheritance.Startup

Error Message:
name 'implements' is not defined

Stack Trace:
name 'implements' is not defined

  File "/home/jenkins/workspace/plone-5.0-python-2.7-at/src/archetypes.multilingual/archetypes/multilingual/tests/test_language_inheritance.py", line 3, in <module>
    from Products.CMFPlone.utils import _createObjectByType
  File "/home/jenkins/workspace/plone-5.0-python-2.7-at/src/Products.CMFPlone/Products/CMFPlone/__init__.py", line 228, in <module>
    from Products.CMFPlone import earlypatches  # noqa
  File "/home/jenkins/workspace/plone-5.0-python-2.7-at/src/Products.CMFPlone/Products/CMFPlone/earlypatches/__init__.py", line 2, in <module>
    import security  # noqa
  File "/home/jenkins/workspace/plone-5.0-python-2.7-at/src/Products.CMFPlone/Products/CMFPlone/earlypatches/security.py", line 86, in <module>
    exec code in utils.getToolByName.func_globals
  File "<string>", line 5, in <module>
  File "/home/jenkins/workspace/plone-5.0-python-2.7-at/src/Products.ATContentTypes/Products/ATContentTypes/__init__.py", line 33, in <module>
    import Products.ATContentTypes.content  # noqa
  File "/home/jenkins/workspace/plone-5.0-python-2.7-at/src/Products.ATContentTypes/Products/ATContentTypes/content/__init__.py", line 2, in <module>
    import Products.ATContentTypes.content.link  # noqa
  File "/home/jenkins/workspace/plone-5.0-python-2.7-at/src/Products.ATContentTypes/Products/ATContentTypes/content/link.py", line 3, in <module>
    from Products.Archetypes.atapi import Schema
  File "/home/jenkins/workspace/plone-5.0-python-2.7-at/src/Products.Archetypes/Products/Archetypes/atapi.py", line 32, in <module>
    from Products.Archetypes.BaseObject import BaseObject
  File "/home/jenkins/workspace/plone-5.0-python-2.7-at/src/Products.Archetypes/Products/Archetypes/BaseObject.py", line 114, in <module>
    class BaseObject(Referenceable):
  File "/home/jenkins/workspace/plone-5.0-python-2.7-at/src/Products.Archetypes/Products/Archetypes/BaseObject.py", line 133, in BaseObject
    implements(IBaseObject, IReferenceable)


FAILED:  archetypes.multilingual.tests.test_monkey.Startup

Error Message:
name 'implements' is not defined

Stack Trace:
name 'implements' is not defined

  File "/home/jenkins/workspace/plone-5.0-python-2.7-at/src/archetypes.multilingual/archetypes/multilingual/tests/test_monkey.py", line 3, in <module>
    from archetypes.multilingual.testing import \
  File "/home/jenkins/workspace/plone-5.0-python-2.7-at/src/archetypes.multilingual/archetypes/multilingual/testing.py", line 4, in <module>
    from plone.app.testing import FunctionalTesting
  File "/home/jenkins/.buildout/eggs/plone.app.testing-5.0.6-py2.7.egg/plone/app/testing/__init__.py", line 4, in <module>
    from plone.app.testing.helpers import applyProfile
  File "/home/jenkins/.buildout/eggs/plone.app.testing-5.0.6-py2.7.egg/plone/app/testing/helpers.py", line 5, in <module>
    from plone.app.testing import layers
  File "/home/jenkins/.buildout/eggs/plone.app.testing-5.0.6-py2.7.egg/plone/app/testing/layers.py", line 27, in <module>
    class PloneFixture(Layer):
  File "/home/jenkins/.buildout/eggs/plone.app.testing-5.0.6-py2.7.egg/plone/app/testing/layers.py", line 81, in PloneFixture
    import Products.PasswordResetTool  # noqa
  File "/home/jenkins/.buildout/eggs/Products.PasswordResetTool-2.2.3-py2.7.egg/Products/PasswordResetTool/__init__.py", line 4, in <module>
    import PasswordResetTool
  File "/home/jenkins/.buildout/eggs/Products.PasswordResetTool-2.2.3-py2.7.egg/Products/PasswordResetTool/PasswordResetTool.py", line 24, in <module>
    from Products.CMFPlone.interfaces import ISecuritySchema
  File "/home/jenkins/workspace/plone-5.0-python-2.7-at/src/Products.CMFPlone/Products/CMFPlone/__init__.py", line 228, in <module>
    from Products.CMFPlone import earlypatches  # noqa
  File "/home/jenkins/workspace/plone-5.0-python-2.7-at/src/Products.CMFPlone/Products/CMFPlone/earlypatches/__init__.py", line 2, in <module>
    import security  # noqa
  File "/home/jenkins/workspace/plone-5.0-python-2.7-at/src/Products.CMFPlone/Products/CMFPlone/earlypatches/security.py", line 86, in <module>
    exec code in utils.getToolByName.func_globals
  File "<string>", line 5, in <module>
  File "/home/jenkins/workspace/plone-5.0-python-2.7-at/src/Products.ATContentTypes/Products/ATContentTypes/__init__.py", line 33, in <module>
    import Products.ATContentTypes.content  # noqa
  File "/home/jenkins/workspace/plone-5.0-python-2.7-at/src/Products.ATContentTypes/Products/ATContentTypes/content/__init__.py", line 2, in <module>
    import Products.ATContentTypes.content.link  # noqa
  File "/home/jenkins/workspace/plone-5.0-python-2.7-at/src/Products.ATContentTypes/Products/ATContentTypes/content/link.py", line 3, in <module>
    from Products.Archetypes.atapi import Schema
  File "/home/jenkins/workspace/plone-5.0-python-2.7-at/src/Products.Archetypes/Products/Archetypes/atapi.py", line 32, in <module>
    from Products.Archetypes.BaseObject import BaseObject
  File "/home/jenkins/workspace/plone-5.0-python-2.7-at/src/Products.Archetypes/Products/Archetypes/BaseObject.py", line 114, in <module>
    class BaseObject(Referenceable):
  File "/home/jenkins/workspace/plone-5.0-python-2.7-at/src/Products.Archetypes/Products/Archetypes/BaseObject.py", line 133, in BaseObject
    implements(IBaseObject, IReferenceable)


FAILED:  archetypes.schemaextender.extender.set_schema_order

Error Message:
Failed doctest test for archetypes.schemaextender.extender.set_schema_order

Stack Trace:
Failed doctest test for archetypes.schemaextender.extender.set_schema_order
  File "/home/jenkins/.buildout/eggs/archetypes.schemaextender-2.1.7-py2.7.egg/archetypes/schemaextender/extender.py", line 70, in set_schema_order

----------------------------------------------------------------------
File "/home/jenkins/.buildout/eggs/archetypes.schemaextender-2.1.7-py2.7.egg/archetypes/schemaextender/extender.py", line 72, in archetypes.schemaextender.extender.set_schema_order
Failed example:
    from Products.Archetypes import atapi
Exception raised:
    Traceback (most recent call last):
      File "/usr/lib/python2.7/doctest.py", line 1315, in __run
        compileflags, 1) in test.globs
      File "<doctest archetypes.schemaextender.extender.set_schema_order[0]>", line 1, in <module>
        from Products.Archetypes import atapi
      File "/home/jenkins/workspace/plone-5.0-python-2.7-at/src/Products.Archetypes/Products/Archetypes/atapi.py", line 32, in <module>
        from Products.Archetypes.BaseObject import BaseObject
      File "/home/jenkins/workspace/plone-5.0-python-2.7-at/src/Products.Archetypes/Products/Archetypes/BaseObject.py", line 114, in <module>
        class BaseObject(Referenceable):
      File "/home/jenkins/workspace/plone-5.0-python-2.7-at/src/Products.Archetypes/Products/Archetypes/BaseObject.py", line 133, in BaseObject
        implements(IBaseObject, IReferenceable)
    NameError: name 'implements' is not defined
----------------------------------------------------------------------
File "/home/jenkins/.buildout/eggs/archetypes.schemaextender-2.1.7-py2.7.egg/archetypes/schemaextender/extender.py", line 73, in archetypes.schemaextender.extender.set_schema_order
Failed example:
    schema = atapi.Schema()
Exception raised:
    Traceback (most recent call last):
      File "/usr/lib/python2.7/doctest.py", line 1315, in __run
        compileflags, 1) in test.globs
      File "<doctest archetypes.schemaextender.extender.set_schema_order[1]>", line 1, in <module>
        schema = atapi.Schema()
    NameError: name 'atapi' is not defined
----------------------------------------------------------------------
File "/home/jenkins/.buildout/eggs/archetypes.schemaextender-2.1.7-py2.7.egg/archetypes/schemaextender/extender.py", line 75, in archetypes.schemaextender.extender.set_schema_order
Failed example:
    schema.addField(atapi.BooleanField('boolean1'))
Exception raised:
    Traceback (most recent call last):
      File "/usr/lib/python2.7/doctest.py", line 1315, in __run
        compileflags, 1) in test.globs
      File "<doctest archetypes.schemaextender.extender.set_schema_order[3]>", line 1, in <module>
        schema.addField(atapi.BooleanField('boolean1'))
    NameError: name 'schema' is not defined
----------------------------------------------------------------------
File "/home/jenkins/.buildout/eggs/archetypes.schemaextender-2.1.7-py2.7.egg/archetypes/schemaextender/extender.py", line 76, in archetypes.schemaextender.extender.set_schema_order
Failed example:
    schema.addField(atapi.BooleanField('boolean2'))
Exception raised:
    Traceback (most recent call last):
      File "/usr/lib/python2.7/doctest.py", line 1315, in __run
        compileflags, 1) in test.globs
      File "<doctest archetypes.schemaextender.extender.set_schema_order[4]>", line 1, in <module>
        schema.addField(atapi.BooleanField('boolean2'))
    NameError: name 'schema' is not defined
----------------------------------------------------------------------
File "/home/jenkins/.buildout/eggs/archetypes.schemaextender-2.1.7-py2.7.egg/archetypes/schemaextender/extender.py", line 77, in archetypes.schemaextender.extender.set_schema_order
Failed example:
    sorted(extender.get_schema_order(schema).items())
Exception raised:
    Traceback (most recent call last):
      File "/usr/lib/python2.7/doctest.py", line 1315, in __run
        compileflags, 1) in test.globs
      File "<doctest archetypes.schemaextender.extender.set_schema_order[5]>", line 1, in <module>
        sorted(extender.get_schema_order(schema).items())
    NameError: name 'schema' is not defined
----------------------------------------------------------------------
File "/home/jenkins/.buildout/eggs/archetypes.schemaextender-2.1.7-py2.7.egg/archetypes/schemaextender/extender.py", line 80, in archetypes.schemaextender.extender.set_schema_order
Failed example:
    extender.set_schema_order(schema, {'default': ['boolean1'],
                                       'foo': ['boolean2']})
Exception raised:
    Traceback (most recent call last):
      File "/usr/lib/python2.7/doctest.py", line 1315, in __run
        compileflags, 1) in test.globs
      File "<doctest archetypes.schemaextender.extender.set_schema_order[6]>", line 1, in <module>
        extender.set_schema_order(schema, {'default': ['boolean1'],
    NameError: name 'schema' is not defined
----------------------------------------------------------------------
File "/home/jenkins/.buildout/eggs/archetypes.schemaextender-2.1.7-py2.7.egg/archetypes/schemaextender/extender.py", line 82, in archetypes.schemaextender.extender.set_schema_order
Failed example:
    sorted(extender.get_schema_order(schema).items())
Exception raised:
    Traceback (most recent call last):
      File "/usr/lib/python2.7/doctest.py", line 1315, in __run
        compileflags, 1) in test.globs
      File "<doctest archetypes.schemaextender.extender.set_schema_order[7]>", line 1, in <module>
        sorted(extender.get_schema_order(schema).items())
    NameError: name 'schema' is not defined
----------------------------------------------------------------------
File "/home/jenkins/.buildout/eggs/archetypes.schemaextender-2.1.7-py2.7.egg/archetypes/schemaextender/extender.py", line 85, in archetypes.schemaextender.extender.set_schema_order
Failed example:
    extender.set_schema_order(schema, {'foo': ['boolean1', 'boolean2']})
Exception raised:
    Traceback (most recent call last):
      File "/usr/lib/python2.7/doctest.py", line 1315, in __run
        compileflags, 1) in test.globs
      File "<doctest archetypes.schemaextender.extender.set_schema_order[8]>", line 1, in <module>
        extender.set_schema_order(schema, {'foo': ['boolean1', 'boolean2']})
    NameError: name 'schema' is not defined
----------------------------------------------------------------------
File "/home/jenkins/.buildout/eggs/archetypes.schemaextender-2.1.7-py2.7.egg/archetypes/schemaextender/extender.py", line 86, in archetypes.schemaextender.extender.set_schema_order
Failed example:
    sorted(extender.get_schema_order(schema).items())
Exception raised:
    Traceback (most recent call last):
      File "/usr/lib/python2.7/doctest.py", line 1315, in __run
        compileflags, 1) in test.globs
      File "<doctest archetypes.schemaextender.extender.set_schema_order[9]>", line 1, in <module>
        sorted(extender.get_schema_order(schema).items())
    NameError: name 'schema' is not defined
----------------------------------------------------------------------
File "/home/jenkins/.buildout/eggs/archetypes.schemaextender-2.1.7-py2.7.egg/archetypes/schemaextender/extender.py", line 89, in archetypes.schemaextender.extender.set_schema_order
Failed example:
    extender.set_schema_order(schema, {'foo': ['boolean2', 'boolean1']})
Exception raised:
    Traceback (most recent call last):
      File "/usr/lib/python2.7/doctest.py", line 1315, in __run
        compileflags, 1) in test.globs
      File "<doctest archetypes.schemaextender.extender.set_schema_order[10]>", line 1, in <module>
        extender.set_schema_order(schema, {'foo': ['boolean2', 'boolean1']})
    NameError: name 'schema' is not defined
----------------------------------------------------------------------
File "/home/jenkins/.buildout/eggs/archetypes.schemaextender-2.1.7-py2.7.egg/archetypes/schemaextender/extender.py", line 90, in archetypes.schemaextender.extender.set_schema_order
Failed example:
    sorted(extender.get_schema_order(schema).items())
Exception raised:
    Traceback (most recent call last):
      File "/usr/lib/python2.7/doctest.py", line 1315, in __run
        compileflags, 1) in test.globs
      File "<doctest archetypes.schemaextender.extender.set_schema_order[11]>", line 1, in <module>
        sorted(extender.get_schema_order(schema).items())
    NameError: name 'schema' is not defined


  File "/usr/lib/python2.7/unittest/case.py", line 329, in run
    testMethod()
  File "/usr/lib/python2.7/doctest.py", line 2226, in runTest
    raise self.failureException(self.format_failure(new.getvalue()))


FAILED:  archetypes.schemaextender.tests.testAccessor.Startup

Error Message:
name 'implements' is not defined

Stack Trace:
name 'implements' is not defined

  File "/home/jenkins/.buildout/eggs/archetypes.schemaextender-2.1.7-py2.7.egg/archetypes/schemaextender/tests/testAccessor.py", line 3, in <module>
    from Products.Archetypes.atapi import ComputedField, StringField, StringWidget
  File "/home/jenkins/workspace/plone-5.0-python-2.7-at/src/Products.Archetypes/Products/Archetypes/atapi.py", line 32, in <module>
    from Products.Archetypes.BaseObject import BaseObject
  File "/home/jenkins/workspace/plone-5.0-python-2.7-at/src/Products.Archetypes/Products/Archetypes/BaseObject.py", line 114, in <module>
    class BaseObject(Referenceable):
  File "/home/jenkins/workspace/plone-5.0-python-2.7-at/src/Products.Archetypes/Products/Archetypes/BaseObject.py", line 133, in BaseObject
    implements(IBaseObject, IReferenceable)


FAILED:  archetypes.schemaextender.tests.testOrdering.Startup

Error Message:
name 'implements' is not defined

Stack Trace:
name 'implements' is not defined

  File "/home/jenkins/.buildout/eggs/archetypes.schemaextender-2.1.7-py2.7.egg/archetypes/schemaextender/tests/testOrdering.py", line 2, in <module>
    from Products.Archetypes.public import Schema
  File "/home/jenkins/workspace/plone-5.0-python-2.7-at/src/Products.Archetypes/Products/Archetypes/public.py", line 5, in <module>
    from Products.Archetypes.atapi import *
  File "/home/jenkins/workspace/plone-5.0-python-2.7-at/src/Products.Archetypes/Products/Archetypes/atapi.py", line 32, in <module>
    from Products.Archetypes.BaseObject import BaseObject
  File "/home/jenkins/workspace/plone-5.0-python-2.7-at/src/Products.Archetypes/Products/Archetypes/BaseObject.py", line 114, in <module>
    class BaseObject(Referenceable):
  File "/home/jenkins/workspace/plone-5.0-python-2.7-at/src/Products.Archetypes/Products/Archetypes/BaseObject.py", line 133, in BaseObject
    implements(IBaseObject, IReferenceable)


FAILED:  archetypes.schemaextender.tests.testSchemaFactory.Startup

Error Message:
name 'implements' is not defined

Stack Trace:
name 'implements' is not defined

  File "/home/jenkins/.buildout/eggs/archetypes.schemaextender-2.1.7-py2.7.egg/archetypes/schemaextender/tests/testSchemaFactory.py", line 3, in <module>
    from archetypes.schemaextender.tests.base import TestCase
  File "/home/jenkins/.buildout/eggs/archetypes.schemaextender-2.1.7-py2.7.egg/archetypes/schemaextender/tests/base.py", line 8, in <module>
    from Products.Archetypes.public import BaseObject
  File "/home/jenkins/workspace/plone-5.0-python-2.7-at/src/Products.Archetypes/Products/Archetypes/public.py", line 5, in <module>
    from Products.Archetypes.atapi import *
  File "/home/jenkins/workspace/plone-5.0-python-2.7-at/src/Products.Archetypes/Products/Archetypes/atapi.py", line 32, in <module>
    from Products.Archetypes.BaseObject import BaseObject
  File "/home/jenkins/workspace/plone-5.0-python-2.7-at/src/Products.Archetypes/Products/Archetypes/BaseObject.py", line 114, in <module>
    class BaseObject(Referenceable):
  File "/home/jenkins/workspace/plone-5.0-python-2.7-at/src/Products.Archetypes/Products/Archetypes/BaseObject.py", line 133, in BaseObject
    implements(IBaseObject, IReferenceable)


FAILED:  plone.app.blob.tests.test_adapters.Startup

Error Message:
name 'implements' is not defined

Stack Trace:
name 'implements' is not defined

  File "/home/jenkins/workspace/plone-5.0-python-2.7-at/src/plone.app.blob/src/plone/app/blob/tests/test_adapters.py", line 4, in <module>
    from plone.app.blob.interfaces import IBlobbable
  File "/home/jenkins/workspace/plone-5.0-python-2.7-at/src/plone.app.blob/src/plone/app/blob/interfaces.py", line 2, in <module>
    from Products.CMFPlone import PloneMessageFactory as _
  File "/home/jenkins/workspace/plone-5.0-python-2.7-at/src/Products.CMFPlone/Products/CMFPlone/__init__.py", line 228, in <module>
    from Products.CMFPlone import earlypatches  # noqa
  File "/home/jenkins/workspace/plone-5.0-python-2.7-at/src/Products.CMFPlone/Products/CMFPlone/earlypatches/__init__.py", line 2, in <module>
    import security  # noqa
  File "/home/jenkins/workspace/plone-5.0-python-2.7-at/src/Products.CMFPlone/Products/CMFPlone/earlypatches/security.py", line 86, in <module>
    exec code in utils.getToolByName.func_globals
  File "<string>", line 5, in <module>
  File "/home/jenkins/workspace/plone-5.0-python-2.7-at/src/Products.ATContentTypes/Products/ATContentTypes/__init__.py", line 33, in <module>
    import Products.ATContentTypes.content  # noqa
  File "/home/jenkins/workspace/plone-5.0-python-2.7-at/src/Products.ATContentTypes/Products/ATContentTypes/content/__init__.py", line 2, in <module>
    import Products.ATContentTypes.content.link  # noqa
  File "/home/jenkins/workspace/plone-5.0-python-2.7-at/src/Products.ATContentTypes/Products/ATContentTypes/content/link.py", line 3, in <module>
    from Products.Archetypes.atapi import Schema
  File "/home/jenkins/workspace/plone-5.0-python-2.7-at/src/Products.Archetypes/Products/Archetypes/atapi.py", line 32, in <module>
    from Products.Archetypes.BaseObject import BaseObject
  File "/home/jenkins/workspace/plone-5.0-python-2.7-at/src/Products.Archetypes/Products/Archetypes/BaseObject.py", line 114, in <module>
    class BaseObject(Referenceable):
  File "/home/jenkins/workspace/plone-5.0-python-2.7-at/src/Products.Archetypes/Products/Archetypes/BaseObject.py", line 133, in BaseObject
    implements(IBaseObject, IReferenceable)


FAILED:  plone.app.blob.tests.test_base_fields.Startup

Error Message:
name 'implements' is not defined

Stack Trace:
name 'implements' is not defined

  File "/home/jenkins/workspace/plone-5.0-python-2.7-at/src/plone.app.blob/src/plone/app/blob/tests/test_base_fields.py", line 4, in <module>
    from plone.app.blob.field import FileField
  File "/home/jenkins/workspace/plone-5.0-python-2.7-at/src/plone.app.blob/src/plone/app/blob/field.py", line 12, in <module>
    from plone.app.blob.interfaces import IBlobbable
  File "/home/jenkins/workspace/plone-5.0-python-2.7-at/src/plone.app.blob/src/plone/app/blob/interfaces.py", line 2, in <module>
    from Products.CMFPlone import PloneMessageFactory as _
  File "/home/jenkins/workspace/plone-5.0-python-2.7-at/src/Products.CMFPlone/Products/CMFPlone/__init__.py", line 228, in <module>
    from Products.CMFPlone import earlypatches  # noqa
  File "/home/jenkins/workspace/plone-5.0-python-2.7-at/src/Products.CMFPlone/Products/CMFPlone/earlypatches/__init__.py", line 2, in <module>
    import security  # noqa
  File "/home/jenkins/workspace/plone-5.0-python-2.7-at/src/Products.CMFPlone/Products/CMFPlone/earlypatches/security.py", line 86, in <module>
    exec code in utils.getToolByName.func_globals
  File "<string>", line 5, in <module>
  File "/home/jenkins/workspace/plone-5.0-python-2.7-at/src/Products.ATContentTypes/Products/ATContentTypes/__init__.py", line 33, in <module>
    import Products.ATContentTypes.content  # noqa
  File "/home/jenkins/workspace/plone-5.0-python-2.7-at/src/Products.ATContentTypes/Products/ATContentTypes/content/__init__.py", line 2, in <module>
    import Products.ATContentTypes.content.link  # noqa
  File "/home/jenkins/workspace/plone-5.0-python-2.7-at/src/Products.ATContentTypes/Products/ATContentTypes/content/link.py", line 3, in <module>
    from Products.Archetypes.atapi import Schema
  File "/home/jenkins/workspace/plone-5.0-python-2.7-at/src/Products.Archetypes/Products/Archetypes/atapi.py", line 32, in <module>
    from Products.Archetypes.BaseObject import BaseObject
  File "/home/jenkins/workspace/plone-5.0-python-2.7-at/src/Products.Archetypes/Products/Archetypes/BaseObject.py", line 114, in <module>
    class BaseObject(Referenceable):
  File "/home/jenkins/workspace/plone-5.0-python-2.7-at/src/Products.Archetypes/Products/Archetypes/BaseObject.py", line 133, in BaseObject
    implements(IBaseObject, IReferenceable)


FAILED:  plone.app.blob.tests.test_doctests.Startup

Error Message:
name 'implements' is not defined

Stack Trace:
name 'implements' is not defined

  File "/home/jenkins/workspace/plone-5.0-python-2.7-at/src/plone.app.blob/src/plone/app/blob/tests/test_doctests.py", line 2, in <module>
    from plone.app.blob.tests.layer import BlobLayer
  File "/home/jenkins/workspace/plone-5.0-python-2.7-at/src/plone.app.blob/src/plone/app/blob/tests/layer.py", line 2, in <module>
    from plone.app import testing
  File "/home/jenkins/.buildout/eggs/plone.app.testing-5.0.6-py2.7.egg/plone/app/testing/__init__.py", line 4, in <module>
    from plone.app.testing.helpers import applyProfile
  File "/home/jenkins/.buildout/eggs/plone.app.testing-5.0.6-py2.7.egg/plone/app/testing/helpers.py", line 5, in <module>
    from plone.app.testing import layers
  File "/home/jenkins/.buildout/eggs/plone.app.testing-5.0.6-py2.7.egg/plone/app/testing/layers.py", line 27, in <module>
    class PloneFixture(Layer):
  File "/home/jenkins/.buildout/eggs/plone.app.testing-5.0.6-py2.7.egg/plone/app/testing/layers.py", line 81, in PloneFixture
    import Products.PasswordResetTool  # noqa
  File "/home/jenkins/.buildout/eggs/Products.PasswordResetTool-2.2.3-py2.7.egg/Products/PasswordResetTool/__init__.py", line 4, in <module>
    import PasswordResetTool
  File "/home/jenkins/.buildout/eggs/Products.PasswordResetTool-2.2.3-py2.7.egg/Products/PasswordResetTool/PasswordResetTool.py", line 24, in <module>
    from Products.CMFPlone.interfaces import ISecuritySchema
  File "/home/jenkins/workspace/plone-5.0-python-2.7-at/src/Products.CMFPlone/Products/CMFPlone/__init__.py", line 228, in <module>
    from Products.CMFPlone import earlypatches  # noqa
  File "/home/jenkins/workspace/plone-5.0-python-2.7-at/src/Products.CMFPlone/Products/CMFPlone/earlypatches/__init__.py", line 2, in <module>
    import security  # noqa
  File "/home/jenkins/workspace/plone-5.0-python-2.7-at/src/Products.CMFPlone/Products/CMFPlone/earlypatches/security.py", line 86, in <module>
    exec code in utils.getToolByName.func_globals
  File "<string>", line 5, in <module>
  File "/home/jenkins/workspace/plone-5.0-python-2.7-at/src/Products.ATContentTypes/Products/ATContentTypes/__init__.py", line 33, in <module>
    import Products.ATContentTypes.content  # noqa
  File "/home/jenkins/workspace/plone-5.0-python-2.7-at/src/Products.ATContentTypes/Products/ATContentTypes/content/__init__.py", line 2, in <module>
    import Products.ATContentTypes.content.link  # noqa
  File "/home/jenkins/workspace/plone-5.0-python-2.7-at/src/Products.ATContentTypes/Products/ATContentTypes/content/link.py", line 3, in <module>
    from Products.Archetypes.atapi import Schema
  File "/home/jenkins/workspace/plone-5.0-python-2.7-at/src/Products.Archetypes/Products/Archetypes/atapi.py", line 32, in <module>
    from Products.Archetypes.BaseObject import BaseObject
  File "/home/jenkins/workspace/plone-5.0-python-2.7-at/src/Products.Archetypes/Products/Archetypes/BaseObject.py", line 114, in <module>
    class BaseObject(Referenceable):
  File "/home/jenkins/workspace/plone-5.0-python-2.7-at/src/Products.Archetypes/Products/Archetypes/BaseObject.py", line 133, in BaseObject
    implements(IBaseObject, IReferenceable)


FAILED:  plone.app.blob.tests.test_integration.Startup

Error Message:
name 'implements' is not defined

Stack Trace:
name 'implements' is not defined

  File "/home/jenkins/workspace/plone-5.0-python-2.7-at/src/plone.app.blob/src/plone/app/blob/tests/test_integration.py", line 3, in <module>
    from plone.app.blob.tests.base import BlobFunctionalTestCase
  File "/home/jenkins/workspace/plone-5.0-python-2.7-at/src/plone.app.blob/src/plone/app/blob/tests/base.py", line 2, in <module>
    from plone.app.blob.tests.layer import BlobLayer
  File "/home/jenkins/workspace/plone-5.0-python-2.7-at/src/plone.app.blob/src/plone/app/blob/tests/layer.py", line 2, in <module>
    from plone.app import testing
  File "/home/jenkins/.buildout/eggs/plone.app.testing-5.0.6-py2.7.egg/plone/app/testing/__init__.py", line 4, in <module>
    from plone.app.testing.helpers import applyProfile
  File "/home/jenkins/.buildout/eggs/plone.app.testing-5.0.6-py2.7.egg/plone/app/testing/helpers.py", line 5, in <module>
    from plone.app.testing import layers
  File "/home/jenkins/.buildout/eggs/plone.app.testing-5.0.6-py2.7.egg/plone/app/testing/layers.py", line 27, in <module>
    class PloneFixture(Layer):
  File "/home/jenkins/.buildout/eggs/plone.app.testing-5.0.6-py2.7.egg/plone/app/testing/layers.py", line 81, in PloneFixture
    import Products.PasswordResetTool  # noqa
  File "/home/jenkins/.buildout/eggs/Products.PasswordResetTool-2.2.3-py2.7.egg/Products/PasswordResetTool/__init__.py", line 4, in <module>
    import PasswordResetTool
  File "/home/jenkins/.buildout/eggs/Products.PasswordResetTool-2.2.3-py2.7.egg/Products/PasswordResetTool/PasswordResetTool.py", line 24, in <module>
    from Products.CMFPlone.interfaces import ISecuritySchema
  File "/home/jenkins/workspace/plone-5.0-python-2.7-at/src/Products.CMFPlone/Products/CMFPlone/__init__.py", line 228, in <module>
    from Products.CMFPlone import earlypatches  # noqa
  File "/home/jenkins/workspace/plone-5.0-python-2.7-at/src/Products.CMFPlone/Products/CMFPlone/earlypatches/__init__.py", line 2, in <module>
    import security  # noqa
  File "/home/jenkins/workspace/plone-5.0-python-2.7-at/src/Products.CMFPlone/Products/CMFPlone/earlypatches/security.py", line 86, in <module>
    exec code in utils.getToolByName.func_globals
  File "<string>", line 5, in <module>
  File "/home/jenkins/workspace/plone-5.0-python-2.7-at/src/Products.ATContentTypes/Products/ATContentTypes/__init__.py", line 33, in <module>
    import Products.ATContentTypes.content  # noqa
  File "/home/jenkins/workspace/plone-5.0-python-2.7-at/src/Products.ATContentTypes/Products/ATContentTypes/content/__init__.py", line 2, in <module>
    import Products.ATContentTypes.content.link  # noqa
  File "/home/jenkins/workspace/plone-5.0-python-2.7-at/src/Products.ATContentTypes/Products/ATContentTypes/content/link.py", line 3, in <module>
    from Products.Archetypes.atapi import Schema
  File "/home/jenkins/workspace/plone-5.0-python-2.7-at/src/Products.Archetypes/Products/Archetypes/atapi.py", line 32, in <module>
    from Products.Archetypes.BaseObject import BaseObject
  File "/home/jenkins/workspace/plone-5.0-python-2.7-at/src/Products.Archetypes/Products/Archetypes/BaseObject.py", line 114, in <module>
    class BaseObject(Referenceable):
  File "/home/jenkins/workspace/plone-5.0-python-2.7-at/src/Products.Archetypes/Products/Archetypes/BaseObject.py", line 133, in BaseObject
    implements(IBaseObject, IReferenceable)


FAILED:  plone.app.blob.tests.test_linguaplone.Startup

Error Message:
name 'implements' is not defined

Stack Trace:
name 'implements' is not defined

  File "/home/jenkins/workspace/plone-5.0-python-2.7-at/src/plone.app.blob/src/plone/app/blob/tests/test_linguaplone.py", line 3, in <module>
    from plone.app.blob.tests.base import BlobLinguaTestCase
  File "/home/jenkins/workspace/plone-5.0-python-2.7-at/src/plone.app.blob/src/plone/app/blob/tests/base.py", line 2, in <module>
    from plone.app.blob.tests.layer import BlobLayer
  File "/home/jenkins/workspace/plone-5.0-python-2.7-at/src/plone.app.blob/src/plone/app/blob/tests/layer.py", line 2, in <module>
    from plone.app import testing
  File "/home/jenkins/.buildout/eggs/plone.app.testing-5.0.6-py2.7.egg/plone/app/testing/__init__.py", line 4, in <module>
    from plone.app.testing.helpers import applyProfile
  File "/home/jenkins/.buildout/eggs/plone.app.testing-5.0.6-py2.7.egg/plone/app/testing/helpers.py", line 5, in <module>
    from plone.app.testing import layers
  File "/home/jenkins/.buildout/eggs/plone.app.testing-5.0.6-py2.7.egg/plone/app/testing/layers.py", line 27, in <module>
    class PloneFixture(Layer):
  File "/home/jenkins/.buildout/eggs/plone.app.testing-5.0.6-py2.7.egg/plone/app/testing/layers.py", line 81, in PloneFixture
    import Products.PasswordResetTool  # noqa
  File "/home/jenkins/.buildout/eggs/Products.PasswordResetTool-2.2.3-py2.7.egg/Products/PasswordResetTool/__init__.py", line 4, in <module>
    import PasswordResetTool
  File "/home/jenkins/.buildout/eggs/Products.PasswordResetTool-2.2.3-py2.7.egg/Products/PasswordResetTool/PasswordResetTool.py", line 24, in <module>
    from Products.CMFPlone.interfaces import ISecuritySchema
  File "/home/jenkins/workspace/plone-5.0-python-2.7-at/src/Products.CMFPlone/Products/CMFPlone/__init__.py", line 228, in <module>
    from Products.CMFPlone import earlypatches  # noqa
  File "/home/jenkins/workspace/plone-5.0-python-2.7-at/src/Products.CMFPlone/Products/CMFPlone/earlypatches/__init__.py", line 2, in <module>
    import security  # noqa
  File "/home/jenkins/workspace/plone-5.0-python-2.7-at/src/Products.CMFPlone/Products/CMFPlone/earlypatches/security.py", line 86, in <module>
    exec code in utils.getToolByName.func_globals
  File "<string>", line 5, in <module>
  File "/home/jenkins/workspace/plone-5.0-python-2.7-at/src/Products.ATContentTypes/Products/ATContentTypes/__init__.py", line 33, in <module>
    import Products.ATContentTypes.content  # noqa
  File "/home/jenkins/workspace/plone-5.0-python-2.7-at/src/Products.ATContentTypes/Products/ATContentTypes/content/__init__.py", line 2, in <module>
    import Products.ATContentTypes.content.link  # noqa
  File "/home/jenkins/workspace/plone-5.0-python-2.7-at/src/Products.ATContentTypes/Products/ATContentTypes/content/link.py", line 3, in <module>
    from Products.Archetypes.atapi import Schema
  File "/home/jenkins/workspace/plone-5.0-python-2.7-at/src/Products.Archetypes/Products/Archetypes/atapi.py", line 32, in <module>
    from Products.Archetypes.BaseObject import BaseObject
  File "/home/jenkins/workspace/plone-5.0-python-2.7-at/src/Products.Archetypes/Products/Archetypes/BaseObject.py", line 114, in <module>
    class BaseObject(Referenceable):
  File "/home/jenkins/workspace/plone-5.0-python-2.7-at/src/Products.Archetypes/Products/Archetypes/BaseObject.py", line 133, in BaseObject
    implements(IBaseObject, IReferenceable)


FAILED:  plone.app.blob.tests.test_maintenance.Startup

Error Message:
name 'implements' is not defined

Stack Trace:
name 'implements' is not defined

  File "/home/jenkins/workspace/plone-5.0-python-2.7-at/src/plone.app.blob/src/plone/app/blob/tests/test_maintenance.py", line 2, in <module>
    from plone.app.blob.markings import unmarkAs
  File "/home/jenkins/workspace/plone-5.0-python-2.7-at/src/plone.app.blob/src/plone/app/blob/markings.py", line 5, in <module>
    from plone.app.blob.interfaces import IATBlobBlob
  File "/home/jenkins/workspace/plone-5.0-python-2.7-at/src/plone.app.blob/src/plone/app/blob/interfaces.py", line 2, in <module>
    from Products.CMFPlone import PloneMessageFactory as _
  File "/home/jenkins/workspace/plone-5.0-python-2.7-at/src/Products.CMFPlone/Products/CMFPlone/__init__.py", line 228, in <module>
    from Products.CMFPlone import earlypatches  # noqa
  File "/home/jenkins/workspace/plone-5.0-python-2.7-at/src/Products.CMFPlone/Products/CMFPlone/earlypatches/__init__.py", line 2, in <module>
    import security  # noqa
  File "/home/jenkins/workspace/plone-5.0-python-2.7-at/src/Products.CMFPlone/Products/CMFPlone/earlypatches/security.py", line 86, in <module>
    exec code in utils.getToolByName.func_globals
  File "<string>", line 5, in <module>
  File "/home/jenkins/workspace/plone-5.0-python-2.7-at/src/Products.ATContentTypes/Products/ATContentTypes/__init__.py", line 33, in <module>
    import Products.ATContentTypes.content  # noqa
  File "/home/jenkins/workspace/plone-5.0-python-2.7-at/src/Products.ATContentTypes/Products/ATContentTypes/content/__init__.py", line 2, in <module>
    import Products.ATContentTypes.content.link  # noqa
  File "/home/jenkins/workspace/plone-5.0-python-2.7-at/src/Products.ATContentTypes/Products/ATContentTypes/content/link.py", line 3, in <module>
    from Products.Archetypes.atapi import Schema
  File "/home/jenkins/workspace/plone-5.0-python-2.7-at/src/Products.Archetypes/Products/Archetypes/atapi.py", line 32, in <module>
    from Products.Archetypes.BaseObject import BaseObject
  File "/home/jenkins/workspace/plone-5.0-python-2.7-at/src/Products.Archetypes/Products/Archetypes/BaseObject.py", line 114, in <module>
    class BaseObject(Referenceable):
  File "/home/jenkins/workspace/plone-5.0-python-2.7-at/src/Products.Archetypes/Products/Archetypes/BaseObject.py", line 133, in BaseObject
    implements(IBaseObject, IReferenceable)


FAILED:  plone.app.blob.tests.test_replacements.Startup

Error Message:
name 'implements' is not defined

Stack Trace:
name 'implements' is not defined

  File "/home/jenkins/workspace/plone-5.0-python-2.7-at/src/plone.app.blob/src/plone/app/blob/tests/test_replacements.py", line 2, in <module>
    from plone.app.blob.content import ATBlob
  File "/home/jenkins/workspace/plone-5.0-python-2.7-at/src/plone.app.blob/src/plone/app/blob/content.py", line 6, in <module>
    from plone.app.blob.field import BlobMarshaller
  File "/home/jenkins/workspace/plone-5.0-python-2.7-at/src/plone.app.blob/src/plone/app/blob/field.py", line 12, in <module>
    from plone.app.blob.interfaces import IBlobbable
  File "/home/jenkins/workspace/plone-5.0-python-2.7-at/src/plone.app.blob/src/plone/app/blob/interfaces.py", line 2, in <module>
    from Products.CMFPlone import PloneMessageFactory as _
  File "/home/jenkins/workspace/plone-5.0-python-2.7-at/src/Products.CMFPlone/Products/CMFPlone/__init__.py", line 228, in <module>
    from Products.CMFPlone import earlypatches  # noqa
  File "/home/jenkins/workspace/plone-5.0-python-2.7-at/src/Products.CMFPlone/Products/CMFPlone/earlypatches/__init__.py", line 2, in <module>
    import security  # noqa
  File "/home/jenkins/workspace/plone-5.0-python-2.7-at/src/Products.CMFPlone/Products/CMFPlone/earlypatches/security.py", line 86, in <module>
    exec code in utils.getToolByName.func_globals
  File "<string>", line 5, in <module>
  File "/home/jenkins/workspace/plone-5.0-python-2.7-at/src/Products.ATContentTypes/Products/ATContentTypes/__init__.py", line 33, in <module>
    import Products.ATContentTypes.content  # noqa
  File "/home/jenkins/workspace/plone-5.0-python-2.7-at/src/Products.ATContentTypes/Products/ATContentTypes/content/__init__.py", line 2, in <module>
    import Products.ATContentTypes.content.link  # noqa
  File "/home/jenkins/workspace/plone-5.0-python-2.7-at/src/Products.ATContentTypes/Products/ATContentTypes/content/link.py", line 3, in <module>
    from Products.Archetypes.atapi import Schema
  File "/home/jenkins/workspace/plone-5.0-python-2.7-at/src/Products.Archetypes/Products/Archetypes/atapi.py", line 32, in <module>
    from Products.Archetypes.BaseObject import BaseObject
  File "/home/jenkins/workspace/plone-5.0-python-2.7-at/src/Products.Archetypes/Products/Archetypes/BaseObject.py", line 114, in <module>
    class BaseObject(Referenceable):
  File "/home/jenkins/workspace/plone-5.0-python-2.7-at/src/Products.Archetypes/Products/Archetypes/BaseObject.py", line 133, in BaseObject
    implements(IBaseObject, IReferenceable)


FAILED:  plone.app.blob.tests.test_scaling.Startup

Error Message:
name 'implements' is not defined

Stack Trace:
name 'implements' is not defined

  File "/home/jenkins/workspace/plone-5.0-python-2.7-at/src/plone.app.blob/src/plone/app/blob/tests/test_scaling.py", line 4, in <module>
    from plone.app.blob.scale import BlobImageScaleHandler
  File "/home/jenkins/workspace/plone-5.0-python-2.7-at/src/plone.app.blob/src/plone/app/blob/scale.py", line 5, in <module>
    from plone.app.blob.interfaces import IBlobImageField
  File "/home/jenkins/workspace/plone-5.0-python-2.7-at/src/plone.app.blob/src/plone/app/blob/interfaces.py", line 2, in <module>
    from Products.CMFPlone import PloneMessageFactory as _
  File "/home/jenkins/workspace/plone-5.0-python-2.7-at/src/Products.CMFPlone/Products/CMFPlone/__init__.py", line 228, in <module>
    from Products.CMFPlone import earlypatches  # noqa
  File "/home/jenkins/workspace/plone-5.0-python-2.7-at/src/Products.CMFPlone/Products/CMFPlone/earlypatches/__init__.py", line 2, in <module>
    import security  # noqa
  File "/home/jenkins/workspace/plone-5.0-python-2.7-at/src/Products.CMFPlone/Products/CMFPlone/earlypatches/security.py", line 86, in <module>
    exec code in utils.getToolByName.func_globals
  File "<string>", line 5, in <module>
  File "/home/jenkins/workspace/plone-5.0-python-2.7-at/src/Products.ATContentTypes/Products/ATContentTypes/__init__.py", line 33, in <module>
    import Products.ATContentTypes.content  # noqa
  File "/home/jenkins/workspace/plone-5.0-python-2.7-at/src/Products.ATContentTypes/Products/ATContentTypes/content/__init__.py", line 2, in <module>
    import Products.ATContentTypes.content.link  # noqa
  File "/home/jenkins/workspace/plone-5.0-python-2.7-at/src/Products.ATContentTypes/Products/ATContentTypes/content/link.py", line 3, in <module>
    from Products.Archetypes.atapi import Schema
  File "/home/jenkins/workspace/plone-5.0-python-2.7-at/src/Products.Archetypes/Products/Archetypes/atapi.py", line 32, in <module>
    from Products.Archetypes.BaseObject import BaseObject
  File "/home/jenkins/workspace/plone-5.0-python-2.7-at/src/Products.Archetypes/Products/Archetypes/BaseObject.py", line 114, in <module>
    class BaseObject(Referenceable):
  File "/home/jenkins/workspace/plone-5.0-python-2.7-at/src/Products.Archetypes/Products/Archetypes/BaseObject.py", line 133, in BaseObject
    implements(IBaseObject, IReferenceable)


FAILED:  plone.app.blob.tests.test_webdav.Startup

Error Message:
name 'implements' is not defined

Stack Trace:
name 'implements' is not defined

  File "/home/jenkins/workspace/plone-5.0-python-2.7-at/src/plone.app.blob/src/plone/app/blob/tests/test_webdav.py", line 2, in <module>
    from plone.app.blob.interfaces import IATBlobImage
  File "/home/jenkins/workspace/plone-5.0-python-2.7-at/src/plone.app.blob/src/plone/app/blob/interfaces.py", line 2, in <module>
    from Products.CMFPlone import PloneMessageFactory as _
  File "/home/jenkins/workspace/plone-5.0-python-2.7-at/src/Products.CMFPlone/Products/CMFPlone/__init__.py", line 228, in <module>
    from Products.CMFPlone import earlypatches  # noqa
  File "/home/jenkins/workspace/plone-5.0-python-2.7-at/src/Products.CMFPlone/Products/CMFPlone/earlypatches/__init__.py", line 2, in <module>
    import security  # noqa
  File "/home/jenkins/workspace/plone-5.0-python-2.7-at/src/Products.CMFPlone/Products/CMFPlone/earlypatches/security.py", line 86, in <module>
    exec code in utils.getToolByName.func_globals
  File "<string>", line 5, in <module>
  File "/home/jenkins/workspace/plone-5.0-python-2.7-at/src/Products.ATContentTypes/Products/ATContentTypes/__init__.py", line 33, in <module>
    import Products.ATContentTypes.content  # noqa
  File "/home/jenkins/workspace/plone-5.0-python-2.7-at/src/Products.ATContentTypes/Products/ATContentTypes/content/__init__.py", line 2, in <module>
    import Products.ATContentTypes.content.link  # noqa
  File "/home/jenkins/workspace/plone-5.0-python-2.7-at/src/Products.ATContentTypes/Products/ATContentTypes/content/link.py", line 3, in <module>
    from Products.Archetypes.atapi import Schema
  File "/home/jenkins/workspace/plone-5.0-python-2.7-at/src/Products.Archetypes/Products/Archetypes/atapi.py", line 32, in <module>
    from Products.Archetypes.BaseObject import BaseObject
  File "/home/jenkins/workspace/plone-5.0-python-2.7-at/src/Products.Archetypes/Products/Archetypes/BaseObject.py", line 114, in <module>
    class BaseObject(Referenceable):
  File "/home/jenkins/workspace/plone-5.0-python-2.7-at/src/Products.Archetypes/Products/Archetypes/BaseObject.py", line 133, in BaseObject
    implements(IBaseObject, IReferenceable)


FAILED:  plone.app.collection.tests.test_collection.Startup

Error Message:
name 'implements' is not defined

Stack Trace:
name 'implements' is not defined

  File "/home/jenkins/.buildout/eggs/plone.app.collection-1.1.7-py2.7.egg/plone/app/collection/tests/test_collection.py", line 4, in <module>
    from plone.app.collection.testing import PLONEAPPCOLLECTION_FUNCTIONAL_TESTING
  File "/home/jenkins/.buildout/eggs/plone.app.collection-1.1.7-py2.7.egg/plone/app/collection/testing.py", line 7, in <module>
    from plone.app.testing import TEST_USER_ID
  File "/home/jenkins/.buildout/eggs/plone.app.testing-5.0.6-py2.7.egg/plone/app/testing/__init__.py", line 4, in <module>
    from plone.app.testing.helpers import applyProfile
  File "/home/jenkins/.buildout/eggs/plone.app.testing-5.0.6-py2.7.egg/plone/app/testing/helpers.py", line 5, in <module>
    from plone.app.testing import layers
  File "/home/jenkins/.buildout/eggs/plone.app.testing-5.0.6-py2.7.egg/plone/app/testing/layers.py", line 27, in <module>
    class PloneFixture(Layer):
  File "/home/jenkins/.buildout/eggs/plone.app.testing-5.0.6-py2.7.egg/plone/app/testing/layers.py", line 81, in PloneFixture
    import Products.PasswordResetTool  # noqa
  File "/home/jenkins/.buildout/eggs/Products.PasswordResetTool-2.2.3-py2.7.egg/Products/PasswordResetTool/__init__.py", line 4, in <module>
    import PasswordResetTool
  File "/home/jenkins/.buildout/eggs/Products.PasswordResetTool-2.2.3-py2.7.egg/Products/PasswordResetTool/PasswordResetTool.py", line 24, in <module>
    from Products.CMFPlone.interfaces import ISecuritySchema
  File "/home/jenkins/workspace/plone-5.0-python-2.7-at/src/Products.CMFPlone/Products/CMFPlone/__init__.py", line 228, in <module>
    from Products.CMFPlone import earlypatches  # noqa
  File "/home/jenkins/workspace/plone-5.0-python-2.7-at/src/Products.CMFPlone/Products/CMFPlone/earlypatches/__init__.py", line 2, in <module>
    import security  # noqa
  File "/home/jenkins/workspace/plone-5.0-python-2.7-at/src/Products.CMFPlone/Products/CMFPlone/earlypatches/security.py", line 86, in <module>
    exec code in utils.getToolByName.func_globals
  File "<string>", line 5, in <module>
  File "/home/jenkins/workspace/plone-5.0-python-2.7-at/src/Products.ATContentTypes/Products/ATContentTypes/__init__.py", line 33, in <module>
    import Products.ATContentTypes.content  # noqa
  File "/home/jenkins/workspace/plone-5.0-python-2.7-at/src/Products.ATContentTypes/Products/ATContentTypes/content/__init__.py", line 2, in <module>
    import Products.ATContentTypes.content.link  # noqa
  File "/home/jenkins/workspace/plone-5.0-python-2.7-at/src/Products.ATContentTypes/Products/ATContentTypes/content/link.py", line 3, in <module>
    from Products.Archetypes.atapi import Schema
  File "/home/jenkins/workspace/plone-5.0-python-2.7-at/src/Products.Archetypes/Products/Archetypes/atapi.py", line 32, in <module>
    from Products.Archetypes.BaseObject import BaseObject
  File "/home/jenkins/workspace/plone-5.0-python-2.7-at/src/Products.Archetypes/Products/Archetypes/BaseObject.py", line 114, in <module>
    class BaseObject(Referenceable):
  File "/home/jenkins/workspace/plone-5.0-python-2.7-at/src/Products.Archetypes/Products/Archetypes/BaseObject.py", line 133, in BaseObject
    implements(IBaseObject, IReferenceable)


More information about the Testbot mailing list