[Testbot] Plone 5.1 - Python 2.7 - Archetypes - Build # 40 - Still Failing!

jenkins at plone.org jenkins at plone.org
Tue May 2 11:52:30 UTC 2017


Plone 5.1 - Python 2.7 - Archetypes - Build # 40 - Still Failing:

Check console output at http://jenkins.plone.org/job/plone-5.1-python-2.7-at/40/ to view the results.

Changes:

[Philip Bauer] pinn versions of dependencies of zope.app.wsgi







Test Results:

17 tests failed.
FAILED:  Products.ATContentTypes.tests.test_base_profile.TestBaseProfile.test_attypes_not_installed

Error Message:
cannot create weak reference to 'Acquisition.ImplicitAcquisitionWrapper' object

Stack Trace:
cannot create weak reference to 'Acquisition.ImplicitAcquisitionWrapper' object

  File "/usr/lib/python2.7/unittest/case.py", line 320, in run
    self.setUp()
  File "/home/jenkins/.buildout/eggs/plone.app.testing-5.0.6-py2.7.egg/plone/app/testing/bbb.py", line 72, in setUp
    self.afterSetUp()
  File "/home/jenkins/workspace/plone-5.1-python-2.7-at/src/Products.ATContentTypes/Products/ATContentTypes/tests/test_base_profile.py", line 12, in afterSetUp
    qi.uninstall_product('Products.ATContentTypes')
  File "/home/jenkins/workspace/plone-5.1-python-2.7-at/src/Products.CMFPlone/Products/CMFPlone/controlpanel/browser/quickinstaller.py", line 495, in uninstall_product
    'profile-%s' % profile['id'])
  File "/home/jenkins/.buildout/eggs/Products.GenericSetup-1.8.7-py2.7.egg/Products/GenericSetup/tool.py", line 388, in runAllImportStepsFromProfile
    dependency_strategy=dependency_strategy)
  File "/home/jenkins/.buildout/eggs/Products.GenericSetup-1.8.7-py2.7.egg/Products/GenericSetup/tool.py", line 1433, in _runImportStepsFromContext
    message = self._doRunImportStep(step, context)
  File "/home/jenkins/.buildout/eggs/Products.GenericSetup-1.8.7-py2.7.egg/Products/GenericSetup/tool.py", line 1245, in _doRunImportStep
    return handler(context)
  File "/home/jenkins/.buildout/eggs/Products.GenericSetup-1.8.7-py2.7.egg/Products/GenericSetup/components.py", line 536, in importComponentRegistry
    importer.body = body
  File "/home/jenkins/.buildout/eggs/Products.GenericSetup-1.8.7-py2.7.egg/Products/GenericSetup/utils.py", line 512, in _importBody
    self._importNode(dom.documentElement)
  File "/home/jenkins/.buildout/eggs/Products.GenericSetup-1.8.7-py2.7.egg/Products/GenericSetup/components.py", line 106, in _importNode
    self._initUtilities(child)
  File "/home/jenkins/.buildout/eggs/Products.GenericSetup-1.8.7-py2.7.egg/Products/GenericSetup/components.py", line 311, in _initUtilities
    name=name)
  File "/home/jenkins/.buildout/eggs/five.localsitemanager-2.0.5-py2.7.egg/five/localsitemanager/registry.py", line 320, in unregisterUtility
    component=component, provided=provided, name=name)
  File "/home/jenkins/.buildout/eggs/zope.interface-4.4.0-py2.7-linux-x86_64.egg/zope/interface/registry.py", line 267, in unregisterUtility
    _UtilityRegistrations.for_components(self).unregisterUtility(provided, name, component)
  File "/home/jenkins/.buildout/eggs/zope.interface-4.4.0-py2.7-linux-x86_64.egg/zope/interface/registry.py", line 104, in for_components
    cls._weakrefs_for_components[key] = weakref.ref(components, _cleanup)


FAILED:  Products.ATContentTypes.tests.test_installation.TestUninstallation.test_double_uninstall

Error Message:
cannot create weak reference to 'Acquisition.ImplicitAcquisitionWrapper' object

Stack Trace:
cannot create weak reference to 'Acquisition.ImplicitAcquisitionWrapper' object

  File "/usr/lib/python2.7/unittest/case.py", line 320, in run
    self.setUp()
  File "/home/jenkins/.buildout/eggs/plone.app.testing-5.0.6-py2.7.egg/plone/app/testing/bbb.py", line 72, in setUp
    self.afterSetUp()
  File "/home/jenkins/workspace/plone-5.1-python-2.7-at/src/Products.ATContentTypes/Products/ATContentTypes/tests/test_installation.py", line 77, in afterSetUp
    qi.uninstall_product('Products.ATContentTypes')
  File "/home/jenkins/workspace/plone-5.1-python-2.7-at/src/Products.CMFPlone/Products/CMFPlone/controlpanel/browser/quickinstaller.py", line 495, in uninstall_product
    'profile-%s' % profile['id'])
  File "/home/jenkins/.buildout/eggs/Products.GenericSetup-1.8.7-py2.7.egg/Products/GenericSetup/tool.py", line 388, in runAllImportStepsFromProfile
    dependency_strategy=dependency_strategy)
  File "/home/jenkins/.buildout/eggs/Products.GenericSetup-1.8.7-py2.7.egg/Products/GenericSetup/tool.py", line 1433, in _runImportStepsFromContext
    message = self._doRunImportStep(step, context)
  File "/home/jenkins/.buildout/eggs/Products.GenericSetup-1.8.7-py2.7.egg/Products/GenericSetup/tool.py", line 1245, in _doRunImportStep
    return handler(context)
  File "/home/jenkins/.buildout/eggs/Products.GenericSetup-1.8.7-py2.7.egg/Products/GenericSetup/components.py", line 536, in importComponentRegistry
    importer.body = body
  File "/home/jenkins/.buildout/eggs/Products.GenericSetup-1.8.7-py2.7.egg/Products/GenericSetup/utils.py", line 512, in _importBody
    self._importNode(dom.documentElement)
  File "/home/jenkins/.buildout/eggs/Products.GenericSetup-1.8.7-py2.7.egg/Products/GenericSetup/components.py", line 106, in _importNode
    self._initUtilities(child)
  File "/home/jenkins/.buildout/eggs/Products.GenericSetup-1.8.7-py2.7.egg/Products/GenericSetup/components.py", line 311, in _initUtilities
    name=name)
  File "/home/jenkins/.buildout/eggs/five.localsitemanager-2.0.5-py2.7.egg/five/localsitemanager/registry.py", line 320, in unregisterUtility
    component=component, provided=provided, name=name)
  File "/home/jenkins/.buildout/eggs/zope.interface-4.4.0-py2.7-linux-x86_64.egg/zope/interface/registry.py", line 267, in unregisterUtility
    _UtilityRegistrations.for_components(self).unregisterUtility(provided, name, component)
  File "/home/jenkins/.buildout/eggs/zope.interface-4.4.0-py2.7-linux-x86_64.egg/zope/interface/registry.py", line 104, in for_components
    cls._weakrefs_for_components[key] = weakref.ref(components, _cleanup)


FAILED:  Products.ATContentTypes.tests.test_installation.TestUninstallation.test_is_installable

Error Message:
cannot create weak reference to 'Acquisition.ImplicitAcquisitionWrapper' object

Stack Trace:
cannot create weak reference to 'Acquisition.ImplicitAcquisitionWrapper' object

  File "/usr/lib/python2.7/unittest/case.py", line 320, in run
    self.setUp()
  File "/home/jenkins/.buildout/eggs/plone.app.testing-5.0.6-py2.7.egg/plone/app/testing/bbb.py", line 72, in setUp
    self.afterSetUp()
  File "/home/jenkins/workspace/plone-5.1-python-2.7-at/src/Products.ATContentTypes/Products/ATContentTypes/tests/test_installation.py", line 77, in afterSetUp
    qi.uninstall_product('Products.ATContentTypes')
  File "/home/jenkins/workspace/plone-5.1-python-2.7-at/src/Products.CMFPlone/Products/CMFPlone/controlpanel/browser/quickinstaller.py", line 495, in uninstall_product
    'profile-%s' % profile['id'])
  File "/home/jenkins/.buildout/eggs/Products.GenericSetup-1.8.7-py2.7.egg/Products/GenericSetup/tool.py", line 388, in runAllImportStepsFromProfile
    dependency_strategy=dependency_strategy)
  File "/home/jenkins/.buildout/eggs/Products.GenericSetup-1.8.7-py2.7.egg/Products/GenericSetup/tool.py", line 1433, in _runImportStepsFromContext
    message = self._doRunImportStep(step, context)
  File "/home/jenkins/.buildout/eggs/Products.GenericSetup-1.8.7-py2.7.egg/Products/GenericSetup/tool.py", line 1245, in _doRunImportStep
    return handler(context)
  File "/home/jenkins/.buildout/eggs/Products.GenericSetup-1.8.7-py2.7.egg/Products/GenericSetup/components.py", line 536, in importComponentRegistry
    importer.body = body
  File "/home/jenkins/.buildout/eggs/Products.GenericSetup-1.8.7-py2.7.egg/Products/GenericSetup/utils.py", line 512, in _importBody
    self._importNode(dom.documentElement)
  File "/home/jenkins/.buildout/eggs/Products.GenericSetup-1.8.7-py2.7.egg/Products/GenericSetup/components.py", line 106, in _importNode
    self._initUtilities(child)
  File "/home/jenkins/.buildout/eggs/Products.GenericSetup-1.8.7-py2.7.egg/Products/GenericSetup/components.py", line 311, in _initUtilities
    name=name)
  File "/home/jenkins/.buildout/eggs/five.localsitemanager-2.0.5-py2.7.egg/five/localsitemanager/registry.py", line 320, in unregisterUtility
    component=component, provided=provided, name=name)
  File "/home/jenkins/.buildout/eggs/zope.interface-4.4.0-py2.7-linux-x86_64.egg/zope/interface/registry.py", line 267, in unregisterUtility
    _UtilityRegistrations.for_components(self).unregisterUtility(provided, name, component)
  File "/home/jenkins/.buildout/eggs/zope.interface-4.4.0-py2.7-linux-x86_64.egg/zope/interface/registry.py", line 104, in for_components
    cls._weakrefs_for_components[key] = weakref.ref(components, _cleanup)


FAILED:  Products.ATContentTypes.tests.test_installation.TestUninstallation.test_removes_related_items_catalog_index

Error Message:
cannot create weak reference to 'Acquisition.ImplicitAcquisitionWrapper' object

Stack Trace:
cannot create weak reference to 'Acquisition.ImplicitAcquisitionWrapper' object

  File "/usr/lib/python2.7/unittest/case.py", line 320, in run
    self.setUp()
  File "/home/jenkins/.buildout/eggs/plone.app.testing-5.0.6-py2.7.egg/plone/app/testing/bbb.py", line 72, in setUp
    self.afterSetUp()
  File "/home/jenkins/workspace/plone-5.1-python-2.7-at/src/Products.ATContentTypes/Products/ATContentTypes/tests/test_installation.py", line 77, in afterSetUp
    qi.uninstall_product('Products.ATContentTypes')
  File "/home/jenkins/workspace/plone-5.1-python-2.7-at/src/Products.CMFPlone/Products/CMFPlone/controlpanel/browser/quickinstaller.py", line 495, in uninstall_product
    'profile-%s' % profile['id'])
  File "/home/jenkins/.buildout/eggs/Products.GenericSetup-1.8.7-py2.7.egg/Products/GenericSetup/tool.py", line 388, in runAllImportStepsFromProfile
    dependency_strategy=dependency_strategy)
  File "/home/jenkins/.buildout/eggs/Products.GenericSetup-1.8.7-py2.7.egg/Products/GenericSetup/tool.py", line 1433, in _runImportStepsFromContext
    message = self._doRunImportStep(step, context)
  File "/home/jenkins/.buildout/eggs/Products.GenericSetup-1.8.7-py2.7.egg/Products/GenericSetup/tool.py", line 1245, in _doRunImportStep
    return handler(context)
  File "/home/jenkins/.buildout/eggs/Products.GenericSetup-1.8.7-py2.7.egg/Products/GenericSetup/components.py", line 536, in importComponentRegistry
    importer.body = body
  File "/home/jenkins/.buildout/eggs/Products.GenericSetup-1.8.7-py2.7.egg/Products/GenericSetup/utils.py", line 512, in _importBody
    self._importNode(dom.documentElement)
  File "/home/jenkins/.buildout/eggs/Products.GenericSetup-1.8.7-py2.7.egg/Products/GenericSetup/components.py", line 106, in _importNode
    self._initUtilities(child)
  File "/home/jenkins/.buildout/eggs/Products.GenericSetup-1.8.7-py2.7.egg/Products/GenericSetup/components.py", line 311, in _initUtilities
    name=name)
  File "/home/jenkins/.buildout/eggs/five.localsitemanager-2.0.5-py2.7.egg/five/localsitemanager/registry.py", line 320, in unregisterUtility
    component=component, provided=provided, name=name)
  File "/home/jenkins/.buildout/eggs/zope.interface-4.4.0-py2.7-linux-x86_64.egg/zope/interface/registry.py", line 267, in unregisterUtility
    _UtilityRegistrations.for_components(self).unregisterUtility(provided, name, component)
  File "/home/jenkins/.buildout/eggs/zope.interface-4.4.0-py2.7-linux-x86_64.egg/zope/interface/registry.py", line 104, in for_components
    cls._weakrefs_for_components[key] = weakref.ref(components, _cleanup)


FAILED:  Products.ATContentTypes.tests.test_installation.TestUninstallation.test_skin_uninstalled

Error Message:
cannot create weak reference to 'Acquisition.ImplicitAcquisitionWrapper' object

Stack Trace:
cannot create weak reference to 'Acquisition.ImplicitAcquisitionWrapper' object

  File "/usr/lib/python2.7/unittest/case.py", line 320, in run
    self.setUp()
  File "/home/jenkins/.buildout/eggs/plone.app.testing-5.0.6-py2.7.egg/plone/app/testing/bbb.py", line 72, in setUp
    self.afterSetUp()
  File "/home/jenkins/workspace/plone-5.1-python-2.7-at/src/Products.ATContentTypes/Products/ATContentTypes/tests/test_installation.py", line 77, in afterSetUp
    qi.uninstall_product('Products.ATContentTypes')
  File "/home/jenkins/workspace/plone-5.1-python-2.7-at/src/Products.CMFPlone/Products/CMFPlone/controlpanel/browser/quickinstaller.py", line 495, in uninstall_product
    'profile-%s' % profile['id'])
  File "/home/jenkins/.buildout/eggs/Products.GenericSetup-1.8.7-py2.7.egg/Products/GenericSetup/tool.py", line 388, in runAllImportStepsFromProfile
    dependency_strategy=dependency_strategy)
  File "/home/jenkins/.buildout/eggs/Products.GenericSetup-1.8.7-py2.7.egg/Products/GenericSetup/tool.py", line 1433, in _runImportStepsFromContext
    message = self._doRunImportStep(step, context)
  File "/home/jenkins/.buildout/eggs/Products.GenericSetup-1.8.7-py2.7.egg/Products/GenericSetup/tool.py", line 1245, in _doRunImportStep
    return handler(context)
  File "/home/jenkins/.buildout/eggs/Products.GenericSetup-1.8.7-py2.7.egg/Products/GenericSetup/components.py", line 536, in importComponentRegistry
    importer.body = body
  File "/home/jenkins/.buildout/eggs/Products.GenericSetup-1.8.7-py2.7.egg/Products/GenericSetup/utils.py", line 512, in _importBody
    self._importNode(dom.documentElement)
  File "/home/jenkins/.buildout/eggs/Products.GenericSetup-1.8.7-py2.7.egg/Products/GenericSetup/components.py", line 106, in _importNode
    self._initUtilities(child)
  File "/home/jenkins/.buildout/eggs/Products.GenericSetup-1.8.7-py2.7.egg/Products/GenericSetup/components.py", line 311, in _initUtilities
    name=name)
  File "/home/jenkins/.buildout/eggs/five.localsitemanager-2.0.5-py2.7.egg/five/localsitemanager/registry.py", line 320, in unregisterUtility
    component=component, provided=provided, name=name)
  File "/home/jenkins/.buildout/eggs/zope.interface-4.4.0-py2.7-linux-x86_64.egg/zope/interface/registry.py", line 267, in unregisterUtility
    _UtilityRegistrations.for_components(self).unregisterUtility(provided, name, component)
  File "/home/jenkins/.buildout/eggs/zope.interface-4.4.0-py2.7-linux-x86_64.egg/zope/interface/registry.py", line 104, in for_components
    cls._weakrefs_for_components[key] = weakref.ref(components, _cleanup)


FAILED:  Products.ATContentTypes.tests.test_installation.TestUninstallation.test_tool_uninstalled

Error Message:
cannot create weak reference to 'Acquisition.ImplicitAcquisitionWrapper' object

Stack Trace:
cannot create weak reference to 'Acquisition.ImplicitAcquisitionWrapper' object

  File "/usr/lib/python2.7/unittest/case.py", line 320, in run
    self.setUp()
  File "/home/jenkins/.buildout/eggs/plone.app.testing-5.0.6-py2.7.egg/plone/app/testing/bbb.py", line 72, in setUp
    self.afterSetUp()
  File "/home/jenkins/workspace/plone-5.1-python-2.7-at/src/Products.ATContentTypes/Products/ATContentTypes/tests/test_installation.py", line 77, in afterSetUp
    qi.uninstall_product('Products.ATContentTypes')
  File "/home/jenkins/workspace/plone-5.1-python-2.7-at/src/Products.CMFPlone/Products/CMFPlone/controlpanel/browser/quickinstaller.py", line 495, in uninstall_product
    'profile-%s' % profile['id'])
  File "/home/jenkins/.buildout/eggs/Products.GenericSetup-1.8.7-py2.7.egg/Products/GenericSetup/tool.py", line 388, in runAllImportStepsFromProfile
    dependency_strategy=dependency_strategy)
  File "/home/jenkins/.buildout/eggs/Products.GenericSetup-1.8.7-py2.7.egg/Products/GenericSetup/tool.py", line 1433, in _runImportStepsFromContext
    message = self._doRunImportStep(step, context)
  File "/home/jenkins/.buildout/eggs/Products.GenericSetup-1.8.7-py2.7.egg/Products/GenericSetup/tool.py", line 1245, in _doRunImportStep
    return handler(context)
  File "/home/jenkins/.buildout/eggs/Products.GenericSetup-1.8.7-py2.7.egg/Products/GenericSetup/components.py", line 536, in importComponentRegistry
    importer.body = body
  File "/home/jenkins/.buildout/eggs/Products.GenericSetup-1.8.7-py2.7.egg/Products/GenericSetup/utils.py", line 512, in _importBody
    self._importNode(dom.documentElement)
  File "/home/jenkins/.buildout/eggs/Products.GenericSetup-1.8.7-py2.7.egg/Products/GenericSetup/components.py", line 106, in _importNode
    self._initUtilities(child)
  File "/home/jenkins/.buildout/eggs/Products.GenericSetup-1.8.7-py2.7.egg/Products/GenericSetup/components.py", line 311, in _initUtilities
    name=name)
  File "/home/jenkins/.buildout/eggs/five.localsitemanager-2.0.5-py2.7.egg/five/localsitemanager/registry.py", line 320, in unregisterUtility
    component=component, provided=provided, name=name)
  File "/home/jenkins/.buildout/eggs/zope.interface-4.4.0-py2.7-linux-x86_64.egg/zope/interface/registry.py", line 267, in unregisterUtility
    _UtilityRegistrations.for_components(self).unregisterUtility(provided, name, component)
  File "/home/jenkins/.buildout/eggs/zope.interface-4.4.0-py2.7-linux-x86_64.egg/zope/interface/registry.py", line 104, in for_components
    cls._weakrefs_for_components[key] = weakref.ref(components, _cleanup)


FAILED:  Products.ATContentTypes.tests.test_installation.TestUninstallation.test_uninstalledAllTypes

Error Message:
cannot create weak reference to 'Acquisition.ImplicitAcquisitionWrapper' object

Stack Trace:
cannot create weak reference to 'Acquisition.ImplicitAcquisitionWrapper' object

  File "/usr/lib/python2.7/unittest/case.py", line 320, in run
    self.setUp()
  File "/home/jenkins/.buildout/eggs/plone.app.testing-5.0.6-py2.7.egg/plone/app/testing/bbb.py", line 72, in setUp
    self.afterSetUp()
  File "/home/jenkins/workspace/plone-5.1-python-2.7-at/src/Products.ATContentTypes/Products/ATContentTypes/tests/test_installation.py", line 77, in afterSetUp
    qi.uninstall_product('Products.ATContentTypes')
  File "/home/jenkins/workspace/plone-5.1-python-2.7-at/src/Products.CMFPlone/Products/CMFPlone/controlpanel/browser/quickinstaller.py", line 495, in uninstall_product
    'profile-%s' % profile['id'])
  File "/home/jenkins/.buildout/eggs/Products.GenericSetup-1.8.7-py2.7.egg/Products/GenericSetup/tool.py", line 388, in runAllImportStepsFromProfile
    dependency_strategy=dependency_strategy)
  File "/home/jenkins/.buildout/eggs/Products.GenericSetup-1.8.7-py2.7.egg/Products/GenericSetup/tool.py", line 1433, in _runImportStepsFromContext
    message = self._doRunImportStep(step, context)
  File "/home/jenkins/.buildout/eggs/Products.GenericSetup-1.8.7-py2.7.egg/Products/GenericSetup/tool.py", line 1245, in _doRunImportStep
    return handler(context)
  File "/home/jenkins/.buildout/eggs/Products.GenericSetup-1.8.7-py2.7.egg/Products/GenericSetup/components.py", line 536, in importComponentRegistry
    importer.body = body
  File "/home/jenkins/.buildout/eggs/Products.GenericSetup-1.8.7-py2.7.egg/Products/GenericSetup/utils.py", line 512, in _importBody
    self._importNode(dom.documentElement)
  File "/home/jenkins/.buildout/eggs/Products.GenericSetup-1.8.7-py2.7.egg/Products/GenericSetup/components.py", line 106, in _importNode
    self._initUtilities(child)
  File "/home/jenkins/.buildout/eggs/Products.GenericSetup-1.8.7-py2.7.egg/Products/GenericSetup/components.py", line 311, in _initUtilities
    name=name)
  File "/home/jenkins/.buildout/eggs/five.localsitemanager-2.0.5-py2.7.egg/five/localsitemanager/registry.py", line 320, in unregisterUtility
    component=component, provided=provided, name=name)
  File "/home/jenkins/.buildout/eggs/zope.interface-4.4.0-py2.7-linux-x86_64.egg/zope/interface/registry.py", line 267, in unregisterUtility
    _UtilityRegistrations.for_components(self).unregisterUtility(provided, name, component)
  File "/home/jenkins/.buildout/eggs/zope.interface-4.4.0-py2.7-linux-x86_64.egg/zope/interface/registry.py", line 104, in for_components
    cls._weakrefs_for_components[key] = weakref.ref(components, _cleanup)


FAILED:  Products.ATContentTypes.tests.test_migrations.TestMigrations_v1_2.testUpgradeATCTTool

Error Message:
cannot create weak reference to 'Acquisition.ImplicitAcquisitionWrapper' object

Stack Trace:
cannot create weak reference to 'Acquisition.ImplicitAcquisitionWrapper' object

  File "/usr/lib/python2.7/unittest/case.py", line 329, in run
    testMethod()
  File "/home/jenkins/workspace/plone-5.1-python-2.7-at/src/Products.ATContentTypes/Products/ATContentTypes/tests/test_migrations.py", line 17, in testUpgradeATCTTool
    upgradeATCTTool(self.portal)
  File "/home/jenkins/workspace/plone-5.1-python-2.7-at/src/Products.ATContentTypes/Products/ATContentTypes/migration/v1_2/__init__.py", line 43, in upgradeATCTTool
    sm.unregisterUtility(provided=IATCTTool)
  File "/home/jenkins/.buildout/eggs/five.localsitemanager-2.0.5-py2.7.egg/five/localsitemanager/registry.py", line 320, in unregisterUtility
    component=component, provided=provided, name=name)
  File "/home/jenkins/.buildout/eggs/zope.interface-4.4.0-py2.7-linux-x86_64.egg/zope/interface/registry.py", line 267, in unregisterUtility
    _UtilityRegistrations.for_components(self).unregisterUtility(provided, name, component)
  File "/home/jenkins/.buildout/eggs/zope.interface-4.4.0-py2.7-linux-x86_64.egg/zope/interface/registry.py", line 104, in for_components
    cls._weakrefs_for_components[key] = weakref.ref(components, _cleanup)


FAILED:  Products.ATContentTypes.tests.test_migrations.TestMigrations_v1_2.testUpgradeATCTToolTwice

Error Message:
cannot create weak reference to 'Acquisition.ImplicitAcquisitionWrapper' object

Stack Trace:
cannot create weak reference to 'Acquisition.ImplicitAcquisitionWrapper' object

  File "/usr/lib/python2.7/unittest/case.py", line 329, in run
    testMethod()
  File "/home/jenkins/workspace/plone-5.1-python-2.7-at/src/Products.ATContentTypes/Products/ATContentTypes/tests/test_migrations.py", line 24, in testUpgradeATCTToolTwice
    upgradeATCTTool(self.portal)
  File "/home/jenkins/workspace/plone-5.1-python-2.7-at/src/Products.ATContentTypes/Products/ATContentTypes/migration/v1_2/__init__.py", line 43, in upgradeATCTTool
    sm.unregisterUtility(provided=IATCTTool)
  File "/home/jenkins/.buildout/eggs/five.localsitemanager-2.0.5-py2.7.egg/five/localsitemanager/registry.py", line 320, in unregisterUtility
    component=component, provided=provided, name=name)
  File "/home/jenkins/.buildout/eggs/zope.interface-4.4.0-py2.7-linux-x86_64.egg/zope/interface/registry.py", line 267, in unregisterUtility
    _UtilityRegistrations.for_components(self).unregisterUtility(provided, name, component)
  File "/home/jenkins/.buildout/eggs/zope.interface-4.4.0-py2.7-linux-x86_64.egg/zope/interface/registry.py", line 104, in for_components
    cls._weakrefs_for_components[key] = weakref.ref(components, _cleanup)


FAILED:  Products.Archetypes.tests.test_fields.ProcessingTest.test_factory_vocabulary

Error Message:
cannot create weak reference to 'Acquisition.ImplicitAcquisitionWrapper' object

Stack Trace:
cannot create weak reference to 'Acquisition.ImplicitAcquisitionWrapper' object

  File "/usr/lib/python2.7/unittest/case.py", line 329, in run
    testMethod()
  File "/home/jenkins/workspace/plone-5.1-python-2.7-at/src/Products.Archetypes/Products/Archetypes/tests/test_fields.py", line 443, in test_factory_vocabulary
    component=DummyVocabFactory, name='archetypes.tests.dummyvocab')
  File "/home/jenkins/.buildout/eggs/five.localsitemanager-2.0.5-py2.7.egg/five/localsitemanager/registry.py", line 320, in unregisterUtility
    component=component, provided=provided, name=name)
  File "/home/jenkins/.buildout/eggs/zope.interface-4.4.0-py2.7-linux-x86_64.egg/zope/interface/registry.py", line 267, in unregisterUtility
    _UtilityRegistrations.for_components(self).unregisterUtility(provided, name, component)
  File "/home/jenkins/.buildout/eggs/zope.interface-4.4.0-py2.7-linux-x86_64.egg/zope/interface/registry.py", line 104, in for_components
    cls._weakrefs_for_components[key] = weakref.ref(components, _cleanup)


FAILED:  Products.Archetypes.tests.test_fields.ProcessingTest.test_factory_vocabulary_int

Error Message:
cannot create weak reference to 'Acquisition.ImplicitAcquisitionWrapper' object

Stack Trace:
cannot create weak reference to 'Acquisition.ImplicitAcquisitionWrapper' object

  File "/usr/lib/python2.7/unittest/case.py", line 329, in run
    testMethod()
  File "/home/jenkins/workspace/plone-5.1-python-2.7-at/src/Products.Archetypes/Products/Archetypes/tests/test_fields.py", line 462, in test_factory_vocabulary_int
    name='archetypes.tests.dummyintvocab')
  File "/home/jenkins/.buildout/eggs/five.localsitemanager-2.0.5-py2.7.egg/five/localsitemanager/registry.py", line 320, in unregisterUtility
    component=component, provided=provided, name=name)
  File "/home/jenkins/.buildout/eggs/zope.interface-4.4.0-py2.7-linux-x86_64.egg/zope/interface/registry.py", line 267, in unregisterUtility
    _UtilityRegistrations.for_components(self).unregisterUtility(provided, name, component)
  File "/home/jenkins/.buildout/eggs/zope.interface-4.4.0-py2.7-linux-x86_64.egg/zope/interface/registry.py", line 104, in for_components
    cls._weakrefs_for_components[key] = weakref.ref(components, _cleanup)


FAILED:  Products.CMFPlacefulWorkflow.tests.testCMFPlacefulWorkflow.TestPlacefulWorkflow.test_activation_reactivation

Error Message:
cannot create weak reference to 'Acquisition.ImplicitAcquisitionWrapper' object

Stack Trace:
cannot create weak reference to 'Acquisition.ImplicitAcquisitionWrapper' object

  File "/usr/lib/python2.7/unittest/case.py", line 329, in run
    testMethod()
  File "/home/jenkins/.buildout/eggs/Products.CMFPlacefulWorkflow-1.7.3-py2.7.egg/Products/CMFPlacefulWorkflow/tests/testCMFPlacefulWorkflow.py", line 109, in test_activation_reactivation
    self.qi.uninstall_product('CMFPlacefulWorkflow')
  File "/home/jenkins/workspace/plone-5.1-python-2.7-at/src/Products.CMFPlone/Products/CMFPlone/controlpanel/browser/quickinstaller.py", line 495, in uninstall_product
    'profile-%s' % profile['id'])
  File "/home/jenkins/.buildout/eggs/Products.GenericSetup-1.8.7-py2.7.egg/Products/GenericSetup/tool.py", line 388, in runAllImportStepsFromProfile
    dependency_strategy=dependency_strategy)
  File "/home/jenkins/.buildout/eggs/Products.GenericSetup-1.8.7-py2.7.egg/Products/GenericSetup/tool.py", line 1427, in _runImportStepsFromContext
    self._doRunHandler(pre_handler)
  File "/home/jenkins/.buildout/eggs/Products.GenericSetup-1.8.7-py2.7.egg/Products/GenericSetup/tool.py", line 1289, in _doRunHandler
    return handler_function(self)
  File "/home/jenkins/.buildout/eggs/Products.CMFPlacefulWorkflow-1.7.3-py2.7.egg/Products/CMFPlacefulWorkflow/setuphandlers.py", line 53, in uninstall
    IPlacefulWorkflowTool)
  File "/home/jenkins/.buildout/eggs/five.localsitemanager-2.0.5-py2.7.egg/five/localsitemanager/registry.py", line 320, in unregisterUtility
    component=component, provided=provided, name=name)
  File "/home/jenkins/.buildout/eggs/zope.interface-4.4.0-py2.7-linux-x86_64.egg/zope/interface/registry.py", line 267, in unregisterUtility
    _UtilityRegistrations.for_components(self).unregisterUtility(provided, name, component)
  File "/home/jenkins/.buildout/eggs/zope.interface-4.4.0-py2.7-linux-x86_64.egg/zope/interface/registry.py", line 104, in for_components
    cls._weakrefs_for_components[key] = weakref.ref(components, _cleanup)


FAILED:  Products.CMFPlacefulWorkflow.tests.testCMFPlacefulWorkflow.TestPlacefulWorkflow.test_marker_applied_and_unapplied

Error Message:
cannot create weak reference to 'Acquisition.ImplicitAcquisitionWrapper' object

Stack Trace:
cannot create weak reference to 'Acquisition.ImplicitAcquisitionWrapper' object

  File "/usr/lib/python2.7/unittest/case.py", line 329, in run
    testMethod()
  File "/home/jenkins/.buildout/eggs/Products.CMFPlacefulWorkflow-1.7.3-py2.7.egg/Products/CMFPlacefulWorkflow/tests/testCMFPlacefulWorkflow.py", line 92, in test_marker_applied_and_unapplied
    self.qi.uninstall_product('CMFPlacefulWorkflow')
  File "/home/jenkins/workspace/plone-5.1-python-2.7-at/src/Products.CMFPlone/Products/CMFPlone/controlpanel/browser/quickinstaller.py", line 495, in uninstall_product
    'profile-%s' % profile['id'])
  File "/home/jenkins/.buildout/eggs/Products.GenericSetup-1.8.7-py2.7.egg/Products/GenericSetup/tool.py", line 388, in runAllImportStepsFromProfile
    dependency_strategy=dependency_strategy)
  File "/home/jenkins/.buildout/eggs/Products.GenericSetup-1.8.7-py2.7.egg/Products/GenericSetup/tool.py", line 1427, in _runImportStepsFromContext
    self._doRunHandler(pre_handler)
  File "/home/jenkins/.buildout/eggs/Products.GenericSetup-1.8.7-py2.7.egg/Products/GenericSetup/tool.py", line 1289, in _doRunHandler
    return handler_function(self)
  File "/home/jenkins/.buildout/eggs/Products.CMFPlacefulWorkflow-1.7.3-py2.7.egg/Products/CMFPlacefulWorkflow/setuphandlers.py", line 53, in uninstall
    IPlacefulWorkflowTool)
  File "/home/jenkins/.buildout/eggs/five.localsitemanager-2.0.5-py2.7.egg/five/localsitemanager/registry.py", line 320, in unregisterUtility
    component=component, provided=provided, name=name)
  File "/home/jenkins/.buildout/eggs/zope.interface-4.4.0-py2.7-linux-x86_64.egg/zope/interface/registry.py", line 267, in unregisterUtility
    _UtilityRegistrations.for_components(self).unregisterUtility(provided, name, component)
  File "/home/jenkins/.buildout/eggs/zope.interface-4.4.0-py2.7-linux-x86_64.egg/zope/interface/registry.py", line 104, in for_components
    cls._weakrefs_for_components[key] = weakref.ref(components, _cleanup)


FAILED:  Products.CMFPlacefulWorkflow.tests.testCMFPlacefulWorkflow.TestPlacefulWorkflow.test_reinstall

Error Message:
cannot create weak reference to 'Acquisition.ImplicitAcquisitionWrapper' object

Stack Trace:
cannot create weak reference to 'Acquisition.ImplicitAcquisitionWrapper' object

  File "/usr/lib/python2.7/unittest/case.py", line 329, in run
    testMethod()
  File "/home/jenkins/.buildout/eggs/Products.CMFPlacefulWorkflow-1.7.3-py2.7.egg/Products/CMFPlacefulWorkflow/tests/testCMFPlacefulWorkflow.py", line 102, in test_reinstall
    self.qi.uninstall_product('CMFPlacefulWorkflow')
  File "/home/jenkins/workspace/plone-5.1-python-2.7-at/src/Products.CMFPlone/Products/CMFPlone/controlpanel/browser/quickinstaller.py", line 495, in uninstall_product
    'profile-%s' % profile['id'])
  File "/home/jenkins/.buildout/eggs/Products.GenericSetup-1.8.7-py2.7.egg/Products/GenericSetup/tool.py", line 388, in runAllImportStepsFromProfile
    dependency_strategy=dependency_strategy)
  File "/home/jenkins/.buildout/eggs/Products.GenericSetup-1.8.7-py2.7.egg/Products/GenericSetup/tool.py", line 1427, in _runImportStepsFromContext
    self._doRunHandler(pre_handler)
  File "/home/jenkins/.buildout/eggs/Products.GenericSetup-1.8.7-py2.7.egg/Products/GenericSetup/tool.py", line 1289, in _doRunHandler
    return handler_function(self)
  File "/home/jenkins/.buildout/eggs/Products.CMFPlacefulWorkflow-1.7.3-py2.7.egg/Products/CMFPlacefulWorkflow/setuphandlers.py", line 53, in uninstall
    IPlacefulWorkflowTool)
  File "/home/jenkins/.buildout/eggs/five.localsitemanager-2.0.5-py2.7.egg/five/localsitemanager/registry.py", line 320, in unregisterUtility
    component=component, provided=provided, name=name)
  File "/home/jenkins/.buildout/eggs/zope.interface-4.4.0-py2.7-linux-x86_64.egg/zope/interface/registry.py", line 267, in unregisterUtility
    _UtilityRegistrations.for_components(self).unregisterUtility(provided, name, component)
  File "/home/jenkins/.buildout/eggs/zope.interface-4.4.0-py2.7-linux-x86_64.egg/zope/interface/registry.py", line 104, in for_components
    cls._weakrefs_for_components[key] = weakref.ref(components, _cleanup)


FAILED:  Products.GenericSetup.tests.test_components.ComponentRegistryXMLAdapterTests.test_remove_components

Error Message:
cannot create weak reference to 'Acquisition.ImplicitAcquisitionWrapper' object

Stack Trace:
cannot create weak reference to 'Acquisition.ImplicitAcquisitionWrapper' object

  File "/usr/lib/python2.7/unittest/case.py", line 329, in run
    testMethod()
  File "/home/jenkins/.buildout/eggs/Products.GenericSetup-1.8.7-py2.7.egg/Products/GenericSetup/tests/test_components.py", line 411, in test_remove_components
    importComponentRegistry(context)
  File "/home/jenkins/.buildout/eggs/Products.GenericSetup-1.8.7-py2.7.egg/Products/GenericSetup/components.py", line 536, in importComponentRegistry
    importer.body = body
  File "/home/jenkins/.buildout/eggs/Products.GenericSetup-1.8.7-py2.7.egg/Products/GenericSetup/utils.py", line 512, in _importBody
    self._importNode(dom.documentElement)
  File "/home/jenkins/.buildout/eggs/Products.GenericSetup-1.8.7-py2.7.egg/Products/GenericSetup/components.py", line 106, in _importNode
    self._initUtilities(child)
  File "/home/jenkins/.buildout/eggs/Products.GenericSetup-1.8.7-py2.7.egg/Products/GenericSetup/components.py", line 311, in _initUtilities
    name=name)
  File "/home/jenkins/.buildout/eggs/five.localsitemanager-2.0.5-py2.7.egg/five/localsitemanager/registry.py", line 320, in unregisterUtility
    component=component, provided=provided, name=name)
  File "/home/jenkins/.buildout/eggs/zope.interface-4.4.0-py2.7-linux-x86_64.egg/zope/interface/registry.py", line 267, in unregisterUtility
    _UtilityRegistrations.for_components(self).unregisterUtility(provided, name, component)
  File "/home/jenkins/.buildout/eggs/zope.interface-4.4.0-py2.7-linux-x86_64.egg/zope/interface/registry.py", line 104, in for_components
    cls._weakrefs_for_components[key] = weakref.ref(components, _cleanup)


FAILED:  five.intid.README.rst

Error Message:
Failed doctest test for README.rst

Stack Trace:
Failed doctest test for README.rst
  File "/home/jenkins/.buildout/eggs/five.intid-1.1.2-py2.7.egg/five/intid/README.rst", line 0

----------------------------------------------------------------------
File "/home/jenkins/.buildout/eggs/five.intid-1.1.2-py2.7.egg/five/intid/README.rst", line 46, in README.rst
Failed example:
    site.del_intids(self.folder, findroot=True)
Exception raised:
    Traceback (most recent call last):
      File "/usr/lib/python2.7/doctest.py", line 1315, in __run
        compileflags, 1) in test.globs
      File "<doctest README.rst[17]>", line 1, in <module>
        site.del_intids(self.folder, findroot=True)
      File "/home/jenkins/.buildout/eggs/five.intid-1.1.2-py2.7.egg/five/intid/site.py", line 114, in del_intids
        provided=IIntIds)
      File "/home/jenkins/.buildout/eggs/five.localsitemanager-2.0.5-py2.7.egg/five/localsitemanager/registry.py", line 320, in unregisterUtility
        component=component, provided=provided, name=name)
      File "/home/jenkins/.buildout/eggs/zope.interface-4.4.0-py2.7-linux-x86_64.egg/zope/interface/registry.py", line 267, in unregisterUtility
        _UtilityRegistrations.for_components(self).unregisterUtility(provided, name, component)
      File "/home/jenkins/.buildout/eggs/zope.interface-4.4.0-py2.7-linux-x86_64.egg/zope/interface/registry.py", line 104, in for_components
        cls._weakrefs_for_components[key] = weakref.ref(components, _cleanup)
    TypeError: cannot create weak reference to 'Acquisition.ImplicitAcquisitionWrapper' object
----------------------------------------------------------------------
File "/home/jenkins/.buildout/eggs/five.intid-1.1.2-py2.7.egg/five/intid/README.rst", line 47, in README.rst
Failed example:
    site.get_intids(self.app)
Expected:
    Traceback (most recent call last):
    ...
    ComponentLookupError: (<InterfaceClass ....IIntIds>, '')
Got:
    <five.intid.intid.IntIds object at 0x7f60fc398500>


  File "/usr/lib/python2.7/unittest/case.py", line 329, in run
    testMethod()
  File "/usr/lib/python2.7/doctest.py", line 2226, in runTest
    raise self.failureException(self.format_failure(new.getvalue()))


FAILED:  five.localsitemanager.localsitemanager.txt

Error Message:
Failed doctest test for localsitemanager.txt

Stack Trace:
Failed doctest test for localsitemanager.txt
  File "/home/jenkins/.buildout/eggs/five.localsitemanager-2.0.5-py2.7.egg/five/localsitemanager/localsitemanager.txt", line 0

----------------------------------------------------------------------
File "/home/jenkins/.buildout/eggs/five.localsitemanager-2.0.5-py2.7.egg/five/localsitemanager/localsitemanager.txt", line 83, in localsitemanager.txt
Failed example:
    sitemanager.unregisterUtility(utility, name='to_remove')
Exception raised:
    Traceback (most recent call last):
      File "/usr/lib/python2.7/doctest.py", line 1315, in __run
        compileflags, 1) in test.globs
      File "<doctest localsitemanager.txt[27]>", line 1, in <module>
        sitemanager.unregisterUtility(utility, name='to_remove')
      File "/home/jenkins/.buildout/eggs/five.localsitemanager-2.0.5-py2.7.egg/five/localsitemanager/registry.py", line 320, in unregisterUtility
        component=component, provided=provided, name=name)
      File "/home/jenkins/.buildout/eggs/zope.interface-4.4.0-py2.7-linux-x86_64.egg/zope/interface/registry.py", line 267, in unregisterUtility
        _UtilityRegistrations.for_components(self).unregisterUtility(provided, name, component)
      File "/home/jenkins/.buildout/eggs/zope.interface-4.4.0-py2.7-linux-x86_64.egg/zope/interface/registry.py", line 104, in for_components
        cls._weakrefs_for_components[key] = weakref.ref(components, _cleanup)
    TypeError: cannot create weak reference to 'Acquisition.ImplicitAcquisitionWrapper' object
----------------------------------------------------------------------
File "/home/jenkins/.buildout/eggs/five.localsitemanager-2.0.5-py2.7.egg/five/localsitemanager/localsitemanager.txt", line 86, in localsitemanager.txt
Failed example:
    sitemanager.getUtility(ITestUtility, name='to_remove')
Expected:
    Traceback (most recent call last):
       ...
    ComponentLookupError: (<InterfaceClass ...ITestUtility>, 'to_remove')
Got:
    <Utility TestUtility "test_to_be_removed">
----------------------------------------------------------------------
File "/home/jenkins/.buildout/eggs/five.localsitemanager-2.0.5-py2.7.egg/five/localsitemanager/localsitemanager.txt", line 184, in localsitemanager.txt
Failed example:
    len(utils)
Expected:
    3
Got:
    4
----------------------------------------------------------------------
File "/home/jenkins/.buildout/eggs/five.localsitemanager-2.0.5-py2.7.egg/five/localsitemanager/localsitemanager.txt", line 189, in localsitemanager.txt
Failed example:
    len(nonaqutils)
Expected:
    2
Got:
    3
----------------------------------------------------------------------
File "/home/jenkins/.buildout/eggs/five.localsitemanager-2.0.5-py2.7.egg/five/localsitemanager/localsitemanager.txt", line 191, in localsitemanager.txt
Failed example:
    [Acquisition.aq_parent(comp) is None for name, comp in nonaqutils]
Expected:
    [True, True]
Got:
    [True, True, True]
----------------------------------------------------------------------
File "/home/jenkins/.buildout/eggs/five.localsitemanager-2.0.5-py2.7.egg/five/localsitemanager/localsitemanager.txt", line 206, in localsitemanager.txt
Failed example:
    len(utils)
Expected:
    3
Got:
    4
----------------------------------------------------------------------
File "/home/jenkins/.buildout/eggs/five.localsitemanager-2.0.5-py2.7.egg/five/localsitemanager/localsitemanager.txt", line 210, in localsitemanager.txt
Failed example:
    len(nonaqutils)
Expected:
    2
Got:
    3
----------------------------------------------------------------------
File "/home/jenkins/.buildout/eggs/five.localsitemanager-2.0.5-py2.7.egg/five/localsitemanager/localsitemanager.txt", line 212, in localsitemanager.txt
Failed example:
    [Acquisition.aq_parent(comp) is None for comp in nonaqutils]
Expected:
    [True, True]
Got:
    [True, True, True]
----------------------------------------------------------------------
File "/home/jenkins/.buildout/eggs/five.localsitemanager-2.0.5-py2.7.egg/five/localsitemanager/localsitemanager.txt", line 224, in localsitemanager.txt
Failed example:
    sorted(sitemanager.registeredUtilities(), key=lambda x:x.name)
Expected:
    [UtilityRegistration(<PersistentComponents site>, ITestUtility, u'aq_wrapped', <Utility AQTestUtility "test">, None, u''),
     UtilityRegistration(<PersistentComponents site>, ITestUtility, u'factory_test', <Utility TestUtility "factory_test">, <function test_utility_factory at 0x...>, u''),
     UtilityRegistration(<PersistentComponents site>, ITestUtility, u'hello_world', <Utility TestUtility "test">, None, u'')]
Got:
    [UtilityRegistration(<PersistentComponents site>, ITestUtility, u'aq_wrapped', <Utility AQTestUtility "test">, None, u''), UtilityRegistration(<PersistentComponents site>, ITestUtility, u'factory_test', <Utility TestUtility "factory_test">, <function test_utility_factory at 0x7f6420a97578>, u''), UtilityRegistration(<PersistentComponents site>, ITestUtility, u'hello_world', <Utility TestUtility "test">, None, u''), UtilityRegistration(<PersistentComponents site>, ITestUtility, 'to_remove', <Utility TestUtility "test_to_be_removed">, None, u'')]
----------------------------------------------------------------------
File "/home/jenkins/.buildout/eggs/five.localsitemanager-2.0.5-py2.7.egg/five/localsitemanager/localsitemanager.txt", line 230, in localsitemanager.txt
Failed example:
    len(utils)
Expected:
    3
Got:
    4
----------------------------------------------------------------------
File "/home/jenkins/.buildout/eggs/five.localsitemanager-2.0.5-py2.7.egg/five/localsitemanager/localsitemanager.txt", line 234, in localsitemanager.txt
Failed example:
    len(nonaqutils)
Expected:
    2
Got:
    3
----------------------------------------------------------------------
File "/home/jenkins/.buildout/eggs/five.localsitemanager-2.0.5-py2.7.egg/five/localsitemanager/localsitemanager.txt", line 236, in localsitemanager.txt
Failed example:
    [Acquisition.aq_parent(comp) is None for comp in nonaqutils]
Expected:
    [True, True]
Got:
    [True, True, True]
----------------------------------------------------------------------
File "/home/jenkins/.buildout/eggs/five.localsitemanager-2.0.5-py2.7.egg/five/localsitemanager/localsitemanager.txt", line 434, in localsitemanager.txt
Failed example:
    sitemanager_a.unregisterUtility(utility,
                                    provided=ITestUtility,
                                    name=u'with_aq_chain_to_remove')
Exception raised:
    Traceback (most recent call last):
      File "/usr/lib/python2.7/doctest.py", line 1315, in __run
        compileflags, 1) in test.globs
      File "<doctest localsitemanager.txt[142]>", line 3, in <module>
        name=u'with_aq_chain_to_remove')
      File "/home/jenkins/.buildout/eggs/five.localsitemanager-2.0.5-py2.7.egg/five/localsitemanager/registry.py", line 320, in unregisterUtility
        component=component, provided=provided, name=name)
      File "/home/jenkins/.buildout/eggs/zope.interface-4.4.0-py2.7-linux-x86_64.egg/zope/interface/registry.py", line 267, in unregisterUtility
        _UtilityRegistrations.for_components(self).unregisterUtility(provided, name, component)
      File "/home/jenkins/.buildout/eggs/zope.interface-4.4.0-py2.7-linux-x86_64.egg/zope/interface/registry.py", line 104, in for_components
        cls._weakrefs_for_components[key] = weakref.ref(components, _cleanup)
    TypeError: cannot create weak reference to 'Acquisition.ImplicitAcquisitionWrapper' object
----------------------------------------------------------------------
File "/home/jenkins/.buildout/eggs/five.localsitemanager-2.0.5-py2.7.egg/five/localsitemanager/localsitemanager.txt", line 439, in localsitemanager.txt
Failed example:
    sitemanager_a.getUtility(ITestUtility,
                             name=u'with_aq_chain_to_remove')
Expected:
    Traceback (most recent call last):
       ...
    ComponentLookupError: (<InterfaceClass ...ITestUtility>, u'with_aq_chain_to_remove')
Got:
    <SITestUtility at /a/b/si_to_remove>


  File "/usr/lib/python2.7/unittest/case.py", line 329, in run
    testMethod()
  File "/usr/lib/python2.7/doctest.py", line 2226, in runTest
    raise self.failureException(self.format_failure(new.getvalue()))


More information about the Testbot mailing list