[Testbot] Plone 5.0 - Python 2.7 - Archetypes - Build # 26 - Failure!

jenkins at plone.org jenkins at plone.org
Tue May 2 00:27:30 UTC 2017


Plone 5.0 - Python 2.7 - Archetypes - Build # 26 - Failure:

Check console output at http://jenkins.plone.org/job/plone-5.0-python-2.7-at/26/ to view the results.

Changes:

[Eric Steele] AccessControl=4.0a4







Test Results:

16 tests failed.
FAILED:  Products.DateRecurringIndex.tests.Startup

Error Message:
cannot import name name_trans

Stack Trace:
cannot import name name_trans

  File "/home/jenkins/.buildout/eggs/Products.DateRecurringIndex-2.1-py2.7.egg/Products/DateRecurringIndex/tests.py", line 3, in <module>
    from Testing import ZopeTestCase as ztc
  File "/home/jenkins/.buildout/eggs/Zope2-2.13.26-py2.7.egg/Testing/ZopeTestCase/__init__.py", line 16, in <module>
    import ZopeLite as Zope2
  File "/home/jenkins/.buildout/eggs/Zope2-2.13.26-py2.7.egg/Testing/ZopeTestCase/ZopeLite.py", line 104, in <module>
    import OFS.Application
  File "/home/jenkins/.buildout/eggs/Zope2-2.13.26-py2.7.egg/OFS/Application.py", line 22, in <module>
    import App.Product
  File "/home/jenkins/.buildout/eggs/Zope2-2.13.26-py2.7.egg/App/Product.py", line 44, in <module>
    from OFS.Folder import Folder
  File "/home/jenkins/.buildout/eggs/Zope2-2.13.26-py2.7.egg/OFS/Folder.py", line 27, in <module>
    from OFS.FindSupport import FindSupport
  File "/home/jenkins/.buildout/eggs/Zope2-2.13.26-py2.7.egg/OFS/FindSupport.py", line 20, in <module>
    from AccessControl.Permission import name_trans


FAILED:  five.intid.tests.Startup

Error Message:
cannot import name name_trans

Stack Trace:
cannot import name name_trans

  File "/home/jenkins/.buildout/eggs/five.intid-1.1.2-py2.7.egg/five/intid/tests.py", line 3, in <module>
    from Testing.ZopeTestCase import placeless
  File "/home/jenkins/.buildout/eggs/Zope2-2.13.26-py2.7.egg/Testing/ZopeTestCase/__init__.py", line 16, in <module>
    import ZopeLite as Zope2
  File "/home/jenkins/.buildout/eggs/Zope2-2.13.26-py2.7.egg/Testing/ZopeTestCase/ZopeLite.py", line 104, in <module>
    import OFS.Application
  File "/home/jenkins/.buildout/eggs/Zope2-2.13.26-py2.7.egg/OFS/Application.py", line 22, in <module>
    import App.Product
  File "/home/jenkins/.buildout/eggs/Zope2-2.13.26-py2.7.egg/App/Product.py", line 44, in <module>
    from OFS.Folder import Folder
  File "/home/jenkins/.buildout/eggs/Zope2-2.13.26-py2.7.egg/OFS/Folder.py", line 27, in <module>
    from OFS.FindSupport import FindSupport
  File "/home/jenkins/.buildout/eggs/Zope2-2.13.26-py2.7.egg/OFS/FindSupport.py", line 20, in <module>
    from AccessControl.Permission import name_trans


FAILED:  five.pt.tests.test_engine.Startup

Error Message:
cannot import name name_trans

Stack Trace:
cannot import name name_trans

  File "/home/jenkins/.buildout/eggs/five.pt-2.2.4-py2.7.egg/five/pt/tests/test_engine.py", line 4, in <module>
    from Testing.ZopeTestCase import ZopeTestCase
  File "/home/jenkins/.buildout/eggs/Zope2-2.13.26-py2.7.egg/Testing/ZopeTestCase/__init__.py", line 16, in <module>
    import ZopeLite as Zope2
  File "/home/jenkins/.buildout/eggs/Zope2-2.13.26-py2.7.egg/Testing/ZopeTestCase/ZopeLite.py", line 104, in <module>
    import OFS.Application
  File "/home/jenkins/.buildout/eggs/Zope2-2.13.26-py2.7.egg/OFS/Application.py", line 22, in <module>
    import App.Product
  File "/home/jenkins/.buildout/eggs/Zope2-2.13.26-py2.7.egg/App/Product.py", line 44, in <module>
    from OFS.Folder import Folder
  File "/home/jenkins/.buildout/eggs/Zope2-2.13.26-py2.7.egg/OFS/Folder.py", line 27, in <module>
    from OFS.FindSupport import FindSupport
  File "/home/jenkins/.buildout/eggs/Zope2-2.13.26-py2.7.egg/OFS/FindSupport.py", line 20, in <module>
    from AccessControl.Permission import name_trans


FAILED:  five.pt.tests.test_pagetemplate.Startup

Error Message:
cannot import name name_trans

Stack Trace:
cannot import name name_trans

  File "/home/jenkins/.buildout/eggs/five.pt-2.2.4-py2.7.egg/five/pt/tests/test_pagetemplate.py", line 3, in <module>
    from Testing.ZopeTestCase import ZopeTestCase
  File "/home/jenkins/.buildout/eggs/Zope2-2.13.26-py2.7.egg/Testing/ZopeTestCase/__init__.py", line 16, in <module>
    import ZopeLite as Zope2
  File "/home/jenkins/.buildout/eggs/Zope2-2.13.26-py2.7.egg/Testing/ZopeTestCase/ZopeLite.py", line 104, in <module>
    import OFS.Application
  File "/home/jenkins/.buildout/eggs/Zope2-2.13.26-py2.7.egg/OFS/Application.py", line 22, in <module>
    import App.Product
  File "/home/jenkins/.buildout/eggs/Zope2-2.13.26-py2.7.egg/App/Product.py", line 44, in <module>
    from OFS.Folder import Folder
  File "/home/jenkins/.buildout/eggs/Zope2-2.13.26-py2.7.egg/OFS/Folder.py", line 27, in <module>
    from OFS.FindSupport import FindSupport
  File "/home/jenkins/.buildout/eggs/Zope2-2.13.26-py2.7.egg/OFS/FindSupport.py", line 20, in <module>
    from AccessControl.Permission import name_trans


FAILED:  five.pt.tests.test_persistenttemplate.Startup

Error Message:
cannot import name name_trans

Stack Trace:
cannot import name name_trans

  File "/home/jenkins/.buildout/eggs/five.pt-2.2.4-py2.7.egg/five/pt/tests/test_persistenttemplate.py", line 4, in <module>
    from Testing.ZopeTestCase import ZopeTestCase
  File "/home/jenkins/.buildout/eggs/Zope2-2.13.26-py2.7.egg/Testing/ZopeTestCase/__init__.py", line 16, in <module>
    import ZopeLite as Zope2
  File "/home/jenkins/.buildout/eggs/Zope2-2.13.26-py2.7.egg/Testing/ZopeTestCase/ZopeLite.py", line 104, in <module>
    import OFS.Application
  File "/home/jenkins/.buildout/eggs/Zope2-2.13.26-py2.7.egg/OFS/Application.py", line 22, in <module>
    import App.Product
  File "/home/jenkins/.buildout/eggs/Zope2-2.13.26-py2.7.egg/App/Product.py", line 44, in <module>
    from OFS.Folder import Folder
  File "/home/jenkins/.buildout/eggs/Zope2-2.13.26-py2.7.egg/OFS/Folder.py", line 27, in <module>
    from OFS.FindSupport import FindSupport
  File "/home/jenkins/.buildout/eggs/Zope2-2.13.26-py2.7.egg/OFS/FindSupport.py", line 20, in <module>
    from AccessControl.Permission import name_trans


FAILED:  five.pt.tests.test_viewpagetemplatefile.Startup

Error Message:
cannot import name name_trans

Stack Trace:
cannot import name name_trans

  File "/home/jenkins/.buildout/eggs/five.pt-2.2.4-py2.7.egg/five/pt/tests/test_viewpagetemplatefile.py", line 4, in <module>
    from Testing.ZopeTestCase import ZopeTestCase
  File "/home/jenkins/.buildout/eggs/Zope2-2.13.26-py2.7.egg/Testing/ZopeTestCase/__init__.py", line 16, in <module>
    import ZopeLite as Zope2
  File "/home/jenkins/.buildout/eggs/Zope2-2.13.26-py2.7.egg/Testing/ZopeTestCase/ZopeLite.py", line 104, in <module>
    import OFS.Application
  File "/home/jenkins/.buildout/eggs/Zope2-2.13.26-py2.7.egg/OFS/Application.py", line 22, in <module>
    import App.Product
  File "/home/jenkins/.buildout/eggs/Zope2-2.13.26-py2.7.egg/App/Product.py", line 44, in <module>
    from OFS.Folder import Folder
  File "/home/jenkins/.buildout/eggs/Zope2-2.13.26-py2.7.egg/OFS/Folder.py", line 27, in <module>
    from OFS.FindSupport import FindSupport
  File "/home/jenkins/.buildout/eggs/Zope2-2.13.26-py2.7.egg/OFS/FindSupport.py", line 20, in <module>
    from AccessControl.Permission import name_trans


FAILED:  plone.app.blob.tests.test_adapters.Startup

Error Message:
cannot import name name_trans

Stack Trace:
cannot import name name_trans

  File "/home/jenkins/.buildout/eggs/plone.app.blob-1.7-py2.7.egg/plone/app/blob/tests/test_adapters.py", line 4, in <module>
    from plone.app.blob.interfaces import IBlobbable
  File "/home/jenkins/.buildout/eggs/plone.app.blob-1.7-py2.7.egg/plone/app/blob/interfaces.py", line 2, in <module>
    from Products.CMFPlone import PloneMessageFactory as _
  File "/home/jenkins/workspace/plone-5.0-python-2.7-at/src/Products.CMFPlone/Products/CMFPlone/__init__.py", line 228, in <module>
    from Products.CMFPlone import earlypatches  # noqa
  File "/home/jenkins/workspace/plone-5.0-python-2.7-at/src/Products.CMFPlone/Products/CMFPlone/earlypatches/__init__.py", line 2, in <module>
    import security  # noqa
  File "/home/jenkins/workspace/plone-5.0-python-2.7-at/src/Products.CMFPlone/Products/CMFPlone/earlypatches/security.py", line 80, in <module>
    from Products.CMFCore import utils
  File "/home/jenkins/.buildout/eggs/Products.CMFCore-2.2.10-py2.7.egg/Products/CMFCore/__init__.py", line 15, in <module>
    import PortalFolder
  File "/home/jenkins/.buildout/eggs/Products.CMFCore-2.2.10-py2.7.egg/Products/CMFCore/PortalFolder.py", line 24, in <module>
    from OFS.Folder import Folder
  File "/home/jenkins/.buildout/eggs/Zope2-2.13.26-py2.7.egg/OFS/Folder.py", line 27, in <module>
    from OFS.FindSupport import FindSupport
  File "/home/jenkins/.buildout/eggs/Zope2-2.13.26-py2.7.egg/OFS/FindSupport.py", line 20, in <module>
    from AccessControl.Permission import name_trans


FAILED:  plone.app.blob.tests.test_base_fields.Startup

Error Message:
cannot import name name_trans

Stack Trace:
cannot import name name_trans

  File "/home/jenkins/.buildout/eggs/plone.app.blob-1.7-py2.7.egg/plone/app/blob/tests/test_base_fields.py", line 4, in <module>
    from plone.app.blob.field import FileField
  File "/home/jenkins/.buildout/eggs/plone.app.blob-1.7-py2.7.egg/plone/app/blob/field.py", line 12, in <module>
    from plone.app.blob.interfaces import IBlobbable
  File "/home/jenkins/.buildout/eggs/plone.app.blob-1.7-py2.7.egg/plone/app/blob/interfaces.py", line 2, in <module>
    from Products.CMFPlone import PloneMessageFactory as _
  File "/home/jenkins/workspace/plone-5.0-python-2.7-at/src/Products.CMFPlone/Products/CMFPlone/__init__.py", line 228, in <module>
    from Products.CMFPlone import earlypatches  # noqa
  File "/home/jenkins/workspace/plone-5.0-python-2.7-at/src/Products.CMFPlone/Products/CMFPlone/earlypatches/__init__.py", line 2, in <module>
    import security  # noqa
  File "/home/jenkins/workspace/plone-5.0-python-2.7-at/src/Products.CMFPlone/Products/CMFPlone/earlypatches/security.py", line 80, in <module>
    from Products.CMFCore import utils
  File "/home/jenkins/.buildout/eggs/Products.CMFCore-2.2.10-py2.7.egg/Products/CMFCore/__init__.py", line 15, in <module>
    import PortalFolder
  File "/home/jenkins/.buildout/eggs/Products.CMFCore-2.2.10-py2.7.egg/Products/CMFCore/PortalFolder.py", line 24, in <module>
    from OFS.Folder import Folder
  File "/home/jenkins/.buildout/eggs/Zope2-2.13.26-py2.7.egg/OFS/Folder.py", line 27, in <module>
    from OFS.FindSupport import FindSupport
  File "/home/jenkins/.buildout/eggs/Zope2-2.13.26-py2.7.egg/OFS/FindSupport.py", line 20, in <module>
    from AccessControl.Permission import name_trans


FAILED:  plone.app.blob.tests.test_doctests.Startup

Error Message:
cannot import name name_trans

Stack Trace:
cannot import name name_trans

  File "/home/jenkins/.buildout/eggs/plone.app.blob-1.7-py2.7.egg/plone/app/blob/tests/test_doctests.py", line 2, in <module>
    from plone.app.blob.tests.layer import BlobLayer
  File "/home/jenkins/.buildout/eggs/plone.app.blob-1.7-py2.7.egg/plone/app/blob/tests/layer.py", line 4, in <module>
    from plone.app.testing.bbb import PloneTestCaseFixture
  File "/home/jenkins/.buildout/eggs/plone.app.testing-5.0.6-py2.7.egg/plone/app/testing/bbb.py", line 7, in <module>
    from Products.CMFPlone.utils import _createObjectByType
  File "/home/jenkins/workspace/plone-5.0-python-2.7-at/src/Products.CMFPlone/Products/CMFPlone/__init__.py", line 228, in <module>
    from Products.CMFPlone import earlypatches  # noqa
  File "/home/jenkins/workspace/plone-5.0-python-2.7-at/src/Products.CMFPlone/Products/CMFPlone/earlypatches/__init__.py", line 2, in <module>
    import security  # noqa
  File "/home/jenkins/workspace/plone-5.0-python-2.7-at/src/Products.CMFPlone/Products/CMFPlone/earlypatches/security.py", line 80, in <module>
    from Products.CMFCore import utils
  File "/home/jenkins/.buildout/eggs/Products.CMFCore-2.2.10-py2.7.egg/Products/CMFCore/__init__.py", line 15, in <module>
    import PortalFolder
  File "/home/jenkins/.buildout/eggs/Products.CMFCore-2.2.10-py2.7.egg/Products/CMFCore/PortalFolder.py", line 24, in <module>
    from OFS.Folder import Folder
  File "/home/jenkins/.buildout/eggs/Zope2-2.13.26-py2.7.egg/OFS/Folder.py", line 27, in <module>
    from OFS.FindSupport import FindSupport
  File "/home/jenkins/.buildout/eggs/Zope2-2.13.26-py2.7.egg/OFS/FindSupport.py", line 20, in <module>
    from AccessControl.Permission import name_trans


FAILED:  plone.app.blob.tests.test_integration.Startup

Error Message:
cannot import name name_trans

Stack Trace:
cannot import name name_trans

  File "/home/jenkins/.buildout/eggs/plone.app.blob-1.7-py2.7.egg/plone/app/blob/tests/test_integration.py", line 3, in <module>
    from plone.app.blob.tests.base import BlobFunctionalTestCase
  File "/home/jenkins/.buildout/eggs/plone.app.blob-1.7-py2.7.egg/plone/app/blob/tests/base.py", line 2, in <module>
    from plone.app.blob.tests.layer import BlobLayer
  File "/home/jenkins/.buildout/eggs/plone.app.blob-1.7-py2.7.egg/plone/app/blob/tests/layer.py", line 4, in <module>
    from plone.app.testing.bbb import PloneTestCaseFixture
  File "/home/jenkins/.buildout/eggs/plone.app.testing-5.0.6-py2.7.egg/plone/app/testing/bbb.py", line 7, in <module>
    from Products.CMFPlone.utils import _createObjectByType
  File "/home/jenkins/workspace/plone-5.0-python-2.7-at/src/Products.CMFPlone/Products/CMFPlone/__init__.py", line 228, in <module>
    from Products.CMFPlone import earlypatches  # noqa
  File "/home/jenkins/workspace/plone-5.0-python-2.7-at/src/Products.CMFPlone/Products/CMFPlone/earlypatches/__init__.py", line 2, in <module>
    import security  # noqa
  File "/home/jenkins/workspace/plone-5.0-python-2.7-at/src/Products.CMFPlone/Products/CMFPlone/earlypatches/security.py", line 80, in <module>
    from Products.CMFCore import utils
  File "/home/jenkins/.buildout/eggs/Products.CMFCore-2.2.10-py2.7.egg/Products/CMFCore/__init__.py", line 15, in <module>
    import PortalFolder
  File "/home/jenkins/.buildout/eggs/Products.CMFCore-2.2.10-py2.7.egg/Products/CMFCore/PortalFolder.py", line 24, in <module>
    from OFS.Folder import Folder
  File "/home/jenkins/.buildout/eggs/Zope2-2.13.26-py2.7.egg/OFS/Folder.py", line 27, in <module>
    from OFS.FindSupport import FindSupport
  File "/home/jenkins/.buildout/eggs/Zope2-2.13.26-py2.7.egg/OFS/FindSupport.py", line 20, in <module>
    from AccessControl.Permission import name_trans


FAILED:  plone.app.blob.tests.test_linguaplone.Startup

Error Message:
cannot import name name_trans

Stack Trace:
cannot import name name_trans

  File "/home/jenkins/.buildout/eggs/plone.app.blob-1.7-py2.7.egg/plone/app/blob/tests/test_linguaplone.py", line 3, in <module>
    from plone.app.blob.tests.base import BlobLinguaTestCase
  File "/home/jenkins/.buildout/eggs/plone.app.blob-1.7-py2.7.egg/plone/app/blob/tests/base.py", line 2, in <module>
    from plone.app.blob.tests.layer import BlobLayer
  File "/home/jenkins/.buildout/eggs/plone.app.blob-1.7-py2.7.egg/plone/app/blob/tests/layer.py", line 4, in <module>
    from plone.app.testing.bbb import PloneTestCaseFixture
  File "/home/jenkins/.buildout/eggs/plone.app.testing-5.0.6-py2.7.egg/plone/app/testing/bbb.py", line 7, in <module>
    from Products.CMFPlone.utils import _createObjectByType
  File "/home/jenkins/workspace/plone-5.0-python-2.7-at/src/Products.CMFPlone/Products/CMFPlone/__init__.py", line 228, in <module>
    from Products.CMFPlone import earlypatches  # noqa
  File "/home/jenkins/workspace/plone-5.0-python-2.7-at/src/Products.CMFPlone/Products/CMFPlone/earlypatches/__init__.py", line 2, in <module>
    import security  # noqa
  File "/home/jenkins/workspace/plone-5.0-python-2.7-at/src/Products.CMFPlone/Products/CMFPlone/earlypatches/security.py", line 80, in <module>
    from Products.CMFCore import utils
  File "/home/jenkins/.buildout/eggs/Products.CMFCore-2.2.10-py2.7.egg/Products/CMFCore/__init__.py", line 15, in <module>
    import PortalFolder
  File "/home/jenkins/.buildout/eggs/Products.CMFCore-2.2.10-py2.7.egg/Products/CMFCore/PortalFolder.py", line 24, in <module>
    from OFS.Folder import Folder
  File "/home/jenkins/.buildout/eggs/Zope2-2.13.26-py2.7.egg/OFS/Folder.py", line 27, in <module>
    from OFS.FindSupport import FindSupport
  File "/home/jenkins/.buildout/eggs/Zope2-2.13.26-py2.7.egg/OFS/FindSupport.py", line 20, in <module>
    from AccessControl.Permission import name_trans


FAILED:  plone.app.blob.tests.test_maintenance.Startup

Error Message:
cannot import name name_trans

Stack Trace:
cannot import name name_trans

  File "/home/jenkins/.buildout/eggs/plone.app.blob-1.7-py2.7.egg/plone/app/blob/tests/test_maintenance.py", line 2, in <module>
    from plone.app.blob.markings import unmarkAs
  File "/home/jenkins/.buildout/eggs/plone.app.blob-1.7-py2.7.egg/plone/app/blob/markings.py", line 5, in <module>
    from plone.app.blob.interfaces import IATBlobBlob
  File "/home/jenkins/.buildout/eggs/plone.app.blob-1.7-py2.7.egg/plone/app/blob/interfaces.py", line 2, in <module>
    from Products.CMFPlone import PloneMessageFactory as _
  File "/home/jenkins/workspace/plone-5.0-python-2.7-at/src/Products.CMFPlone/Products/CMFPlone/__init__.py", line 228, in <module>
    from Products.CMFPlone import earlypatches  # noqa
  File "/home/jenkins/workspace/plone-5.0-python-2.7-at/src/Products.CMFPlone/Products/CMFPlone/earlypatches/__init__.py", line 2, in <module>
    import security  # noqa
  File "/home/jenkins/workspace/plone-5.0-python-2.7-at/src/Products.CMFPlone/Products/CMFPlone/earlypatches/security.py", line 80, in <module>
    from Products.CMFCore import utils
  File "/home/jenkins/.buildout/eggs/Products.CMFCore-2.2.10-py2.7.egg/Products/CMFCore/__init__.py", line 15, in <module>
    import PortalFolder
  File "/home/jenkins/.buildout/eggs/Products.CMFCore-2.2.10-py2.7.egg/Products/CMFCore/PortalFolder.py", line 24, in <module>
    from OFS.Folder import Folder
  File "/home/jenkins/.buildout/eggs/Zope2-2.13.26-py2.7.egg/OFS/Folder.py", line 27, in <module>
    from OFS.FindSupport import FindSupport
  File "/home/jenkins/.buildout/eggs/Zope2-2.13.26-py2.7.egg/OFS/FindSupport.py", line 20, in <module>
    from AccessControl.Permission import name_trans


FAILED:  plone.app.blob.tests.test_replacements.Startup

Error Message:
cannot import name name_trans

Stack Trace:
cannot import name name_trans

  File "/home/jenkins/.buildout/eggs/plone.app.blob-1.7-py2.7.egg/plone/app/blob/tests/test_replacements.py", line 2, in <module>
    from plone.app.blob.content import ATBlob
  File "/home/jenkins/.buildout/eggs/plone.app.blob-1.7-py2.7.egg/plone/app/blob/content.py", line 6, in <module>
    from plone.app.blob.field import BlobMarshaller
  File "/home/jenkins/.buildout/eggs/plone.app.blob-1.7-py2.7.egg/plone/app/blob/field.py", line 12, in <module>
    from plone.app.blob.interfaces import IBlobbable
  File "/home/jenkins/.buildout/eggs/plone.app.blob-1.7-py2.7.egg/plone/app/blob/interfaces.py", line 2, in <module>
    from Products.CMFPlone import PloneMessageFactory as _
  File "/home/jenkins/workspace/plone-5.0-python-2.7-at/src/Products.CMFPlone/Products/CMFPlone/__init__.py", line 228, in <module>
    from Products.CMFPlone import earlypatches  # noqa
  File "/home/jenkins/workspace/plone-5.0-python-2.7-at/src/Products.CMFPlone/Products/CMFPlone/earlypatches/__init__.py", line 2, in <module>
    import security  # noqa
  File "/home/jenkins/workspace/plone-5.0-python-2.7-at/src/Products.CMFPlone/Products/CMFPlone/earlypatches/security.py", line 80, in <module>
    from Products.CMFCore import utils
  File "/home/jenkins/.buildout/eggs/Products.CMFCore-2.2.10-py2.7.egg/Products/CMFCore/__init__.py", line 15, in <module>
    import PortalFolder
  File "/home/jenkins/.buildout/eggs/Products.CMFCore-2.2.10-py2.7.egg/Products/CMFCore/PortalFolder.py", line 24, in <module>
    from OFS.Folder import Folder
  File "/home/jenkins/.buildout/eggs/Zope2-2.13.26-py2.7.egg/OFS/Folder.py", line 27, in <module>
    from OFS.FindSupport import FindSupport
  File "/home/jenkins/.buildout/eggs/Zope2-2.13.26-py2.7.egg/OFS/FindSupport.py", line 20, in <module>
    from AccessControl.Permission import name_trans


FAILED:  plone.app.blob.tests.test_scaling.Startup

Error Message:
cannot import name name_trans

Stack Trace:
cannot import name name_trans

  File "/home/jenkins/.buildout/eggs/plone.app.blob-1.7-py2.7.egg/plone/app/blob/tests/test_scaling.py", line 4, in <module>
    from plone.app.blob.scale import BlobImageScaleHandler
  File "/home/jenkins/.buildout/eggs/plone.app.blob-1.7-py2.7.egg/plone/app/blob/scale.py", line 5, in <module>
    from plone.app.blob.interfaces import IBlobImageField
  File "/home/jenkins/.buildout/eggs/plone.app.blob-1.7-py2.7.egg/plone/app/blob/interfaces.py", line 2, in <module>
    from Products.CMFPlone import PloneMessageFactory as _
  File "/home/jenkins/workspace/plone-5.0-python-2.7-at/src/Products.CMFPlone/Products/CMFPlone/__init__.py", line 228, in <module>
    from Products.CMFPlone import earlypatches  # noqa
  File "/home/jenkins/workspace/plone-5.0-python-2.7-at/src/Products.CMFPlone/Products/CMFPlone/earlypatches/__init__.py", line 2, in <module>
    import security  # noqa
  File "/home/jenkins/workspace/plone-5.0-python-2.7-at/src/Products.CMFPlone/Products/CMFPlone/earlypatches/security.py", line 80, in <module>
    from Products.CMFCore import utils
  File "/home/jenkins/.buildout/eggs/Products.CMFCore-2.2.10-py2.7.egg/Products/CMFCore/__init__.py", line 15, in <module>
    import PortalFolder
  File "/home/jenkins/.buildout/eggs/Products.CMFCore-2.2.10-py2.7.egg/Products/CMFCore/PortalFolder.py", line 24, in <module>
    from OFS.Folder import Folder
  File "/home/jenkins/.buildout/eggs/Zope2-2.13.26-py2.7.egg/OFS/Folder.py", line 27, in <module>
    from OFS.FindSupport import FindSupport
  File "/home/jenkins/.buildout/eggs/Zope2-2.13.26-py2.7.egg/OFS/FindSupport.py", line 20, in <module>
    from AccessControl.Permission import name_trans


FAILED:  plone.app.blob.tests.test_utils.Startup

Error Message:
cannot import name name_trans

Stack Trace:
cannot import name name_trans

  File "/home/jenkins/.buildout/eggs/plone.app.blob-1.7-py2.7.egg/plone/app/blob/tests/test_utils.py", line 2, in <module>
    from plone.app.blob import utils
  File "/home/jenkins/.buildout/eggs/plone.app.blob-1.7-py2.7.egg/plone/app/blob/utils.py", line 3, in <module>
    from Products.MimetypesRegistry.interfaces import IMimetypesRegistryTool
  File "/home/jenkins/.buildout/eggs/Products.MimetypesRegistry-2.0.10-py2.7.egg/Products/MimetypesRegistry/__init__.py", line 2, in <module>
    from Products.MimetypesRegistry import MimeTypesRegistry
  File "/home/jenkins/.buildout/eggs/Products.MimetypesRegistry-2.0.10-py2.7.egg/Products/MimetypesRegistry/MimeTypesRegistry.py", line 5, in <module>
    from OFS.Folder import Folder
  File "/home/jenkins/.buildout/eggs/Zope2-2.13.26-py2.7.egg/OFS/Folder.py", line 27, in <module>
    from OFS.FindSupport import FindSupport
  File "/home/jenkins/.buildout/eggs/Zope2-2.13.26-py2.7.egg/OFS/FindSupport.py", line 20, in <module>
    from AccessControl.Permission import name_trans


FAILED:  plone.app.blob.tests.test_webdav.Startup

Error Message:
cannot import name name_trans

Stack Trace:
cannot import name name_trans

  File "/home/jenkins/.buildout/eggs/plone.app.blob-1.7-py2.7.egg/plone/app/blob/tests/test_webdav.py", line 2, in <module>
    from plone.app.blob.interfaces import IATBlobImage
  File "/home/jenkins/.buildout/eggs/plone.app.blob-1.7-py2.7.egg/plone/app/blob/interfaces.py", line 2, in <module>
    from Products.CMFPlone import PloneMessageFactory as _
  File "/home/jenkins/workspace/plone-5.0-python-2.7-at/src/Products.CMFPlone/Products/CMFPlone/__init__.py", line 228, in <module>
    from Products.CMFPlone import earlypatches  # noqa
  File "/home/jenkins/workspace/plone-5.0-python-2.7-at/src/Products.CMFPlone/Products/CMFPlone/earlypatches/__init__.py", line 2, in <module>
    import security  # noqa
  File "/home/jenkins/workspace/plone-5.0-python-2.7-at/src/Products.CMFPlone/Products/CMFPlone/earlypatches/security.py", line 80, in <module>
    from Products.CMFCore import utils
  File "/home/jenkins/.buildout/eggs/Products.CMFCore-2.2.10-py2.7.egg/Products/CMFCore/__init__.py", line 15, in <module>
    import PortalFolder
  File "/home/jenkins/.buildout/eggs/Products.CMFCore-2.2.10-py2.7.egg/Products/CMFCore/PortalFolder.py", line 24, in <module>
    from OFS.Folder import Folder
  File "/home/jenkins/.buildout/eggs/Zope2-2.13.26-py2.7.egg/OFS/Folder.py", line 27, in <module>
    from OFS.FindSupport import FindSupport
  File "/home/jenkins/.buildout/eggs/Zope2-2.13.26-py2.7.egg/OFS/FindSupport.py", line 20, in <module>
    from AccessControl.Permission import name_trans


More information about the Testbot mailing list