[Testbot] Plone 5.0 - Python 2.7 - Build # 26 - Failure!

jenkins at plone.org jenkins at plone.org
Tue May 2 00:27:23 UTC 2017


Plone 5.0 - Python 2.7 - Build # 26 - Failure:

Check console output at http://jenkins.plone.org/job/plone-5.0-python-2.7/26/ to view the results.

Changes:

[Eric Steele] AccessControl=4.0a4







Test Results:

17 tests failed.
FAILED:  AuthEncoding.tests.test_AuthEncoding.Startup

Error Message:
No module named pytest

Stack Trace:
No module named pytest

  File "/home/jenkins/.buildout/eggs/AuthEncoding-4.0.0-py2.7.egg/AuthEncoding/tests/test_AuthEncoding.py", line 19, in <module>
    import pytest


FAILED:  plone.app.lockingbehavior.tests.test_locking.Startup

Error Message:
cannot import name name_trans

Stack Trace:
cannot import name name_trans

  File "/home/jenkins/.buildout/eggs/plone.app.lockingbehavior-1.0.5-py2.7.egg/plone/app/lockingbehavior/tests/test_locking.py", line 10, in <module>
    from plone.dexterity.fti import DexterityFTI
  File "/home/jenkins/.buildout/eggs/plone.dexterity-2.4.5-py2.7.egg/plone/dexterity/__init__.py", line 3, in <module>
    import schema  # noqa
  File "/home/jenkins/.buildout/eggs/plone.dexterity-2.4.5-py2.7.egg/plone/dexterity/schema.py", line 2, in <module>
    from Products.CMFCore.interfaces import ISiteRoot
  File "/home/jenkins/.buildout/eggs/Products.CMFCore-2.2.10-py2.7.egg/Products/CMFCore/__init__.py", line 15, in <module>
    import PortalFolder
  File "/home/jenkins/.buildout/eggs/Products.CMFCore-2.2.10-py2.7.egg/Products/CMFCore/PortalFolder.py", line 24, in <module>
    from OFS.Folder import Folder
  File "/home/jenkins/.buildout/eggs/Zope2-2.13.26-py2.7.egg/OFS/Folder.py", line 27, in <module>
    from OFS.FindSupport import FindSupport
  File "/home/jenkins/.buildout/eggs/Zope2-2.13.26-py2.7.egg/OFS/FindSupport.py", line 20, in <module>
    from AccessControl.Permission import name_trans


FAILED:  plone.app.multilingual.tests.test_alternates.Startup

Error Message:
cannot import name name_trans

Stack Trace:
cannot import name name_trans

  File "/home/jenkins/workspace/plone-5.0-python-2.7/src/plone.app.multilingual/src/plone/app/multilingual/tests/test_alternates.py", line 2, in <module>
    from plone.app.multilingual import api
  File "/home/jenkins/workspace/plone-5.0-python-2.7/src/plone.app.multilingual/src/plone/app/multilingual/api.py", line 2, in <module>
    from plone.app.multilingual.interfaces import ITG
  File "/home/jenkins/workspace/plone-5.0-python-2.7/src/plone.app.multilingual/src/plone/app/multilingual/interfaces.py", line 8, in <module>
    from Products.CMFPlone.interfaces import ILanguageSchema
  File "/home/jenkins/workspace/plone-5.0-python-2.7/src/Products.CMFPlone/Products/CMFPlone/__init__.py", line 228, in <module>
    from Products.CMFPlone import earlypatches  # noqa
  File "/home/jenkins/workspace/plone-5.0-python-2.7/src/Products.CMFPlone/Products/CMFPlone/earlypatches/__init__.py", line 2, in <module>
    import security  # noqa
  File "/home/jenkins/workspace/plone-5.0-python-2.7/src/Products.CMFPlone/Products/CMFPlone/earlypatches/security.py", line 80, in <module>
    from Products.CMFCore import utils
  File "/home/jenkins/.buildout/eggs/Products.CMFCore-2.2.10-py2.7.egg/Products/CMFCore/__init__.py", line 15, in <module>
    import PortalFolder
  File "/home/jenkins/.buildout/eggs/Products.CMFCore-2.2.10-py2.7.egg/Products/CMFCore/PortalFolder.py", line 24, in <module>
    from OFS.Folder import Folder
  File "/home/jenkins/.buildout/eggs/Zope2-2.13.26-py2.7.egg/OFS/Folder.py", line 27, in <module>
    from OFS.FindSupport import FindSupport
  File "/home/jenkins/.buildout/eggs/Zope2-2.13.26-py2.7.egg/OFS/FindSupport.py", line 20, in <module>
    from AccessControl.Permission import name_trans


FAILED:  plone.app.multilingual.tests.test_api.Startup

Error Message:
cannot import name name_trans

Stack Trace:
cannot import name name_trans

  File "/home/jenkins/workspace/plone-5.0-python-2.7/src/plone.app.multilingual/src/plone/app/multilingual/tests/test_api.py", line 3, in <module>
    from Products.CMFCore.utils import getToolByName
  File "/home/jenkins/.buildout/eggs/Products.CMFCore-2.2.10-py2.7.egg/Products/CMFCore/__init__.py", line 15, in <module>
    import PortalFolder
  File "/home/jenkins/.buildout/eggs/Products.CMFCore-2.2.10-py2.7.egg/Products/CMFCore/PortalFolder.py", line 24, in <module>
    from OFS.Folder import Folder
  File "/home/jenkins/.buildout/eggs/Zope2-2.13.26-py2.7.egg/OFS/Folder.py", line 27, in <module>
    from OFS.FindSupport import FindSupport
  File "/home/jenkins/.buildout/eggs/Zope2-2.13.26-py2.7.egg/OFS/FindSupport.py", line 20, in <module>
    from AccessControl.Permission import name_trans


FAILED:  plone.app.multilingual.tests.test_catalog.Startup

Error Message:
cannot import name name_trans

Stack Trace:
cannot import name name_trans

  File "/home/jenkins/workspace/plone-5.0-python-2.7/src/plone.app.multilingual/src/plone/app/multilingual/tests/test_catalog.py", line 2, in <module>
    from Products.CMFCore.utils import getToolByName
  File "/home/jenkins/.buildout/eggs/Products.CMFCore-2.2.10-py2.7.egg/Products/CMFCore/__init__.py", line 15, in <module>
    import PortalFolder
  File "/home/jenkins/.buildout/eggs/Products.CMFCore-2.2.10-py2.7.egg/Products/CMFCore/PortalFolder.py", line 24, in <module>
    from OFS.Folder import Folder
  File "/home/jenkins/.buildout/eggs/Zope2-2.13.26-py2.7.egg/OFS/Folder.py", line 27, in <module>
    from OFS.FindSupport import FindSupport
  File "/home/jenkins/.buildout/eggs/Zope2-2.13.26-py2.7.egg/OFS/FindSupport.py", line 20, in <module>
    from AccessControl.Permission import name_trans


FAILED:  plone.app.multilingual.tests.test_directives.Startup

Error Message:
cannot import name name_trans

Stack Trace:
cannot import name name_trans

  File "/home/jenkins/workspace/plone-5.0-python-2.7/src/plone.app.multilingual/src/plone/app/multilingual/tests/test_directives.py", line 2, in <module>
    from plone.app.multilingual.dx.directives import languageindependent
  File "/home/jenkins/workspace/plone-5.0-python-2.7/src/plone.app.multilingual/src/plone/app/multilingual/dx/directives.py", line 2, in <module>
    from plone.app.multilingual.dx.interfaces import ILanguageIndependentField
  File "/home/jenkins/workspace/plone-5.0-python-2.7/src/plone.app.multilingual/src/plone/app/multilingual/dx/interfaces.py", line 2, in <module>
    from plone.app.multilingual.interfaces import ITranslatable
  File "/home/jenkins/workspace/plone-5.0-python-2.7/src/plone.app.multilingual/src/plone/app/multilingual/interfaces.py", line 8, in <module>
    from Products.CMFPlone.interfaces import ILanguageSchema
  File "/home/jenkins/workspace/plone-5.0-python-2.7/src/Products.CMFPlone/Products/CMFPlone/__init__.py", line 228, in <module>
    from Products.CMFPlone import earlypatches  # noqa
  File "/home/jenkins/workspace/plone-5.0-python-2.7/src/Products.CMFPlone/Products/CMFPlone/earlypatches/__init__.py", line 2, in <module>
    import security  # noqa
  File "/home/jenkins/workspace/plone-5.0-python-2.7/src/Products.CMFPlone/Products/CMFPlone/earlypatches/security.py", line 80, in <module>
    from Products.CMFCore import utils
  File "/home/jenkins/.buildout/eggs/Products.CMFCore-2.2.10-py2.7.egg/Products/CMFCore/__init__.py", line 15, in <module>
    import PortalFolder
  File "/home/jenkins/.buildout/eggs/Products.CMFCore-2.2.10-py2.7.egg/Products/CMFCore/PortalFolder.py", line 24, in <module>
    from OFS.Folder import Folder
  File "/home/jenkins/.buildout/eggs/Zope2-2.13.26-py2.7.egg/OFS/Folder.py", line 27, in <module>
    from OFS.FindSupport import FindSupport
  File "/home/jenkins/.buildout/eggs/Zope2-2.13.26-py2.7.egg/OFS/FindSupport.py", line 20, in <module>
    from AccessControl.Permission import name_trans


FAILED:  plone.app.multilingual.tests.test_form.Startup

Error Message:
cannot import name name_trans

Stack Trace:
cannot import name name_trans

  File "/home/jenkins/workspace/plone-5.0-python-2.7/src/plone.app.multilingual/src/plone/app/multilingual/tests/test_form.py", line 2, in <module>
    from plone.app.multilingual.testing import PAM_FUNCTIONAL_TESTING
  File "/home/jenkins/workspace/plone-5.0-python-2.7/src/plone.app.multilingual/src/plone/app/multilingual/testing.py", line 2, in <module>
    from Products.CMFCore.utils import getToolByName
  File "/home/jenkins/.buildout/eggs/Products.CMFCore-2.2.10-py2.7.egg/Products/CMFCore/__init__.py", line 15, in <module>
    import PortalFolder
  File "/home/jenkins/.buildout/eggs/Products.CMFCore-2.2.10-py2.7.egg/Products/CMFCore/PortalFolder.py", line 24, in <module>
    from OFS.Folder import Folder
  File "/home/jenkins/.buildout/eggs/Zope2-2.13.26-py2.7.egg/OFS/Folder.py", line 27, in <module>
    from OFS.FindSupport import FindSupport
  File "/home/jenkins/.buildout/eggs/Zope2-2.13.26-py2.7.egg/OFS/FindSupport.py", line 20, in <module>
    from AccessControl.Permission import name_trans


FAILED:  plone.app.multilingual.tests.test_helper_views.Startup

Error Message:
cannot import name name_trans

Stack Trace:
cannot import name name_trans

  File "/home/jenkins/workspace/plone-5.0-python-2.7/src/plone.app.multilingual/src/plone/app/multilingual/tests/test_helper_views.py", line 2, in <module>
    from plone.app.multilingual import api
  File "/home/jenkins/workspace/plone-5.0-python-2.7/src/plone.app.multilingual/src/plone/app/multilingual/api.py", line 2, in <module>
    from plone.app.multilingual.interfaces import ITG
  File "/home/jenkins/workspace/plone-5.0-python-2.7/src/plone.app.multilingual/src/plone/app/multilingual/interfaces.py", line 8, in <module>
    from Products.CMFPlone.interfaces import ILanguageSchema
  File "/home/jenkins/workspace/plone-5.0-python-2.7/src/Products.CMFPlone/Products/CMFPlone/__init__.py", line 228, in <module>
    from Products.CMFPlone import earlypatches  # noqa
  File "/home/jenkins/workspace/plone-5.0-python-2.7/src/Products.CMFPlone/Products/CMFPlone/earlypatches/__init__.py", line 2, in <module>
    import security  # noqa
  File "/home/jenkins/workspace/plone-5.0-python-2.7/src/Products.CMFPlone/Products/CMFPlone/earlypatches/security.py", line 80, in <module>
    from Products.CMFCore import utils
  File "/home/jenkins/.buildout/eggs/Products.CMFCore-2.2.10-py2.7.egg/Products/CMFCore/__init__.py", line 15, in <module>
    import PortalFolder
  File "/home/jenkins/.buildout/eggs/Products.CMFCore-2.2.10-py2.7.egg/Products/CMFCore/PortalFolder.py", line 24, in <module>
    from OFS.Folder import Folder
  File "/home/jenkins/.buildout/eggs/Zope2-2.13.26-py2.7.egg/OFS/Folder.py", line 27, in <module>
    from OFS.FindSupport import FindSupport
  File "/home/jenkins/.buildout/eggs/Zope2-2.13.26-py2.7.egg/OFS/FindSupport.py", line 20, in <module>
    from AccessControl.Permission import name_trans


FAILED:  plone.app.multilingual.tests.test_lif.Startup

Error Message:
cannot import name name_trans

Stack Trace:
cannot import name name_trans

  File "/home/jenkins/workspace/plone-5.0-python-2.7/src/plone.app.multilingual/src/plone/app/multilingual/tests/test_lif.py", line 2, in <module>
    from Products.CMFCore.utils import getToolByName
  File "/home/jenkins/.buildout/eggs/Products.CMFCore-2.2.10-py2.7.egg/Products/CMFCore/__init__.py", line 15, in <module>
    import PortalFolder
  File "/home/jenkins/.buildout/eggs/Products.CMFCore-2.2.10-py2.7.egg/Products/CMFCore/PortalFolder.py", line 24, in <module>
    from OFS.Folder import Folder
  File "/home/jenkins/.buildout/eggs/Zope2-2.13.26-py2.7.egg/OFS/Folder.py", line 27, in <module>
    from OFS.FindSupport import FindSupport
  File "/home/jenkins/.buildout/eggs/Zope2-2.13.26-py2.7.egg/OFS/FindSupport.py", line 20, in <module>
    from AccessControl.Permission import name_trans


FAILED:  plone.app.multilingual.tests.test_lrf.Startup

Error Message:
cannot import name name_trans

Stack Trace:
cannot import name name_trans

  File "/home/jenkins/workspace/plone-5.0-python-2.7/src/plone.app.multilingual/src/plone/app/multilingual/tests/test_lrf.py", line 3, in <module>
    from plone.app.multilingual.browser.utils import is_language_independent
  File "/home/jenkins/workspace/plone-5.0-python-2.7/src/plone.app.multilingual/src/plone/app/multilingual/browser/utils.py", line 6, in <module>
    from Products.CMFCore.utils import getToolByName
  File "/home/jenkins/.buildout/eggs/Products.CMFCore-2.2.10-py2.7.egg/Products/CMFCore/__init__.py", line 15, in <module>
    import PortalFolder
  File "/home/jenkins/.buildout/eggs/Products.CMFCore-2.2.10-py2.7.egg/Products/CMFCore/PortalFolder.py", line 24, in <module>
    from OFS.Folder import Folder
  File "/home/jenkins/.buildout/eggs/Zope2-2.13.26-py2.7.egg/OFS/Folder.py", line 27, in <module>
    from OFS.FindSupport import FindSupport
  File "/home/jenkins/.buildout/eggs/Zope2-2.13.26-py2.7.egg/OFS/FindSupport.py", line 20, in <module>
    from AccessControl.Permission import name_trans


FAILED:  plone.app.multilingual.tests.test_menu.Startup

Error Message:
cannot import name name_trans

Stack Trace:
cannot import name name_trans

  File "/home/jenkins/workspace/plone-5.0-python-2.7/src/plone.app.multilingual/src/plone/app/multilingual/tests/test_menu.py", line 2, in <module>
    from plone.app.multilingual.testing import PAM_FUNCTIONAL_TESTING
  File "/home/jenkins/workspace/plone-5.0-python-2.7/src/plone.app.multilingual/src/plone/app/multilingual/testing.py", line 2, in <module>
    from Products.CMFCore.utils import getToolByName
  File "/home/jenkins/.buildout/eggs/Products.CMFCore-2.2.10-py2.7.egg/Products/CMFCore/__init__.py", line 15, in <module>
    import PortalFolder
  File "/home/jenkins/.buildout/eggs/Products.CMFCore-2.2.10-py2.7.egg/Products/CMFCore/PortalFolder.py", line 24, in <module>
    from OFS.Folder import Folder
  File "/home/jenkins/.buildout/eggs/Zope2-2.13.26-py2.7.egg/OFS/Folder.py", line 27, in <module>
    from OFS.FindSupport import FindSupport
  File "/home/jenkins/.buildout/eggs/Zope2-2.13.26-py2.7.egg/OFS/FindSupport.py", line 20, in <module>
    from AccessControl.Permission import name_trans


FAILED:  plone.app.multilingual.tests.test_robot.Startup

Error Message:
cannot import name name_trans

Stack Trace:
cannot import name name_trans

  File "/home/jenkins/workspace/plone-5.0-python-2.7/src/plone.app.multilingual/src/plone/app/multilingual/tests/test_robot.py", line 2, in <module>
    from plone.app.multilingual.testing import PAM_ROBOT_TESTING
  File "/home/jenkins/workspace/plone-5.0-python-2.7/src/plone.app.multilingual/src/plone/app/multilingual/testing.py", line 2, in <module>
    from Products.CMFCore.utils import getToolByName
  File "/home/jenkins/.buildout/eggs/Products.CMFCore-2.2.10-py2.7.egg/Products/CMFCore/__init__.py", line 15, in <module>
    import PortalFolder
  File "/home/jenkins/.buildout/eggs/Products.CMFCore-2.2.10-py2.7.egg/Products/CMFCore/PortalFolder.py", line 24, in <module>
    from OFS.Folder import Folder
  File "/home/jenkins/.buildout/eggs/Zope2-2.13.26-py2.7.egg/OFS/Folder.py", line 27, in <module>
    from OFS.FindSupport import FindSupport
  File "/home/jenkins/.buildout/eggs/Zope2-2.13.26-py2.7.egg/OFS/FindSupport.py", line 20, in <module>
    from AccessControl.Permission import name_trans


FAILED:  plone.app.multilingual.tests.test_selector.Startup

Error Message:
cannot import name name_trans

Stack Trace:
cannot import name name_trans

  File "/home/jenkins/workspace/plone-5.0-python-2.7/src/plone.app.multilingual/src/plone/app/multilingual/tests/test_selector.py", line 2, in <module>
    from Products.CMFCore.utils import getToolByName
  File "/home/jenkins/.buildout/eggs/Products.CMFCore-2.2.10-py2.7.egg/Products/CMFCore/__init__.py", line 15, in <module>
    import PortalFolder
  File "/home/jenkins/.buildout/eggs/Products.CMFCore-2.2.10-py2.7.egg/Products/CMFCore/PortalFolder.py", line 24, in <module>
    from OFS.Folder import Folder
  File "/home/jenkins/.buildout/eggs/Zope2-2.13.26-py2.7.egg/OFS/Folder.py", line 27, in <module>
    from OFS.FindSupport import FindSupport
  File "/home/jenkins/.buildout/eggs/Zope2-2.13.26-py2.7.egg/OFS/FindSupport.py", line 20, in <module>
    from AccessControl.Permission import name_trans


FAILED:  plone.app.multilingual.tests.test_setup.Startup

Error Message:
cannot import name name_trans

Stack Trace:
cannot import name name_trans

  File "/home/jenkins/workspace/plone-5.0-python-2.7/src/plone.app.multilingual/src/plone/app/multilingual/tests/test_setup.py", line 5, in <module>
    from Products.CMFCore.utils import getToolByName
  File "/home/jenkins/.buildout/eggs/Products.CMFCore-2.2.10-py2.7.egg/Products/CMFCore/__init__.py", line 15, in <module>
    import PortalFolder
  File "/home/jenkins/.buildout/eggs/Products.CMFCore-2.2.10-py2.7.egg/Products/CMFCore/PortalFolder.py", line 24, in <module>
    from OFS.Folder import Folder
  File "/home/jenkins/.buildout/eggs/Zope2-2.13.26-py2.7.egg/OFS/Folder.py", line 27, in <module>
    from OFS.FindSupport import FindSupport
  File "/home/jenkins/.buildout/eggs/Zope2-2.13.26-py2.7.egg/OFS/FindSupport.py", line 20, in <module>
    from AccessControl.Permission import name_trans


FAILED:  plone.app.multilingual.tests.test_sitemap.Startup

Error Message:
cannot import name name_trans

Stack Trace:
cannot import name name_trans

  File "/home/jenkins/workspace/plone-5.0-python-2.7/src/plone.app.multilingual/src/plone/app/multilingual/tests/test_sitemap.py", line 4, in <module>
    from plone.app.multilingual.interfaces import IPloneAppMultilingualInstalled
  File "/home/jenkins/workspace/plone-5.0-python-2.7/src/plone.app.multilingual/src/plone/app/multilingual/interfaces.py", line 8, in <module>
    from Products.CMFPlone.interfaces import ILanguageSchema
  File "/home/jenkins/workspace/plone-5.0-python-2.7/src/Products.CMFPlone/Products/CMFPlone/__init__.py", line 228, in <module>
    from Products.CMFPlone import earlypatches  # noqa
  File "/home/jenkins/workspace/plone-5.0-python-2.7/src/Products.CMFPlone/Products/CMFPlone/earlypatches/__init__.py", line 2, in <module>
    import security  # noqa
  File "/home/jenkins/workspace/plone-5.0-python-2.7/src/Products.CMFPlone/Products/CMFPlone/earlypatches/security.py", line 80, in <module>
    from Products.CMFCore import utils
  File "/home/jenkins/.buildout/eggs/Products.CMFCore-2.2.10-py2.7.egg/Products/CMFCore/__init__.py", line 15, in <module>
    import PortalFolder
  File "/home/jenkins/.buildout/eggs/Products.CMFCore-2.2.10-py2.7.egg/Products/CMFCore/PortalFolder.py", line 24, in <module>
    from OFS.Folder import Folder
  File "/home/jenkins/.buildout/eggs/Zope2-2.13.26-py2.7.egg/OFS/Folder.py", line 27, in <module>
    from OFS.FindSupport import FindSupport
  File "/home/jenkins/.buildout/eggs/Zope2-2.13.26-py2.7.egg/OFS/FindSupport.py", line 20, in <module>
    from AccessControl.Permission import name_trans


FAILED:  plone.app.multilingual.tests.test_subscribers.Startup

Error Message:
cannot import name name_trans

Stack Trace:
cannot import name name_trans

  File "/home/jenkins/workspace/plone-5.0-python-2.7/src/plone.app.multilingual/src/plone/app/multilingual/tests/test_subscribers.py", line 4, in <module>
    from Products.CMFCore.utils import getToolByName
  File "/home/jenkins/.buildout/eggs/Products.CMFCore-2.2.10-py2.7.egg/Products/CMFCore/__init__.py", line 15, in <module>
    import PortalFolder
  File "/home/jenkins/.buildout/eggs/Products.CMFCore-2.2.10-py2.7.egg/Products/CMFCore/PortalFolder.py", line 24, in <module>
    from OFS.Folder import Folder
  File "/home/jenkins/.buildout/eggs/Zope2-2.13.26-py2.7.egg/OFS/Folder.py", line 27, in <module>
    from OFS.FindSupport import FindSupport
  File "/home/jenkins/.buildout/eggs/Zope2-2.13.26-py2.7.egg/OFS/FindSupport.py", line 20, in <module>
    from AccessControl.Permission import name_trans


FAILED:  plone.app.multilingual.tests.test_vocabularies.Startup

Error Message:
cannot import name name_trans

Stack Trace:
cannot import name name_trans

  File "/home/jenkins/workspace/plone-5.0-python-2.7/src/plone.app.multilingual/src/plone/app/multilingual/tests/test_vocabularies.py", line 3, in <module>
    from plone.app.multilingual import api
  File "/home/jenkins/workspace/plone-5.0-python-2.7/src/plone.app.multilingual/src/plone/app/multilingual/api.py", line 2, in <module>
    from plone.app.multilingual.interfaces import ITG
  File "/home/jenkins/workspace/plone-5.0-python-2.7/src/plone.app.multilingual/src/plone/app/multilingual/interfaces.py", line 8, in <module>
    from Products.CMFPlone.interfaces import ILanguageSchema
  File "/home/jenkins/workspace/plone-5.0-python-2.7/src/Products.CMFPlone/Products/CMFPlone/__init__.py", line 228, in <module>
    from Products.CMFPlone import earlypatches  # noqa
  File "/home/jenkins/workspace/plone-5.0-python-2.7/src/Products.CMFPlone/Products/CMFPlone/earlypatches/__init__.py", line 2, in <module>
    import security  # noqa
  File "/home/jenkins/workspace/plone-5.0-python-2.7/src/Products.CMFPlone/Products/CMFPlone/earlypatches/security.py", line 80, in <module>
    from Products.CMFCore import utils
  File "/home/jenkins/.buildout/eggs/Products.CMFCore-2.2.10-py2.7.egg/Products/CMFCore/__init__.py", line 15, in <module>
    import PortalFolder
  File "/home/jenkins/.buildout/eggs/Products.CMFCore-2.2.10-py2.7.egg/Products/CMFCore/PortalFolder.py", line 24, in <module>
    from OFS.Folder import Folder
  File "/home/jenkins/.buildout/eggs/Zope2-2.13.26-py2.7.egg/OFS/Folder.py", line 27, in <module>
    from OFS.FindSupport import FindSupport
  File "/home/jenkins/.buildout/eggs/Zope2-2.13.26-py2.7.egg/OFS/FindSupport.py", line 20, in <module>
    from AccessControl.Permission import name_trans


More information about the Testbot mailing list