[Testbot] Plone 5.0 - Python 2.7 - Build # 124 - Failure!

jenkins at plone.org jenkins at plone.org
Thu Jun 1 14:12:51 UTC 2017


Plone 5.0 - Python 2.7 - Build # 124 - Failure:

Check console output at http://jenkins.plone.org/job/plone-5.0-python-2.7/124/ to view the results.

Changes:

[KUMAR AKSHAY] [fc] Add plone.app.vocabularies to checkouts.cfg

[Jens W. Klein] [fc] Repository: plone.app.vocabularies Branch: refs/heads/master Date:

[Jens W. Klein] [fc] Repository: plone.app.testing Branch: refs/heads/master Date:

[KUMAR AKSHAY] [fc] Add plone.app.testing to checkouts.cfg







Test Results:

7 tests failed.
FAILED:  Products.CMFPlone.tests.testSSOLogin.TestSSOLogin.test_requireLogin

Error Message:
HTTP Error 500: Internal Server Error

Stack Trace:
HTTP Error 500: Internal Server Error

  File "/usr/lib/python2.7/unittest/case.py", line 329, in run
    testMethod()
  File "/home/jenkins/workspace/plone-5.0-python-2.7/src/Products.CMFPlone/Products/CMFPlone/tests/testSSOLogin.py", line 129, in test_requireLogin
    browser.getForm('external_login_form').submit()
  File "/home/jenkins/.buildout/eggs/zope.testbrowser-3.11.1-py2.7.egg/zope/testbrowser/browser.py", line 766, in submit
    self.browser.mech_browser.open(request)
  File "/home/jenkins/.buildout/eggs/mechanize-0.2.5-py2.7.egg/mechanize/_mechanize.py", line 203, in open
    return self._mech_open(url, data, timeout=timeout)
  File "/home/jenkins/.buildout/eggs/mechanize-0.2.5-py2.7.egg/mechanize/_mechanize.py", line 255, in _mech_open
    raise response


FAILED:  Products.CMFPlone.tests.testSSOLogin.TestSSOLoginIframe.test_requireLoginSSO

Error Message:
HTTP Error 500: Internal Server Error

Stack Trace:
HTTP Error 500: Internal Server Error

  File "/usr/lib/python2.7/unittest/case.py", line 329, in run
    testMethod()
  File "/home/jenkins/workspace/plone-5.0-python-2.7/src/Products.CMFPlone/Products/CMFPlone/tests/testSSOLogin.py", line 231, in test_requireLoginSSO
    browser.getForm('external_login_form').submit()
  File "/home/jenkins/.buildout/eggs/zope.testbrowser-3.11.1-py2.7.egg/zope/testbrowser/browser.py", line 766, in submit
    self.browser.mech_browser.open(request)
  File "/home/jenkins/.buildout/eggs/mechanize-0.2.5-py2.7.egg/mechanize/_mechanize.py", line 203, in open
    return self._mech_open(url, data, timeout=timeout)
  File "/home/jenkins/.buildout/eggs/mechanize-0.2.5-py2.7.egg/mechanize/_mechanize.py", line 255, in _mech_open
    raise response


FAILED:  plone.app.dexterity.tests.editing.txt

Error Message:
Failed doctest test for editing.txt

Stack Trace:
Failed doctest test for editing.txt
  File "/home/jenkins/.buildout/eggs/plone.app.dexterity-2.3.7-py2.7.egg/plone/app/dexterity/tests/editing.txt", line 0

----------------------------------------------------------------------
File "/home/jenkins/.buildout/eggs/plone.app.dexterity-2.3.7-py2.7.egg/plone/app/dexterity/tests/editing.txt", line 455, in editing.txt
Failed example:
    browser.open('http://nohost/plone/folder_contents')
Exception raised:
    Traceback (most recent call last):
      File "/usr/lib/python2.7/doctest.py", line 1315, in __run
        compileflags, 1) in test.globs
      File "<doctest editing.txt[176]>", line 1, in <module>
        browser.open('http://nohost/plone/folder_contents')
      File "/home/jenkins/.buildout/eggs/zope.testbrowser-3.11.1-py2.7.egg/zope/testbrowser/browser.py", line 240, in open
        self.mech_browser.open(url, data)
      File "/home/jenkins/.buildout/eggs/mechanize-0.2.5-py2.7.egg/mechanize/_mechanize.py", line 203, in open
        return self._mech_open(url, data, timeout=timeout)
      File "/home/jenkins/.buildout/eggs/mechanize-0.2.5-py2.7.egg/mechanize/_mechanize.py", line 230, in _mech_open
        response = UserAgentBase.open(self, request, data)
      File "/home/jenkins/.buildout/eggs/mechanize-0.2.5-py2.7.egg/mechanize/_opener.py", line 193, in open
        response = urlopen(self, req, data)
      File "/home/jenkins/.buildout/eggs/mechanize-0.2.5-py2.7.egg/mechanize/_urllib2_fork.py", line 344, in _open
        '_open', req)
      File "/home/jenkins/.buildout/eggs/mechanize-0.2.5-py2.7.egg/mechanize/_urllib2_fork.py", line 332, in _call_chain
        result = func(*args)
      File "/home/jenkins/.buildout/eggs/plone.testing-4.1.2-py2.7.egg/plone/testing/_z2_testbrowser.py", line 82, in http_open
        return self.do_open(connectionFactory, req)
      File "/usr/lib/python2.7/urllib2.py", line 1195, in do_open
        h.request(req.get_method(), req.get_selector(), req.data, headers)
      File "/home/jenkins/.buildout/eggs/zope.testbrowser-3.11.1-py2.7.egg/zope/testbrowser/testing.py", line 76, in request
        self.response = self.caller(request_string, handle_errors)
      File "/home/jenkins/.buildout/eggs/plone.testing-4.1.2-py2.7.egg/plone/testing/_z2_testbrowser.py", line 144, in wrapped_func
        return func(*args, **kw)
      File "/home/jenkins/.buildout/eggs/plone.testing-4.1.2-py2.7.egg/plone/testing/_z2_testbrowser.py", line 246, in __call__
        debug=not handle_errors,
      File "/home/jenkins/.buildout/eggs/Zope2-2.13.26-py2.7.egg/ZPublisher/Test.py", line 202, in publish_module
        response = publish(request, module_name, after_list, debug=debug)
      File "/home/jenkins/.buildout/eggs/Zope2-2.13.26-py2.7.egg/ZPublisher/Publish.py", line 138, in publish
        request, bind=1)
      File "/home/jenkins/.buildout/eggs/Zope2-2.13.26-py2.7.egg/ZPublisher/mapply.py", line 77, in mapply
        if debug is not None: return debug(object,args,context)
      File "/home/jenkins/.buildout/eggs/Zope2-2.13.26-py2.7.egg/ZPublisher/Publish.py", line 48, in call_object
        result=apply(object,args) # Type s<cr> to step into published object.
      File "/home/jenkins/workspace/plone-5.0-python-2.7/src/plone.app.content/plone/app/content/browser/contents/__init__.py", line 324, in __call__
        self.options = json_dumps(self.get_options())
      File "/home/jenkins/workspace/plone-5.0-python-2.7/src/plone.app.content/plone/app/content/browser/contents/__init__.py", line 319, in get_options
        'thumbSize' : self.get_thumbSize(),
      File "/home/jenkins/workspace/plone-5.0-python-2.7/src/plone.app.content/plone/app/content/browser/contents/__init__.py", line 226, in get_thumbSize
        if settings.no_thumbs_tables:
      File "/home/jenkins/.buildout/eggs/plone.registry-1.0.5-py2.7.egg/plone/registry/recordsproxy.py", line 38, in __getattr__
        raise AttributeError(name)
    AttributeError: no_thumbs_tables


  File "/usr/lib/python2.7/unittest/case.py", line 329, in run
    testMethod()
  File "/usr/lib/python2.7/doctest.py", line 2226, in runTest
    raise self.failureException(self.format_failure(new.getvalue()))


FAILED:  plone.portlet.collection.tests.functional.txt

Error Message:
Failed doctest test for functional.txt

Stack Trace:
Failed doctest test for functional.txt
  File "/home/jenkins/workspace/plone-5.0-python-2.7/src/plone.portlet.collection/plone/portlet/collection/tests/functional.txt", line 0

----------------------------------------------------------------------
File "/home/jenkins/workspace/plone-5.0-python-2.7/src/plone.portlet.collection/plone/portlet/collection/tests/functional.txt", line 76, in functional.txt
Failed example:
    portlet = html.xpath('//*[contains(@class, "portletCollection")]')[0]
Exception raised:
    Traceback (most recent call last):
      File "/usr/lib/python2.7/doctest.py", line 1315, in __run
        compileflags, 1) in test.globs
      File "<doctest functional.txt[37]>", line 1, in <module>
        portlet = html.xpath('//*[contains(@class, "portletCollection")]')[0]
    IndexError: list index out of range


  File "/usr/lib/python2.7/unittest/case.py", line 329, in run
    testMethod()
  File "/usr/lib/python2.7/doctest.py", line 2226, in runTest
    raise self.failureException(self.format_failure(new.getvalue()))


FAILED:  plone.app.contenttypes.tests.test_behaviors_leadimage.LeadImageBehaviorFunctionalTest.test_lead_image_viewlet_shows_up

Error Message:
no_thumbs_tables

Stack Trace:
no_thumbs_tables

  File "/home/jenkins/.buildout/eggs/unittest2-0.5.1-py2.7.egg/unittest2/case.py", line 340, in run
    testMethod()
  File "/home/jenkins/workspace/plone-5.0-python-2.7/src/plone.app.contenttypes/plone/app/contenttypes/tests/test_behaviors_leadimage.py", line 79, in test_lead_image_viewlet_shows_up
    self.browser.open(self.portal_url + '/leadimagefolder/folder_contents')
  File "/home/jenkins/.buildout/eggs/zope.testbrowser-3.11.1-py2.7.egg/zope/testbrowser/browser.py", line 240, in open
    self.mech_browser.open(url, data)
  File "/home/jenkins/.buildout/eggs/mechanize-0.2.5-py2.7.egg/mechanize/_mechanize.py", line 203, in open
    return self._mech_open(url, data, timeout=timeout)
  File "/home/jenkins/.buildout/eggs/mechanize-0.2.5-py2.7.egg/mechanize/_mechanize.py", line 230, in _mech_open
    response = UserAgentBase.open(self, request, data)
  File "/home/jenkins/.buildout/eggs/mechanize-0.2.5-py2.7.egg/mechanize/_opener.py", line 193, in open
    response = urlopen(self, req, data)
  File "/home/jenkins/.buildout/eggs/mechanize-0.2.5-py2.7.egg/mechanize/_urllib2_fork.py", line 344, in _open
    '_open', req)
  File "/home/jenkins/.buildout/eggs/mechanize-0.2.5-py2.7.egg/mechanize/_urllib2_fork.py", line 332, in _call_chain
    result = func(*args)
  File "/home/jenkins/.buildout/eggs/plone.testing-4.1.2-py2.7.egg/plone/testing/_z2_testbrowser.py", line 82, in http_open
    return self.do_open(connectionFactory, req)
  File "/usr/lib/python2.7/urllib2.py", line 1195, in do_open
    h.request(req.get_method(), req.get_selector(), req.data, headers)
  File "/home/jenkins/.buildout/eggs/zope.testbrowser-3.11.1-py2.7.egg/zope/testbrowser/testing.py", line 76, in request
    self.response = self.caller(request_string, handle_errors)
  File "/home/jenkins/.buildout/eggs/plone.testing-4.1.2-py2.7.egg/plone/testing/_z2_testbrowser.py", line 144, in wrapped_func
    return func(*args, **kw)
  File "/home/jenkins/.buildout/eggs/plone.testing-4.1.2-py2.7.egg/plone/testing/_z2_testbrowser.py", line 246, in __call__
    debug=not handle_errors,
  File "/home/jenkins/.buildout/eggs/Zope2-2.13.26-py2.7.egg/ZPublisher/Test.py", line 202, in publish_module
    response = publish(request, module_name, after_list, debug=debug)
  File "/home/jenkins/.buildout/eggs/Zope2-2.13.26-py2.7.egg/ZPublisher/Publish.py", line 138, in publish
    request, bind=1)
  File "/home/jenkins/.buildout/eggs/Zope2-2.13.26-py2.7.egg/ZPublisher/mapply.py", line 77, in mapply
    if debug is not None: return debug(object,args,context)
  File "/home/jenkins/.buildout/eggs/Zope2-2.13.26-py2.7.egg/ZPublisher/Publish.py", line 48, in call_object
    result=apply(object,args) # Type s<cr> to step into published object.
  File "/home/jenkins/workspace/plone-5.0-python-2.7/src/plone.app.content/plone/app/content/browser/contents/__init__.py", line 324, in __call__
    self.options = json_dumps(self.get_options())
  File "/home/jenkins/workspace/plone-5.0-python-2.7/src/plone.app.content/plone/app/content/browser/contents/__init__.py", line 319, in get_options
    'thumbSize' : self.get_thumbSize(),
  File "/home/jenkins/workspace/plone-5.0-python-2.7/src/plone.app.content/plone/app/content/browser/contents/__init__.py", line 226, in get_thumbSize
    if settings.no_thumbs_tables:
  File "/home/jenkins/.buildout/eggs/plone.registry-1.0.5-py2.7.egg/plone/registry/recordsproxy.py", line 38, in __getattr__
    raise AttributeError(name)


FAILED:  plone.app.linkintegrity.tests.test_functional.FunctionalReferenceATTestCase.test_removal_with_cookie_auth

Error Message:
HTTP Error 500: Internal Server Error

Stack Trace:
HTTP Error 500: Internal Server Error

  File "/usr/lib/python2.7/unittest/case.py", line 329, in run
    testMethod()
  File "/home/jenkins/.buildout/eggs/plone.app.linkintegrity-3.1-py2.7.egg/plone/app/linkintegrity/tests/test_functional.py", line 182, in test_removal_with_cookie_auth
    browser.getControl('Log in').click()
  File "/home/jenkins/.buildout/eggs/zope.testbrowser-3.11.1-py2.7.egg/zope/testbrowser/browser.py", line 639, in click
    self.browser._clickSubmit(self.mech_form, self.mech_control, (1,1))
  File "/home/jenkins/.buildout/eggs/zope.testbrowser-3.11.1-py2.7.egg/zope/testbrowser/browser.py", line 418, in _clickSubmit
    label=label, coord=coord)
  File "/home/jenkins/.buildout/eggs/mechanize-0.2.5-py2.7.egg/mechanize/_mechanize.py", line 541, in submit
    return self.open(self.click(*args, **kwds))
  File "/home/jenkins/.buildout/eggs/mechanize-0.2.5-py2.7.egg/mechanize/_mechanize.py", line 203, in open
    return self._mech_open(url, data, timeout=timeout)
  File "/home/jenkins/.buildout/eggs/mechanize-0.2.5-py2.7.egg/mechanize/_mechanize.py", line 255, in _mech_open
    raise response


FAILED:  plone.app.linkintegrity.tests.test_functional.FunctionalReferenceDXTestCase.test_removal_with_cookie_auth

Error Message:
HTTP Error 500: Internal Server Error

Stack Trace:
HTTP Error 500: Internal Server Error

  File "/usr/lib/python2.7/unittest/case.py", line 329, in run
    testMethod()
  File "/home/jenkins/.buildout/eggs/plone.app.linkintegrity-3.1-py2.7.egg/plone/app/linkintegrity/tests/test_functional.py", line 182, in test_removal_with_cookie_auth
    browser.getControl('Log in').click()
  File "/home/jenkins/.buildout/eggs/zope.testbrowser-3.11.1-py2.7.egg/zope/testbrowser/browser.py", line 639, in click
    self.browser._clickSubmit(self.mech_form, self.mech_control, (1,1))
  File "/home/jenkins/.buildout/eggs/zope.testbrowser-3.11.1-py2.7.egg/zope/testbrowser/browser.py", line 418, in _clickSubmit
    label=label, coord=coord)
  File "/home/jenkins/.buildout/eggs/mechanize-0.2.5-py2.7.egg/mechanize/_mechanize.py", line 541, in submit
    return self.open(self.click(*args, **kwds))
  File "/home/jenkins/.buildout/eggs/mechanize-0.2.5-py2.7.egg/mechanize/_mechanize.py", line 203, in open
    return self._mech_open(url, data, timeout=timeout)
  File "/home/jenkins/.buildout/eggs/mechanize-0.2.5-py2.7.egg/mechanize/_mechanize.py", line 255, in _mech_open
    raise response


More information about the Testbot mailing list