[Testbot] Plone 5.1 - Python 2.7 - Build # 1581 - Still Failing!

jenkins at plone.org jenkins at plone.org
Tue Feb 21 21:55:44 UTC 2017


Plone 5.1 - Python 2.7 - Build # 1581 - Still Failing:

Check console output at http://jenkins.plone.org/job/plone-5.1-python-2.7/1581/ to view the results.

Changes:

[Gil Forcada Codinachs] [fc] Add plone.app.blob to checkouts.cfg

[Gil Forcada Codinachs] [fc] Repository: plone.app.blob Branch: refs/heads/master Date:

[Gil Forcada Codinachs] [fc] Add Products.ATContentTypes to checkouts.cfg

[Gil Forcada Codinachs] [fc] Repository: Products.ATContentTypes Branch: refs/heads/master Date:

[Gil Forcada Codinachs] [fc] Add plone.app.upgrade to checkouts.cfg

[Gil Forcada Codinachs] [fc] Repository: plone.app.upgrade Branch: refs/heads/master Date:

[Gil Forcada Codinachs] [fc] Add plone.app.content to checkouts.cfg

[Gil Forcada Codinachs] [fc] Repository: plone.app.content Branch: refs/heads/master Date:







Test Results:

144 tests failed.
FAILED:  Products.CMFPlone.tests.testBrowserDefault.TestPortalBrowserDefault.testSetDefaultPageUpdatesCatalog

Error Message:
0 != 1

Stack Trace:
0 != 1

  File "/usr/lib/python2.7/unittest/case.py", line 329, in run
    testMethod()
  File "/home/jenkins/.buildout/eggs/Products.CMFPlone-5.1b2-py2.7.egg/Products/CMFPlone/tests/testBrowserDefault.py", line 341, in testSetDefaultPageUpdatesCatalog
    len(cat(getId='ad', is_default_page=True)), 1)
  File "/usr/lib/python2.7/unittest/case.py", line 513, in assertEqual
    assertion_func(first, second, msg=msg)
  File "/usr/lib/python2.7/unittest/case.py", line 506, in _baseAssertEqual
    raise self.failureException(msg)


FAILED:  Products.CMFPlone.tests.testCatalogTool.TestCatalogIndexing.testClearFindAndRebuildAddsMissingContent

Error Message:
Lists differ: ['Members', 'aggregator', 'agg... != ['aggregator', 'aggregator', '...

Stack Trace:
Lists differ: ['Members', 'aggregator', 'agg... != ['aggregator', 'aggregator', '...

First differing element 0:
'Members'
'aggregator'

First list contains 1 additional elements.
First extra element 7:
'test_user_1_'

- ['Members',
-  'aggregator',
? ^

+ ['aggregator',
? ^

   'aggregator',
   'doc',
   'events',
   'front-page',
   'news',
   'test_user_1_']

  File "/usr/lib/python2.7/unittest/case.py", line 329, in run
    testMethod()
  File "/home/jenkins/.buildout/eggs/Products.CMFPlone-5.1b2-py2.7.egg/Products/CMFPlone/tests/testCatalogTool.py", line 319, in testClearFindAndRebuildAddsMissingContent
    self.assertResults(res, altered_content)
  File "/home/jenkins/.buildout/eggs/Products.CMFPlone-5.1b2-py2.7.egg/Products/CMFPlone/tests/testCatalogTool.py", line 164, in assertResults
    self.assertEqual(lhs, rhs)
  File "/usr/lib/python2.7/unittest/case.py", line 513, in assertEqual
    assertion_func(first, second, msg=msg)
  File "/usr/lib/python2.7/unittest/case.py", line 742, in assertListEqual
    self.assertSequenceEqual(list1, list2, msg, seq_type=list)
  File "/usr/lib/python2.7/unittest/case.py", line 724, in assertSequenceEqual
    self.fail(msg)
  File "/usr/lib/python2.7/unittest/case.py", line 410, in fail
    raise self.failureException(msg)


FAILED:  Products.CMFPlone.tests.testCatalogTool.TestCatalogIndexing.testFixture

Error Message:
1 != 0

Stack Trace:
1 != 0

  File "/usr/lib/python2.7/unittest/case.py", line 329, in run
    testMethod()
  File "/home/jenkins/.buildout/eggs/Products.CMFPlone-5.1b2-py2.7.egg/Products/CMFPlone/tests/testCatalogTool.py", line 170, in testFixture
    self.assertEqual(len(self.catalog(getId='doc')), 0)
  File "/usr/lib/python2.7/unittest/case.py", line 513, in assertEqual
    assertion_func(first, second, msg=msg)
  File "/usr/lib/python2.7/unittest/case.py", line 506, in _baseAssertEqual
    raise self.failureException(msg)


FAILED:  Products.CMFPlone.tests.testCatalogTool.TestCatalogIndexing.testIndexIdOnly

Error Message:
1 != 0

Stack Trace:
1 != 0

  File "/usr/lib/python2.7/unittest/case.py", line 329, in run
    testMethod()
  File "/home/jenkins/.buildout/eggs/Products.CMFPlone-5.1b2-py2.7.egg/Products/CMFPlone/tests/testCatalogTool.py", line 289, in testIndexIdOnly
    self.assertEqual(len(self.catalog(getId='doc')), 0)  # <-- Should be 1
  File "/usr/lib/python2.7/unittest/case.py", line 513, in assertEqual
    assertion_func(first, second, msg=msg)
  File "/usr/lib/python2.7/unittest/case.py", line 506, in _baseAssertEqual
    raise self.failureException(msg)


FAILED:  Products.CMFPlone.tests.testCatalogTool.TestCatalogIndexing.testIndexTitleOnly

Error Message:
1 != 0

Stack Trace:
1 != 0

  File "/usr/lib/python2.7/unittest/case.py", line 329, in run
    testMethod()
  File "/home/jenkins/.buildout/eggs/Products.CMFPlone-5.1b2-py2.7.egg/Products/CMFPlone/tests/testCatalogTool.py", line 274, in testIndexTitleOnly
    self.assertEqual(len(self.catalog(getId='doc')), 0)
  File "/usr/lib/python2.7/unittest/case.py", line 513, in assertEqual
    assertion_func(first, second, msg=msg)
  File "/usr/lib/python2.7/unittest/case.py", line 506, in _baseAssertEqual
    raise self.failureException(msg)


FAILED:  Products.CMFPlone.tests.testCatalogTool.TestCatalogIndexing.testReindexObjectUpdatesMetadata

Error Message:
'Foo' != 'Fred'

Stack Trace:
'Foo' != 'Fred'

  File "/usr/lib/python2.7/unittest/case.py", line 329, in run
    testMethod()
  File "/home/jenkins/.buildout/eggs/Products.CMFPlone-5.1b2-py2.7.egg/Products/CMFPlone/tests/testCatalogTool.py", line 211, in testReindexObjectUpdatesMetadata
    self.assertEqual(brain.Title, 'Fred')
  File "/usr/lib/python2.7/unittest/case.py", line 513, in assertEqual
    assertion_func(first, second, msg=msg)
  File "/usr/lib/python2.7/unittest/case.py", line 506, in _baseAssertEqual
    raise self.failureException(msg)


FAILED:  Products.CMFPlone.tests.testCatalogTool.TestCatalogIndexing.testReindexTitleOnly

Error Message:
0 != 1

Stack Trace:
0 != 1

  File "/usr/lib/python2.7/unittest/case.py", line 329, in run
    testMethod()
  File "/home/jenkins/.buildout/eggs/Products.CMFPlone-5.1b2-py2.7.egg/Products/CMFPlone/tests/testCatalogTool.py", line 233, in testReindexTitleOnly
    self.assertEqual(len(self.catalog(Title='Fred')), 1)
  File "/usr/lib/python2.7/unittest/case.py", line 513, in assertEqual
    assertion_func(first, second, msg=msg)
  File "/usr/lib/python2.7/unittest/case.py", line 506, in _baseAssertEqual
    raise self.failureException(msg)


FAILED:  Products.CMFPlone.tests.testCatalogTool.TestCatalogIndexing.testReindexTitleOnlyUpdatesMetadata

Error Message:
'Foo' != 'Fred'

Stack Trace:
'Foo' != 'Fred'

  File "/usr/lib/python2.7/unittest/case.py", line 329, in run
    testMethod()
  File "/home/jenkins/.buildout/eggs/Products.CMFPlone-5.1b2-py2.7.egg/Products/CMFPlone/tests/testCatalogTool.py", line 246, in testReindexTitleOnlyUpdatesMetadata
    self.assertEqual(brain.Title, 'Fred')
  File "/usr/lib/python2.7/unittest/case.py", line 513, in assertEqual
    assertion_func(first, second, msg=msg)
  File "/usr/lib/python2.7/unittest/case.py", line 506, in _baseAssertEqual
    raise self.failureException(msg)


FAILED:  Products.CMFPlone.tests.testCatalogTool.TestCatalogIndexing.testUnindexObject

Error Message:
1 != 0

Stack Trace:
1 != 0

  File "/usr/lib/python2.7/unittest/case.py", line 329, in run
    testMethod()
  File "/home/jenkins/.buildout/eggs/Products.CMFPlone-5.1b2-py2.7.egg/Products/CMFPlone/tests/testCatalogTool.py", line 193, in testUnindexObject
    self.assertEqual(len(self.catalog(getId='doc')), 0)
  File "/usr/lib/python2.7/unittest/case.py", line 513, in assertEqual
    assertion_func(first, second, msg=msg)
  File "/usr/lib/python2.7/unittest/case.py", line 506, in _baseAssertEqual
    raise self.failureException(msg)


FAILED:  Products.CMFPlone.tests.testUnicodeSplitter.TestQuery.testIndexUnicode

Error Message:
0 != 1

Stack Trace:
0 != 1

  File "/usr/lib/python2.7/unittest/case.py", line 329, in run
    testMethod()
  File "/home/jenkins/.buildout/eggs/Products.CMFPlone-5.1b2-py2.7.egg/Products/CMFPlone/tests/testUnicodeSplitter.py", line 234, in testIndexUnicode
    self.assertEqual(len(brains), 1)
  File "/usr/lib/python2.7/unittest/case.py", line 513, in assertEqual
    assertion_func(first, second, msg=msg)
  File "/usr/lib/python2.7/unittest/case.py", line 506, in _baseAssertEqual
    raise self.failureException(msg)


FAILED:  Products.CMFPlone.tests.testUnicodeSplitter.TestQuery.testIndexUnicodeLower

Error Message:
0 != 1

Stack Trace:
0 != 1

  File "/usr/lib/python2.7/unittest/case.py", line 329, in run
    testMethod()
  File "/home/jenkins/.buildout/eggs/Products.CMFPlone-5.1b2-py2.7.egg/Products/CMFPlone/tests/testUnicodeSplitter.py", line 240, in testIndexUnicodeLower
    self.assertEqual(len(brains), 1)
  File "/usr/lib/python2.7/unittest/case.py", line 513, in assertEqual
    assertion_func(first, second, msg=msg)
  File "/usr/lib/python2.7/unittest/case.py", line 506, in _baseAssertEqual
    raise self.failureException(msg)


FAILED:  Products.CMFPlone.tests.testUnicodeSplitter.TestQuery.testMixedModeQuery

Error Message:
0 != 1

Stack Trace:
0 != 1

  File "/usr/lib/python2.7/unittest/case.py", line 329, in run
    testMethod()
  File "/home/jenkins/.buildout/eggs/Products.CMFPlone-5.1b2-py2.7.egg/Products/CMFPlone/tests/testUnicodeSplitter.py", line 214, in testMixedModeQuery
    self.assertEqual(len(brains), 1)
  File "/usr/lib/python2.7/unittest/case.py", line 513, in assertEqual
    assertion_func(first, second, msg=msg)
  File "/usr/lib/python2.7/unittest/case.py", line 506, in _baseAssertEqual
    raise self.failureException(msg)


FAILED:  Products.CMFPlone.tests.testUnicodeSplitter.TestQuery.testQueryByLatin1

Error Message:
0 != 1

Stack Trace:
0 != 1

  File "/usr/lib/python2.7/unittest/case.py", line 329, in run
    testMethod()
  File "/home/jenkins/.buildout/eggs/Products.CMFPlone-5.1b2-py2.7.egg/Products/CMFPlone/tests/testUnicodeSplitter.py", line 184, in testQueryByLatin1
    self.assertEqual(len(brains), 1)
  File "/usr/lib/python2.7/unittest/case.py", line 513, in assertEqual
    assertion_func(first, second, msg=msg)
  File "/usr/lib/python2.7/unittest/case.py", line 506, in _baseAssertEqual
    raise self.failureException(msg)


FAILED:  Products.CMFPlone.tests.testUnicodeSplitter.TestQuery.testQueryByLatin1Lower

Error Message:
0 != 1

Stack Trace:
0 != 1

  File "/usr/lib/python2.7/unittest/case.py", line 329, in run
    testMethod()
  File "/home/jenkins/.buildout/eggs/Products.CMFPlone-5.1b2-py2.7.egg/Products/CMFPlone/tests/testUnicodeSplitter.py", line 198, in testQueryByLatin1Lower
    self.assertEqual(len(brains), 1)
  File "/usr/lib/python2.7/unittest/case.py", line 513, in assertEqual
    assertion_func(first, second, msg=msg)
  File "/usr/lib/python2.7/unittest/case.py", line 506, in _baseAssertEqual
    raise self.failureException(msg)


FAILED:  Products.CMFPlone.tests.testUnicodeSplitter.TestQuery.testQueryByUmlaut

Error Message:
0 != 1

Stack Trace:
0 != 1

  File "/usr/lib/python2.7/unittest/case.py", line 329, in run
    testMethod()
  File "/home/jenkins/.buildout/eggs/Products.CMFPlone-5.1b2-py2.7.egg/Products/CMFPlone/tests/testUnicodeSplitter.py", line 150, in testQueryByUmlaut
    self.assertEqual(len(brains), 1)
  File "/usr/lib/python2.7/unittest/case.py", line 513, in assertEqual
    assertion_func(first, second, msg=msg)
  File "/usr/lib/python2.7/unittest/case.py", line 506, in _baseAssertEqual
    raise self.failureException(msg)


FAILED:  Products.CMFPlone.tests.testUnicodeSplitter.TestQuery.testQueryByUmlautLower

Error Message:
0 != 1

Stack Trace:
0 != 1

  File "/usr/lib/python2.7/unittest/case.py", line 329, in run
    testMethod()
  File "/home/jenkins/.buildout/eggs/Products.CMFPlone-5.1b2-py2.7.egg/Products/CMFPlone/tests/testUnicodeSplitter.py", line 156, in testQueryByUmlautLower
    self.assertEqual(len(brains), 1)
  File "/usr/lib/python2.7/unittest/case.py", line 513, in assertEqual
    assertion_func(first, second, msg=msg)
  File "/usr/lib/python2.7/unittest/case.py", line 506, in _baseAssertEqual
    raise self.failureException(msg)


FAILED:  Products.CMFPlone.tests.testUnicodeSplitter.TestQuery.testQueryByUnicode

Error Message:
0 != 1

Stack Trace:
0 != 1

  File "/usr/lib/python2.7/unittest/case.py", line 329, in run
    testMethod()
  File "/home/jenkins/.buildout/eggs/Products.CMFPlone-5.1b2-py2.7.egg/Products/CMFPlone/tests/testUnicodeSplitter.py", line 222, in testQueryByUnicode
    self.assertEqual(len(brains), 1)
  File "/usr/lib/python2.7/unittest/case.py", line 513, in assertEqual
    assertion_func(first, second, msg=msg)
  File "/usr/lib/python2.7/unittest/case.py", line 506, in _baseAssertEqual
    raise self.failureException(msg)


FAILED:  Products.CMFPlone.tests.testUnicodeSplitter.TestQuery.testQueryByUnicodeLower

Error Message:
0 != 1

Stack Trace:
0 != 1

  File "/usr/lib/python2.7/unittest/case.py", line 329, in run
    testMethod()
  File "/home/jenkins/.buildout/eggs/Products.CMFPlone-5.1b2-py2.7.egg/Products/CMFPlone/tests/testUnicodeSplitter.py", line 228, in testQueryByUnicodeLower
    self.assertEqual(len(brains), 1)
  File "/usr/lib/python2.7/unittest/case.py", line 513, in assertEqual
    assertion_func(first, second, msg=msg)
  File "/usr/lib/python2.7/unittest/case.py", line 506, in _baseAssertEqual
    raise self.failureException(msg)


FAILED:  Products.CMFPlone.tests.testUnicodeSplitter.TestQuery.testQueryDifferentiatesUmlauts

Error Message:
0 != 1

Stack Trace:
0 != 1

  File "/usr/lib/python2.7/unittest/case.py", line 329, in run
    testMethod()
  File "/home/jenkins/.buildout/eggs/Products.CMFPlone-5.1b2-py2.7.egg/Products/CMFPlone/tests/testUnicodeSplitter.py", line 164, in testQueryDifferentiatesUmlauts
    self.assertEqual(len(brains), 1)
  File "/usr/lib/python2.7/unittest/case.py", line 513, in assertEqual
    assertion_func(first, second, msg=msg)
  File "/usr/lib/python2.7/unittest/case.py", line 506, in _baseAssertEqual
    raise self.failureException(msg)


FAILED:  Products.CMFPlone.tests.testUnicodeSplitter.TestQuery.testQueryDifferentiatesUmlautsLower

Error Message:
0 != 1

Stack Trace:
0 != 1

  File "/usr/lib/python2.7/unittest/case.py", line 329, in run
    testMethod()
  File "/home/jenkins/.buildout/eggs/Products.CMFPlone-5.1b2-py2.7.egg/Products/CMFPlone/tests/testUnicodeSplitter.py", line 172, in testQueryDifferentiatesUmlautsLower
    self.assertEqual(len(brains), 1)
  File "/usr/lib/python2.7/unittest/case.py", line 513, in assertEqual
    assertion_func(first, second, msg=msg)
  File "/usr/lib/python2.7/unittest/case.py", line 506, in _baseAssertEqual
    raise self.failureException(msg)


FAILED:  plone.app.content.basecontent.rst

Error Message:
Failed doctest test for basecontent.rst

Stack Trace:
Failed doctest test for basecontent.rst
  File "/home/jenkins/workspace/plone-5.1-python-2.7 at 3/src/plone.app.content/plone/app/content/basecontent.rst", line 0

----------------------------------------------------------------------
File "/home/jenkins/workspace/plone-5.1-python-2.7 at 3/src/plone.app.content/plone/app/content/basecontent.rst", line 155, in basecontent.rst
Failed example:
    [b.Title for b in catalog(getId = 'my-container')]
Expected:
    ['Updated title']
Got:
    ['A sample container']
----------------------------------------------------------------------
File "/home/jenkins/workspace/plone-5.1-python-2.7 at 3/src/plone.app.content/plone/app/content/basecontent.rst", line 157, in basecontent.rst
Failed example:
    [b.Title for b in catalog(getId = 'my-item')]
Expected:
    ['Also updated title']
Got:
    ['A non-folderish item']


  File "/usr/lib/python2.7/unittest/case.py", line 329, in run
    testMethod()
  File "/usr/lib/python2.7/doctest.py", line 2226, in runTest
    raise self.failureException(self.format_failure(new.getvalue()))


FAILED:  plone.app.contentlisting.tests.integration.rst

Error Message:
Failed doctest test for integration.rst

Stack Trace:
Failed doctest test for integration.rst
  File "/home/jenkins/.buildout/eggs/plone.app.contentlisting-1.2.8-py2.7.egg/plone/app/contentlisting/tests/integration.rst", line 0

----------------------------------------------------------------------
File "/home/jenkins/.buildout/eggs/plone.app.contentlisting-1.2.8-py2.7.egg/plone/app/contentlisting/tests/integration.rst", line 187, in integration.rst
Failed example:
    frontpage.isVisibleInNav()
Expected:
    False
Got:
    True


  File "/usr/lib/python2.7/unittest/case.py", line 329, in run
    testMethod()
  File "/usr/lib/python2.7/doctest.py", line 2226, in runTest
    raise self.failureException(self.format_failure(new.getvalue()))


FAILED:  plone.app.content.tests.test_folder.ContextInfoTest.testStateChange

Error Message:
'NoneType' object has no attribute '__getitem__'

Stack Trace:
'NoneType' object has no attribute '__getitem__'

  File "/usr/lib/python2.7/unittest/case.py", line 329, in run
    testMethod()
  File "/home/jenkins/workspace/plone-5.1-python-2.7 at 3/src/plone.app.content/plone/app/content/tests/test_folder.py", line 226, in testStateChange
    self.assertEquals(result['object']['Title'], 'page')


FAILED:  plone.app.content.tests.test_folder.DeleteDXTest.test_delete_object

Error Message:
False is not true

Stack Trace:
False is not true

  File "/usr/lib/python2.7/unittest/case.py", line 329, in run
    testMethod()
  File "/home/jenkins/workspace/plone-5.1-python-2.7 at 3/src/plone.app.content/plone/app/content/tests/test_folder.py", line 297, in test_delete_object
    self.assertTrue(page_id not in self.portal)
  File "/usr/lib/python2.7/unittest/case.py", line 422, in assertTrue
    raise self.failureException(msg)


FAILED:  plone.app.content.tests.test_folder.DeleteDXTest.test_delete_wrong_object_by_acquisition

Error Message:
True is not false

Stack Trace:
True is not false

  File "/usr/lib/python2.7/unittest/case.py", line 329, in run
    testMethod()
  File "/home/jenkins/workspace/plone-5.1-python-2.7 at 3/src/plone.app.content/plone/app/content/tests/test_folder.py", line 337, in test_delete_wrong_object_by_acquisition
    self.assertFalse(p1 in self.portal[f1])
  File "/usr/lib/python2.7/unittest/case.py", line 416, in assertFalse
    raise self.failureException(msg)


FAILED:  plone.app.content.tests.test_folder.PropertiesDXTest.testContributors

Error Message:
Tuples differ: () != ('one', 'two')

Stack Trace:
Tuples differ: () != ('one', 'two')

Second tuple contains 2 additional elements.
First extra element 0:
'one'

- ()
+ ('one', 'two')

  File "/usr/lib/python2.7/unittest/case.py", line 329, in run
    testMethod()
  File "/home/jenkins/workspace/plone-5.1-python-2.7 at 3/src/plone.app.content/plone/app/content/tests/test_folder.py", line 104, in testContributors
    self.assertEquals(self.portal.page.contributors, ('one', 'two'))
  File "/usr/lib/python2.7/unittest/case.py", line 513, in assertEqual
    assertion_func(first, second, msg=msg)
  File "/usr/lib/python2.7/unittest/case.py", line 753, in assertTupleEqual
    self.assertSequenceEqual(tuple1, tuple2, msg, seq_type=tuple)
  File "/usr/lib/python2.7/unittest/case.py", line 724, in assertSequenceEqual
    self.fail(msg)
  File "/usr/lib/python2.7/unittest/case.py", line 410, in fail
    raise self.failureException(msg)


FAILED:  plone.app.content.tests.test_folder.PropertiesDXTest.testCreators

Error Message:
Tuples differ: ('test_user_1_',) != ('one', 'two')

Stack Trace:
Tuples differ: ('test_user_1_',) != ('one', 'two')

First differing element 0:
'test_user_1_'
'one'

Second tuple contains 1 additional elements.
First extra element 1:
'two'

- ('test_user_1_',)
+ ('one', 'two')

  File "/usr/lib/python2.7/unittest/case.py", line 329, in run
    testMethod()
  File "/home/jenkins/workspace/plone-5.1-python-2.7 at 3/src/plone.app.content/plone/app/content/tests/test_folder.py", line 113, in testCreators
    ('one', 'two')
  File "/usr/lib/python2.7/unittest/case.py", line 513, in assertEqual
    assertion_func(first, second, msg=msg)
  File "/usr/lib/python2.7/unittest/case.py", line 753, in assertTupleEqual
    self.assertSequenceEqual(tuple1, tuple2, msg, seq_type=tuple)
  File "/usr/lib/python2.7/unittest/case.py", line 724, in assertSequenceEqual
    self.fail(msg)
  File "/usr/lib/python2.7/unittest/case.py", line 410, in fail
    raise self.failureException(msg)


FAILED:  plone.app.content.tests.test_folder.PropertiesDXTest.testEffective

Error Message:
None != DateTime('1999/01/01 09:00:00 US/Pacific')

Stack Trace:
None != DateTime('1999/01/01 09:00:00 US/Pacific')

  File "/usr/lib/python2.7/unittest/case.py", line 329, in run
    testMethod()
  File "/home/jenkins/workspace/plone-5.1-python-2.7 at 3/src/plone.app.content/plone/app/content/tests/test_folder.py", line 75, in testEffective
    DateTime('1999/01/01 09:00'))
  File "/usr/lib/python2.7/unittest/case.py", line 513, in assertEqual
    assertion_func(first, second, msg=msg)
  File "/usr/lib/python2.7/unittest/case.py", line 506, in _baseAssertEqual
    raise self.failureException(msg)


FAILED:  plone.app.content.tests.test_folder.PropertiesDXTest.testExpires

Error Message:
None != DateTime('1999/01/01 09:00:00 US/Pacific')

Stack Trace:
None != DateTime('1999/01/01 09:00:00 US/Pacific')

  File "/usr/lib/python2.7/unittest/case.py", line 329, in run
    testMethod()
  File "/home/jenkins/workspace/plone-5.1-python-2.7 at 3/src/plone.app.content/plone/app/content/tests/test_folder.py", line 83, in testExpires
    DateTime('1999/01/01 09:00'))
  File "/usr/lib/python2.7/unittest/case.py", line 513, in assertEqual
    assertion_func(first, second, msg=msg)
  File "/usr/lib/python2.7/unittest/case.py", line 506, in _baseAssertEqual
    raise self.failureException(msg)


FAILED:  plone.app.content.tests.test_folder.PropertiesDXTest.testRights

Error Message:
'' != 'foobar'

Stack Trace:
'' != 'foobar'

  File "/usr/lib/python2.7/unittest/case.py", line 329, in run
    testMethod()
  File "/home/jenkins/workspace/plone-5.1-python-2.7 at 3/src/plone.app.content/plone/app/content/tests/test_folder.py", line 97, in testRights
    self.assertEquals(self.portal.page.rights, 'foobar')
  File "/usr/lib/python2.7/unittest/case.py", line 513, in assertEqual
    assertion_func(first, second, msg=msg)
  File "/usr/lib/python2.7/unittest/case.py", line 506, in _baseAssertEqual
    raise self.failureException(msg)


FAILED:  plone.app.content.tests.test_folder.PropertiesDXTest.testSetDexterityExcludeFromNav

Error Message:
False != True

Stack Trace:
False != True

  File "/usr/lib/python2.7/unittest/case.py", line 329, in run
    testMethod()
  File "/home/jenkins/workspace/plone-5.1-python-2.7 at 3/src/plone.app.content/plone/app/content/tests/test_folder.py", line 90, in testSetDexterityExcludeFromNav
    self.assertEquals(self.portal.page.exclude_from_nav, True)
  File "/usr/lib/python2.7/unittest/case.py", line 513, in assertEqual
    assertion_func(first, second, msg=msg)
  File "/usr/lib/python2.7/unittest/case.py", line 506, in _baseAssertEqual
    raise self.failureException(msg)


FAILED:  plone.app.content.tests.test_folder.RearrangeDXTest.test_rearrange_by_title

Error Message:
Lists differ: [('f3', 'Folder 1'), ('f2', 'F... != [('f4', 'Folder 0'), ('f3', 'F...

Stack Trace:
Lists differ: [('f3', 'Folder 1'), ('f2', 'F... != [('f4', 'Folder 0'), ('f3', 'F...

First differing element 0:
('f3', 'Folder 1')
('f4', 'Folder 0')

+ [('f4', 'Folder 0'),
- [('f3', 'Folder 1'),
? ^

+  ('f3', 'Folder 1'),
? ^

   ('f2', 'Folder 2'),
   ('f1', 'Folder 3'),
-  ('f0', 'Folder 4'),
?                    ^

+  ('f0', 'Folder 4')]
?                    ^

-  ('f4', 'Folder 0')]

  File "/usr/lib/python2.7/unittest/case.py", line 329, in run
    testMethod()
  File "/home/jenkins/workspace/plone-5.1-python-2.7 at 3/src/plone.app.content/plone/app/content/tests/test_folder.py", line 412, in test_rearrange_by_title
    ('f0', 'Folder 4'),
  File "/usr/lib/python2.7/unittest/case.py", line 513, in assertEqual
    assertion_func(first, second, msg=msg)
  File "/usr/lib/python2.7/unittest/case.py", line 742, in assertListEqual
    self.assertSequenceEqual(list1, list2, msg, seq_type=list)
  File "/usr/lib/python2.7/unittest/case.py", line 724, in assertSequenceEqual
    self.fail(msg)
  File "/usr/lib/python2.7/unittest/case.py", line 410, in fail
    raise self.failureException(msg)


FAILED:  plone.app.content.tests.test_folder.RenameTest.test_default_page_updated_on_rename_objects

Error Message:
'page' != 'page-renamed'

Stack Trace:
'page' != 'page-renamed'

  File "/usr/lib/python2.7/unittest/case.py", line 329, in run
    testMethod()
  File "/home/jenkins/workspace/plone-5.1-python-2.7 at 3/src/plone.app.content/plone/app/content/tests/test_folder.py", line 215, in test_default_page_updated_on_rename_objects
    self.assertEqual(self.portal.getDefaultPage(), 'page-renamed')
  File "/usr/lib/python2.7/unittest/case.py", line 513, in assertEqual
    assertion_func(first, second, msg=msg)
  File "/usr/lib/python2.7/unittest/case.py", line 506, in _baseAssertEqual
    raise self.failureException(msg)


FAILED:  plone.app.content.tests.test_folder.RenameTest.test_folder_rename_objects

Error Message:
'new-id-_'

Stack Trace:
'new-id-_'

  File "/usr/lib/python2.7/unittest/case.py", line 329, in run
    testMethod()
  File "/home/jenkins/workspace/plone-5.1-python-2.7 at 3/src/plone.app.content/plone/app/content/tests/test_folder.py", line 202, in test_folder_rename_objects
    self.assertEqual(self.portal['new-id-_'].title, "Newer!")
  File "/home/jenkins/.buildout/eggs/Zope2-2.13.26-py2.7.egg/OFS/ObjectManager.py", line 783, in __getitem__
    raise KeyError, key


FAILED:  plone.app.content.tests.test_folder.WorkflowTest.testStateChange

Error Message:
'private' != 'published'

Stack Trace:
'private' != 'published'

  File "/usr/lib/python2.7/unittest/case.py", line 329, in run
    testMethod()
  File "/home/jenkins/workspace/plone-5.1-python-2.7 at 3/src/plone.app.content/plone/app/content/tests/test_folder.py", line 179, in testStateChange
    'published')
  File "/usr/lib/python2.7/unittest/case.py", line 513, in assertEqual
    assertion_func(first, second, msg=msg)
  File "/usr/lib/python2.7/unittest/case.py", line 506, in _baseAssertEqual
    raise self.failureException(msg)


FAILED:  plone.app.content.tests.test_widgets.BrowserTest.testUntranslatableMetadata

Error Message:
list index out of range

Stack Trace:
list index out of range

  File "/home/jenkins/.buildout/eggs/unittest2-0.5.1-py2.7.egg/unittest2/case.py", line 340, in run
    testMethod()
  File "/home/jenkins/.buildout/eggs/mock-1.0.1-py2.7.egg/mock.py", line 1201, in patched
    return func(*args, **keywargs)
  File "/home/jenkins/workspace/plone-5.1-python-2.7 at 3/src/plone.app.content/plone/app/content/tests/test_widgets.py", line 561, in testUntranslatableMetadata
    self.assertEqual(data['results'][0]['Type'], u'Seite')


FAILED:  plone.app.content.tests.test_widgets.BrowserTest.testVocabularyBatching

Error Message:
29 != 30

Stack Trace:
29 != 30

  File "/home/jenkins/.buildout/eggs/unittest2-0.5.1-py2.7.egg/unittest2/case.py", line 340, in run
    testMethod()
  File "/home/jenkins/workspace/plone-5.1-python-2.7 at 3/src/plone.app.content/plone/app/content/tests/test_widgets.py", line 248, in testVocabularyBatching
    self.assertEquals(data['total'], amount)
  File "/home/jenkins/.buildout/eggs/unittest2-0.5.1-py2.7.egg/unittest2/case.py", line 521, in assertEqual
    assertion_func(first, second, msg=msg)
  File "/home/jenkins/.buildout/eggs/unittest2-0.5.1-py2.7.egg/unittest2/case.py", line 514, in _baseAssertEqual
    raise self.failureException(msg)


FAILED:  plone.app.content.tests.test_widgets.BrowserTest.testVocabularyCatalogResults

Error Message:
0 != 1

Stack Trace:
0 != 1

  File "/home/jenkins/.buildout/eggs/unittest2-0.5.1-py2.7.egg/unittest2/case.py", line 340, in run
    testMethod()
  File "/home/jenkins/workspace/plone-5.1-python-2.7 at 3/src/plone.app.content/plone/app/content/tests/test_widgets.py", line 155, in testVocabularyCatalogResults
    self.assertEquals(len(data['results']), 1)
  File "/home/jenkins/.buildout/eggs/unittest2-0.5.1-py2.7.egg/unittest2/case.py", line 521, in assertEqual
    assertion_func(first, second, msg=msg)
  File "/home/jenkins/.buildout/eggs/unittest2-0.5.1-py2.7.egg/unittest2/case.py", line 514, in _baseAssertEqual
    raise self.failureException(msg)


FAILED:  plone.app.content.tests.test_widgets.BrowserTest.testVocabularyCatalogUnsafeMetadataAllowed

Error Message:
list index out of range

Stack Trace:
list index out of range

  File "/home/jenkins/.buildout/eggs/unittest2-0.5.1-py2.7.egg/unittest2/case.py", line 340, in run
    testMethod()
  File "/home/jenkins/workspace/plone-5.1-python-2.7 at 3/src/plone.app.content/plone/app/content/tests/test_widgets.py", line 184, in testVocabularyCatalogUnsafeMetadataAllowed
    self.assertEquals(len(data['results'][0].keys()), 4)


FAILED:  plone.app.content.tests.test_widgets.BrowserTest.testVocabularyCatalogUnsafeMetadataDisallowed

Error Message:
list index out of range

Stack Trace:
list index out of range

  File "/home/jenkins/.buildout/eggs/unittest2-0.5.1-py2.7.egg/unittest2/case.py", line 340, in run
    testMethod()
  File "/home/jenkins/workspace/plone-5.1-python-2.7 at 3/src/plone.app.content/plone/app/content/tests/test_widgets.py", line 218, in testVocabularyCatalogUnsafeMetadataDisallowed
    self.assertEquals(len(data['results'][0].keys()), 1)


FAILED:  plone.app.contentlisting.tests.test_integration_unit.TestCollectionResults.test_batching_collection_results

Error Message:
0

Stack Trace:
0

  File "/usr/lib/python2.7/unittest/case.py", line 329, in run
    testMethod()
  File "/home/jenkins/.buildout/eggs/plone.app.contentlisting-1.2.8-py2.7.egg/plone/app/contentlisting/tests/test_integration_unit.py", line 347, in test_batching_collection_results
    self.assertTrue(verifyObject(IContentListingObject, contentlisting[0]))
  File "/home/jenkins/.buildout/eggs/plone.batching-1.1.1-py2.7.egg/plone/batching/batch.py", line 159, in __getitem__
    raise IndexError(index)


FAILED:  plone.app.contentlisting.tests.test_integration_unit.TestCollectionResults.test_batching_collection_results_2

Error Message:
1 != 2

Stack Trace:
1 != 2

  File "/usr/lib/python2.7/unittest/case.py", line 329, in run
    testMethod()
  File "/home/jenkins/.buildout/eggs/plone.app.contentlisting-1.2.8-py2.7.egg/plone/app/contentlisting/tests/test_integration_unit.py", line 360, in test_batching_collection_results_2
    self.assertEqual(len(contentlisting), 2)
  File "/usr/lib/python2.7/unittest/case.py", line 513, in assertEqual
    assertion_func(first, second, msg=msg)
  File "/usr/lib/python2.7/unittest/case.py", line 506, in _baseAssertEqual
    raise self.failureException(msg)


FAILED:  plone.app.contentlisting.tests.test_integration_unit.TestCollectionResults.test_filtering_collection_results_to_news_items

Error Message:
0 != 1

Stack Trace:
0 != 1

  File "/usr/lib/python2.7/unittest/case.py", line 329, in run
    testMethod()
  File "/home/jenkins/.buildout/eggs/plone.app.contentlisting-1.2.8-py2.7.egg/plone/app/contentlisting/tests/test_integration_unit.py", line 327, in test_filtering_collection_results_to_news_items
    self.assertEqual(len(contentlisting), 1)
  File "/usr/lib/python2.7/unittest/case.py", line 513, in assertEqual
    assertion_func(first, second, msg=msg)
  File "/usr/lib/python2.7/unittest/case.py", line 506, in _baseAssertEqual
    raise self.failureException(msg)


FAILED:  plone.app.contentlisting.tests.test_integration_unit.TestCollectionResults.test_item_in_collection_results

Error Message:
0 != 1

Stack Trace:
0 != 1

  File "/usr/lib/python2.7/unittest/case.py", line 329, in run
    testMethod()
  File "/home/jenkins/.buildout/eggs/plone.app.contentlisting-1.2.8-py2.7.egg/plone/app/contentlisting/tests/test_integration_unit.py", line 335, in test_item_in_collection_results
    self.assertEqual(len(contentlisting), 1)
  File "/usr/lib/python2.7/unittest/case.py", line 513, in assertEqual
    assertion_func(first, second, msg=msg)
  File "/usr/lib/python2.7/unittest/case.py", line 506, in _baseAssertEqual
    raise self.failureException(msg)


FAILED:  plone.app.contentlisting.tests.test_integration_unit.TestFolderContents.test_batching_folder_contents

Error Message:
0 != 1

Stack Trace:
0 != 1

  File "/usr/lib/python2.7/unittest/case.py", line 329, in run
    testMethod()
  File "/home/jenkins/.buildout/eggs/plone.app.contentlisting-1.2.8-py2.7.egg/plone/app/contentlisting/tests/test_integration_unit.py", line 264, in test_batching_folder_contents
    self.assertEqual(len(contentlisting), 1)
  File "/usr/lib/python2.7/unittest/case.py", line 513, in assertEqual
    assertion_func(first, second, msg=msg)
  File "/usr/lib/python2.7/unittest/case.py", line 506, in _baseAssertEqual
    raise self.failureException(msg)


FAILED:  plone.app.contentlisting.tests.test_integration_unit.TestFolderContents.test_batching_folder_contents_2

Error Message:
1 != 2

Stack Trace:
1 != 2

  File "/usr/lib/python2.7/unittest/case.py", line 329, in run
    testMethod()
  File "/home/jenkins/.buildout/eggs/plone.app.contentlisting-1.2.8-py2.7.egg/plone/app/contentlisting/tests/test_integration_unit.py", line 275, in test_batching_folder_contents_2
    self.assertEqual(contentlisting.actual_result_count, 2)
  File "/usr/lib/python2.7/unittest/case.py", line 513, in assertEqual
    assertion_func(first, second, msg=msg)
  File "/usr/lib/python2.7/unittest/case.py", line 506, in _baseAssertEqual
    raise self.failureException(msg)


FAILED:  plone.app.contentlisting.tests.test_integration_unit.TestFolderContents.test_item_in_folder_contents

Error Message:
0 != 1

Stack Trace:
0 != 1

  File "/usr/lib/python2.7/unittest/case.py", line 329, in run
    testMethod()
  File "/home/jenkins/.buildout/eggs/plone.app.contentlisting-1.2.8-py2.7.egg/plone/app/contentlisting/tests/test_integration_unit.py", line 247, in test_item_in_folder_contents
    self.assertEqual(len(contentlisting), 1)
  File "/usr/lib/python2.7/unittest/case.py", line 513, in assertEqual
    assertion_func(first, second, msg=msg)
  File "/usr/lib/python2.7/unittest/case.py", line 506, in _baseAssertEqual
    raise self.failureException(msg)


FAILED:  plone.app.contentlisting.tests.test_integration_unit.TestIndividualCatalogContentItems.test_appendViewAction

Error Message:
0

Stack Trace:
0

  File "/usr/lib/python2.7/unittest/case.py", line 320, in run
    self.setUp()
  File "/home/jenkins/.buildout/eggs/plone.app.contentlisting-1.2.8-py2.7.egg/plone/app/contentlisting/tests/test_integration_unit.py", line 66, in setUp
    self.item = self.folder.restrictedTraverse('@@folderListing')()[0]
  File "/home/jenkins/.buildout/eggs/plone.app.contentlisting-1.2.8-py2.7.egg/plone/app/contentlisting/contentlisting.py", line 22, in __getitem__
    return IContentListingObject(self._basesequence[index])
  File "/home/jenkins/.buildout/eggs/Products.ZCatalog-3.0.2-py2.7.egg/Products/ZCatalog/Lazy.py", line 132, in __getitem__
    raise IndexError(index)


FAILED:  plone.app.contentlisting.tests.test_integration_unit.TestIndividualCatalogContentItems.test_comparision

Error Message:
0

Stack Trace:
0

  File "/usr/lib/python2.7/unittest/case.py", line 320, in run
    self.setUp()
  File "/home/jenkins/.buildout/eggs/plone.app.contentlisting-1.2.8-py2.7.egg/plone/app/contentlisting/tests/test_integration_unit.py", line 66, in setUp
    self.item = self.folder.restrictedTraverse('@@folderListing')()[0]
  File "/home/jenkins/.buildout/eggs/plone.app.contentlisting-1.2.8-py2.7.egg/plone/app/contentlisting/contentlisting.py", line 22, in __getitem__
    return IContentListingObject(self._basesequence[index])
  File "/home/jenkins/.buildout/eggs/Products.ZCatalog-3.0.2-py2.7.egg/Products/ZCatalog/Lazy.py", line 132, in __getitem__
    raise IndexError(index)


FAILED:  plone.app.contentlisting.tests.test_integration_unit.TestIndividualCatalogContentItems.test_containment

Error Message:
0

Stack Trace:
0

  File "/usr/lib/python2.7/unittest/case.py", line 320, in run
    self.setUp()
  File "/home/jenkins/.buildout/eggs/plone.app.contentlisting-1.2.8-py2.7.egg/plone/app/contentlisting/tests/test_integration_unit.py", line 66, in setUp
    self.item = self.folder.restrictedTraverse('@@folderListing')()[0]
  File "/home/jenkins/.buildout/eggs/plone.app.contentlisting-1.2.8-py2.7.egg/plone/app/contentlisting/contentlisting.py", line 22, in __getitem__
    return IContentListingObject(self._basesequence[index])
  File "/home/jenkins/.buildout/eggs/Products.ZCatalog-3.0.2-py2.7.egg/Products/ZCatalog/Lazy.py", line 132, in __getitem__
    raise IndexError(index)


FAILED:  plone.app.contentlisting.tests.test_integration_unit.TestIndividualCatalogContentItems.test_item_ContentTypeClass

Error Message:
0

Stack Trace:
0

  File "/usr/lib/python2.7/unittest/case.py", line 320, in run
    self.setUp()
  File "/home/jenkins/.buildout/eggs/plone.app.contentlisting-1.2.8-py2.7.egg/plone/app/contentlisting/tests/test_integration_unit.py", line 66, in setUp
    self.item = self.folder.restrictedTraverse('@@folderListing')()[0]
  File "/home/jenkins/.buildout/eggs/plone.app.contentlisting-1.2.8-py2.7.egg/plone/app/contentlisting/contentlisting.py", line 22, in __getitem__
    return IContentListingObject(self._basesequence[index])
  File "/home/jenkins/.buildout/eggs/Products.ZCatalog-3.0.2-py2.7.egg/Products/ZCatalog/Lazy.py", line 132, in __getitem__
    raise IndexError(index)


FAILED:  plone.app.contentlisting.tests.test_integration_unit.TestIndividualCatalogContentItems.test_item_Creator

Error Message:
0

Stack Trace:
0

  File "/usr/lib/python2.7/unittest/case.py", line 320, in run
    self.setUp()
  File "/home/jenkins/.buildout/eggs/plone.app.contentlisting-1.2.8-py2.7.egg/plone/app/contentlisting/tests/test_integration_unit.py", line 66, in setUp
    self.item = self.folder.restrictedTraverse('@@folderListing')()[0]
  File "/home/jenkins/.buildout/eggs/plone.app.contentlisting-1.2.8-py2.7.egg/plone/app/contentlisting/contentlisting.py", line 22, in __getitem__
    return IContentListingObject(self._basesequence[index])
  File "/home/jenkins/.buildout/eggs/Products.ZCatalog-3.0.2-py2.7.egg/Products/ZCatalog/Lazy.py", line 132, in __getitem__
    raise IndexError(index)


FAILED:  plone.app.contentlisting.tests.test_integration_unit.TestIndividualCatalogContentItems.test_item_Description

Error Message:
0

Stack Trace:
0

  File "/usr/lib/python2.7/unittest/case.py", line 320, in run
    self.setUp()
  File "/home/jenkins/.buildout/eggs/plone.app.contentlisting-1.2.8-py2.7.egg/plone/app/contentlisting/tests/test_integration_unit.py", line 66, in setUp
    self.item = self.folder.restrictedTraverse('@@folderListing')()[0]
  File "/home/jenkins/.buildout/eggs/plone.app.contentlisting-1.2.8-py2.7.egg/plone/app/contentlisting/contentlisting.py", line 22, in __getitem__
    return IContentListingObject(self._basesequence[index])
  File "/home/jenkins/.buildout/eggs/Products.ZCatalog-3.0.2-py2.7.egg/Products/ZCatalog/Lazy.py", line 132, in __getitem__
    raise IndexError(index)


FAILED:  plone.app.contentlisting.tests.test_integration_unit.TestIndividualCatalogContentItems.test_item_Title

Error Message:
0

Stack Trace:
0

  File "/usr/lib/python2.7/unittest/case.py", line 320, in run
    self.setUp()
  File "/home/jenkins/.buildout/eggs/plone.app.contentlisting-1.2.8-py2.7.egg/plone/app/contentlisting/tests/test_integration_unit.py", line 66, in setUp
    self.item = self.folder.restrictedTraverse('@@folderListing')()[0]
  File "/home/jenkins/.buildout/eggs/plone.app.contentlisting-1.2.8-py2.7.egg/plone/app/contentlisting/contentlisting.py", line 22, in __getitem__
    return IContentListingObject(self._basesequence[index])
  File "/home/jenkins/.buildout/eggs/Products.ZCatalog-3.0.2-py2.7.egg/Products/ZCatalog/Lazy.py", line 132, in __getitem__
    raise IndexError(index)


FAILED:  plone.app.contentlisting.tests.test_integration_unit.TestIndividualCatalogContentItems.test_item_Type

Error Message:
0

Stack Trace:
0

  File "/usr/lib/python2.7/unittest/case.py", line 320, in run
    self.setUp()
  File "/home/jenkins/.buildout/eggs/plone.app.contentlisting-1.2.8-py2.7.egg/plone/app/contentlisting/tests/test_integration_unit.py", line 66, in setUp
    self.item = self.folder.restrictedTraverse('@@folderListing')()[0]
  File "/home/jenkins/.buildout/eggs/plone.app.contentlisting-1.2.8-py2.7.egg/plone/app/contentlisting/contentlisting.py", line 22, in __getitem__
    return IContentListingObject(self._basesequence[index])
  File "/home/jenkins/.buildout/eggs/Products.ZCatalog-3.0.2-py2.7.egg/Products/ZCatalog/Lazy.py", line 132, in __getitem__
    raise IndexError(index)


FAILED:  plone.app.contentlisting.tests.test_integration_unit.TestIndividualCatalogContentItems.test_item_getSize

Error Message:
0

Stack Trace:
0

  File "/usr/lib/python2.7/unittest/case.py", line 320, in run
    self.setUp()
  File "/home/jenkins/.buildout/eggs/plone.app.contentlisting-1.2.8-py2.7.egg/plone/app/contentlisting/tests/test_integration_unit.py", line 66, in setUp
    self.item = self.folder.restrictedTraverse('@@folderListing')()[0]
  File "/home/jenkins/.buildout/eggs/plone.app.contentlisting-1.2.8-py2.7.egg/plone/app/contentlisting/contentlisting.py", line 22, in __getitem__
    return IContentListingObject(self._basesequence[index])
  File "/home/jenkins/.buildout/eggs/Products.ZCatalog-3.0.2-py2.7.egg/Products/ZCatalog/Lazy.py", line 132, in __getitem__
    raise IndexError(index)


FAILED:  plone.app.contentlisting.tests.test_integration_unit.TestIndividualCatalogContentItems.test_item_getURL

Error Message:
0

Stack Trace:
0

  File "/usr/lib/python2.7/unittest/case.py", line 320, in run
    self.setUp()
  File "/home/jenkins/.buildout/eggs/plone.app.contentlisting-1.2.8-py2.7.egg/plone/app/contentlisting/tests/test_integration_unit.py", line 66, in setUp
    self.item = self.folder.restrictedTraverse('@@folderListing')()[0]
  File "/home/jenkins/.buildout/eggs/plone.app.contentlisting-1.2.8-py2.7.egg/plone/app/contentlisting/contentlisting.py", line 22, in __getitem__
    return IContentListingObject(self._basesequence[index])
  File "/home/jenkins/.buildout/eggs/Products.ZCatalog-3.0.2-py2.7.egg/Products/ZCatalog/Lazy.py", line 132, in __getitem__
    raise IndexError(index)


FAILED:  plone.app.contentlisting.tests.test_integration_unit.TestIndividualCatalogContentItems.test_item_reviewState

Error Message:
0

Stack Trace:
0

  File "/usr/lib/python2.7/unittest/case.py", line 320, in run
    self.setUp()
  File "/home/jenkins/.buildout/eggs/plone.app.contentlisting-1.2.8-py2.7.egg/plone/app/contentlisting/tests/test_integration_unit.py", line 66, in setUp
    self.item = self.folder.restrictedTraverse('@@folderListing')()[0]
  File "/home/jenkins/.buildout/eggs/plone.app.contentlisting-1.2.8-py2.7.egg/plone/app/contentlisting/contentlisting.py", line 22, in __getitem__
    return IContentListingObject(self._basesequence[index])
  File "/home/jenkins/.buildout/eggs/Products.ZCatalog-3.0.2-py2.7.egg/Products/ZCatalog/Lazy.py", line 132, in __getitem__
    raise IndexError(index)


FAILED:  plone.app.contentlisting.tests.test_integration_unit.TestIndividualCatalogContentItems.test_printing_item

Error Message:
0

Stack Trace:
0

  File "/usr/lib/python2.7/unittest/case.py", line 320, in run
    self.setUp()
  File "/home/jenkins/.buildout/eggs/plone.app.contentlisting-1.2.8-py2.7.egg/plone/app/contentlisting/tests/test_integration_unit.py", line 66, in setUp
    self.item = self.folder.restrictedTraverse('@@folderListing')()[0]
  File "/home/jenkins/.buildout/eggs/plone.app.contentlisting-1.2.8-py2.7.egg/plone/app/contentlisting/contentlisting.py", line 22, in __getitem__
    return IContentListingObject(self._basesequence[index])
  File "/home/jenkins/.buildout/eggs/Products.ZCatalog-3.0.2-py2.7.egg/Products/ZCatalog/Lazy.py", line 132, in __getitem__
    raise IndexError(index)


FAILED:  plone.app.contentlisting.tests.test_integration_unit.TestIndividualCatalogContentItems.test_special_getattr_from_brain

Error Message:
0

Stack Trace:
0

  File "/usr/lib/python2.7/unittest/case.py", line 320, in run
    self.setUp()
  File "/home/jenkins/.buildout/eggs/plone.app.contentlisting-1.2.8-py2.7.egg/plone/app/contentlisting/tests/test_integration_unit.py", line 66, in setUp
    self.item = self.folder.restrictedTraverse('@@folderListing')()[0]
  File "/home/jenkins/.buildout/eggs/plone.app.contentlisting-1.2.8-py2.7.egg/plone/app/contentlisting/contentlisting.py", line 22, in __getitem__
    return IContentListingObject(self._basesequence[index])
  File "/home/jenkins/.buildout/eggs/Products.ZCatalog-3.0.2-py2.7.egg/Products/ZCatalog/Lazy.py", line 132, in __getitem__
    raise IndexError(index)


FAILED:  plone.app.contentlisting.tests.test_integration_unit.TestIndividualCatalogContentItems.test_special_getattr_from_object

Error Message:
0

Stack Trace:
0

  File "/usr/lib/python2.7/unittest/case.py", line 320, in run
    self.setUp()
  File "/home/jenkins/.buildout/eggs/plone.app.contentlisting-1.2.8-py2.7.egg/plone/app/contentlisting/tests/test_integration_unit.py", line 66, in setUp
    self.item = self.folder.restrictedTraverse('@@folderListing')()[0]
  File "/home/jenkins/.buildout/eggs/plone.app.contentlisting-1.2.8-py2.7.egg/plone/app/contentlisting/contentlisting.py", line 22, in __getitem__
    return IContentListingObject(self._basesequence[index])
  File "/home/jenkins/.buildout/eggs/Products.ZCatalog-3.0.2-py2.7.egg/Products/ZCatalog/Lazy.py", line 132, in __getitem__
    raise IndexError(index)


FAILED:  plone.app.contentlisting.tests.test_integration_unit.TestIndividualCatalogContentItems.test_special_getattr_with_underscore

Error Message:
0

Stack Trace:
0

  File "/usr/lib/python2.7/unittest/case.py", line 320, in run
    self.setUp()
  File "/home/jenkins/.buildout/eggs/plone.app.contentlisting-1.2.8-py2.7.egg/plone/app/contentlisting/tests/test_integration_unit.py", line 66, in setUp
    self.item = self.folder.restrictedTraverse('@@folderListing')()[0]
  File "/home/jenkins/.buildout/eggs/plone.app.contentlisting-1.2.8-py2.7.egg/plone/app/contentlisting/contentlisting.py", line 22, in __getitem__
    return IContentListingObject(self._basesequence[index])
  File "/home/jenkins/.buildout/eggs/Products.ZCatalog-3.0.2-py2.7.egg/Products/ZCatalog/Lazy.py", line 132, in __getitem__
    raise IndexError(index)


FAILED:  plone.app.contenttypes.tests.test_collection.PloneAppCollectionViewsIntegrationTest.test_custom_query

Error Message:
1 != 2

Stack Trace:
1 != 2

  File "/home/jenkins/.buildout/eggs/unittest2-0.5.1-py2.7.egg/unittest2/case.py", line 340, in run
    testMethod()
  File "/home/jenkins/.buildout/eggs/plone.app.contenttypes-1.2.22-py2.7.egg/plone/app/contenttypes/tests/test_collection.py", line 354, in test_custom_query
    self.assertEqual(len(results), 2)
  File "/home/jenkins/.buildout/eggs/unittest2-0.5.1-py2.7.egg/unittest2/case.py", line 521, in assertEqual
    assertion_func(first, second, msg=msg)
  File "/home/jenkins/.buildout/eggs/unittest2-0.5.1-py2.7.egg/unittest2/case.py", line 514, in _baseAssertEqual
    raise self.failureException(msg)


FAILED:  plone.app.contenttypes.tests.test_collection.PloneAppCollectionViewsIntegrationTest.test_sorting_1

Error Message:
list index out of range

Stack Trace:
list index out of range

  File "/home/jenkins/.buildout/eggs/unittest2-0.5.1-py2.7.egg/unittest2/case.py", line 340, in run
    testMethod()
  File "/home/jenkins/.buildout/eggs/plone.app.contenttypes-1.2.22-py2.7.egg/plone/app/contenttypes/tests/test_collection.py", line 316, in test_sorting_1
    ritem2 = results[2]
  File "/home/jenkins/.buildout/eggs/plone.app.contentlisting-1.2.8-py2.7.egg/plone/app/contentlisting/contentlisting.py", line 22, in __getitem__
    return IContentListingObject(self._basesequence[index])
  File "/home/jenkins/.buildout/eggs/Products.ZCatalog-3.0.2-py2.7.egg/Products/ZCatalog/Lazy.py", line 190, in __getitem__
    value = data[index] = self._func(self._seq[index])
  File "/home/jenkins/.buildout/eggs/Products.ZCatalog-3.0.2-py2.7.egg/Products/ZCatalog/Lazy.py", line 307, in __getitem__
    return self._seq[index][1]


FAILED:  plone.app.contenttypes.tests.test_folder.FolderViewIntegrationTest.test_result_filtering

Error Message:
1 != 2

Stack Trace:
1 != 2

  File "/home/jenkins/.buildout/eggs/unittest2-0.5.1-py2.7.egg/unittest2/case.py", line 340, in run
    testMethod()
  File "/home/jenkins/.buildout/eggs/plone.app.contenttypes-1.2.22-py2.7.egg/plone/app/contenttypes/tests/test_folder.py", line 83, in test_result_filtering
    self.assertEqual(len(res), 2)
  File "/home/jenkins/.buildout/eggs/unittest2-0.5.1-py2.7.egg/unittest2/case.py", line 521, in assertEqual
    assertion_func(first, second, msg=msg)
  File "/home/jenkins/.buildout/eggs/unittest2-0.5.1-py2.7.egg/unittest2/case.py", line 514, in _baseAssertEqual
    raise self.failureException(msg)


FAILED:  plone.app.contenttypes.tests.test_indexes.CatalogIntegrationTest.test_description_in_metadata

Error Message:
'' != 'My description'

Stack Trace:
'' != 'My description'

  File "/home/jenkins/.buildout/eggs/unittest2-0.5.1-py2.7.egg/unittest2/case.py", line 340, in run
    testMethod()
  File "/home/jenkins/.buildout/eggs/plone.app.contenttypes-1.2.22-py2.7.egg/plone/app/contenttypes/tests/test_indexes.py", line 242, in test_description_in_metadata
    'My description'
  File "/home/jenkins/.buildout/eggs/unittest2-0.5.1-py2.7.egg/unittest2/case.py", line 521, in assertEqual
    assertion_func(first, second, msg=msg)
  File "/home/jenkins/.buildout/eggs/unittest2-0.5.1-py2.7.egg/unittest2/case.py", line 514, in _baseAssertEqual
    raise self.failureException(msg)


FAILED:  plone.app.contenttypes.tests.test_indexes.CatalogIntegrationTest.test_description_in_searchable_text_index

Error Message:
0 != 1

Stack Trace:
0 != 1

  File "/home/jenkins/.buildout/eggs/unittest2-0.5.1-py2.7.egg/unittest2/case.py", line 340, in run
    testMethod()
  File "/home/jenkins/.buildout/eggs/plone.app.contenttypes-1.2.22-py2.7.egg/plone/app/contenttypes/tests/test_indexes.py", line 82, in test_description_in_searchable_text_index
    self.assertEqual(len(brains), 1)
  File "/home/jenkins/.buildout/eggs/unittest2-0.5.1-py2.7.egg/unittest2/case.py", line 521, in assertEqual
    assertion_func(first, second, msg=msg)
  File "/home/jenkins/.buildout/eggs/unittest2-0.5.1-py2.7.egg/unittest2/case.py", line 514, in _baseAssertEqual
    raise self.failureException(msg)


FAILED:  plone.app.contenttypes.tests.test_indexes.CatalogIntegrationTest.test_file_fulltext_in_searchable_text_index_string

Error Message:
0 != 1

Stack Trace:
0 != 1

  File "/home/jenkins/.buildout/eggs/unittest2-0.5.1-py2.7.egg/unittest2/case.py", line 340, in run
    testMethod()
  File "/home/jenkins/.buildout/eggs/plone.app.contenttypes-1.2.22-py2.7.egg/plone/app/contenttypes/tests/test_indexes.py", line 191, in test_file_fulltext_in_searchable_text_index_string
    self.assertEqual(len(brains), 1)
  File "/home/jenkins/.buildout/eggs/unittest2-0.5.1-py2.7.egg/unittest2/case.py", line 521, in assertEqual
    assertion_func(first, second, msg=msg)
  File "/home/jenkins/.buildout/eggs/unittest2-0.5.1-py2.7.egg/unittest2/case.py", line 514, in _baseAssertEqual
    raise self.failureException(msg)


FAILED:  plone.app.contenttypes.tests.test_indexes.CatalogIntegrationTest.test_file_fulltext_in_searchable_text_index_unicode

Error Message:
0 != 1

Stack Trace:
0 != 1

  File "/home/jenkins/.buildout/eggs/unittest2-0.5.1-py2.7.egg/unittest2/case.py", line 340, in run
    testMethod()
  File "/home/jenkins/.buildout/eggs/plone.app.contenttypes-1.2.22-py2.7.egg/plone/app/contenttypes/tests/test_indexes.py", line 213, in test_file_fulltext_in_searchable_text_index_unicode
    self.assertEqual(len(brains), 1)
  File "/home/jenkins/.buildout/eggs/unittest2-0.5.1-py2.7.egg/unittest2/case.py", line 521, in assertEqual
    assertion_func(first, second, msg=msg)
  File "/home/jenkins/.buildout/eggs/unittest2-0.5.1-py2.7.egg/unittest2/case.py", line 514, in _baseAssertEqual
    raise self.failureException(msg)


FAILED:  plone.app.contenttypes.tests.test_indexes.CatalogIntegrationTest.test_folder_fields_in_searchable_text_index

Error Message:
0 != 1

Stack Trace:
0 != 1

  File "/home/jenkins/.buildout/eggs/unittest2-0.5.1-py2.7.egg/unittest2/case.py", line 340, in run
    testMethod()
  File "/home/jenkins/.buildout/eggs/plone.app.contenttypes-1.2.22-py2.7.egg/plone/app/contenttypes/tests/test_indexes.py", line 108, in test_folder_fields_in_searchable_text_index
    self.assertEqual(len(brains), 1)
  File "/home/jenkins/.buildout/eggs/unittest2-0.5.1-py2.7.egg/unittest2/case.py", line 521, in assertEqual
    assertion_func(first, second, msg=msg)
  File "/home/jenkins/.buildout/eggs/unittest2-0.5.1-py2.7.egg/unittest2/case.py", line 514, in _baseAssertEqual
    raise self.failureException(msg)


FAILED:  plone.app.contenttypes.tests.test_indexes.CatalogIntegrationTest.test_get_remote_url_in_metadata

Error Message:
u'http://' != 'http://www.plone.org/'

Stack Trace:
u'http://' != 'http://www.plone.org/'

  File "/home/jenkins/.buildout/eggs/unittest2-0.5.1-py2.7.egg/unittest2/case.py", line 340, in run
    testMethod()
  File "/home/jenkins/.buildout/eggs/plone.app.contenttypes-1.2.22-py2.7.egg/plone/app/contenttypes/tests/test_indexes.py", line 253, in test_get_remote_url_in_metadata
    'http://www.plone.org/'
  File "/home/jenkins/.buildout/eggs/unittest2-0.5.1-py2.7.egg/unittest2/case.py", line 521, in assertEqual
    assertion_func(first, second, msg=msg)
  File "/home/jenkins/.buildout/eggs/unittest2-0.5.1-py2.7.egg/unittest2/case.py", line 514, in _baseAssertEqual
    raise self.failureException(msg)


FAILED:  plone.app.contenttypes.tests.test_indexes.CatalogIntegrationTest.test_get_remote_url_in_metadata_variables_replaced

Error Message:
u'http://' != '/plone/my-item'

Stack Trace:
u'http://' != '/plone/my-item'

  File "/home/jenkins/.buildout/eggs/unittest2-0.5.1-py2.7.egg/unittest2/case.py", line 340, in run
    testMethod()
  File "/home/jenkins/.buildout/eggs/plone.app.contenttypes-1.2.22-py2.7.egg/plone/app/contenttypes/tests/test_indexes.py", line 269, in test_get_remote_url_in_metadata_variables_replaced
    '/plone/my-item'
  File "/home/jenkins/.buildout/eggs/unittest2-0.5.1-py2.7.egg/unittest2/case.py", line 521, in assertEqual
    assertion_func(first, second, msg=msg)
  File "/home/jenkins/.buildout/eggs/unittest2-0.5.1-py2.7.egg/unittest2/case.py", line 514, in _baseAssertEqual
    raise self.failureException(msg)


FAILED:  plone.app.contenttypes.tests.test_indexes.CatalogIntegrationTest.test_getobjsize_file

Error Message:
'5.0 KB' != Missing.Value

Stack Trace:
'5.0 KB' != Missing.Value

  File "/home/jenkins/.buildout/eggs/unittest2-0.5.1-py2.7.egg/unittest2/case.py", line 340, in run
    testMethod()
  File "/home/jenkins/.buildout/eggs/plone.app.contenttypes-1.2.22-py2.7.egg/plone/app/contenttypes/tests/test_indexes.py", line 307, in test_getobjsize_file
    brains[0].getObjSize,
  File "/home/jenkins/.buildout/eggs/unittest2-0.5.1-py2.7.egg/unittest2/case.py", line 521, in assertEqual
    assertion_func(first, second, msg=msg)
  File "/home/jenkins/.buildout/eggs/unittest2-0.5.1-py2.7.egg/unittest2/case.py", line 514, in _baseAssertEqual
    raise self.failureException(msg)


FAILED:  plone.app.contenttypes.tests.test_indexes.CatalogIntegrationTest.test_getobjsize_image

Error Message:
'5.0 KB' != Missing.Value

Stack Trace:
'5.0 KB' != Missing.Value

  File "/home/jenkins/.buildout/eggs/unittest2-0.5.1-py2.7.egg/unittest2/case.py", line 340, in run
    testMethod()
  File "/home/jenkins/.buildout/eggs/plone.app.contenttypes-1.2.22-py2.7.egg/plone/app/contenttypes/tests/test_indexes.py", line 286, in test_getobjsize_image
    brains[0].getObjSize,
  File "/home/jenkins/.buildout/eggs/unittest2-0.5.1-py2.7.egg/unittest2/case.py", line 521, in assertEqual
    assertion_func(first, second, msg=msg)
  File "/home/jenkins/.buildout/eggs/unittest2-0.5.1-py2.7.egg/unittest2/case.py", line 514, in _baseAssertEqual
    raise self.failureException(msg)


FAILED:  plone.app.contenttypes.tests.test_indexes.CatalogIntegrationTest.test_html_stripped_searchable_text_index

Error Message:
0 != 1

Stack Trace:
0 != 1

  File "/home/jenkins/.buildout/eggs/unittest2-0.5.1-py2.7.egg/unittest2/case.py", line 340, in run
    testMethod()
  File "/home/jenkins/.buildout/eggs/plone.app.contenttypes-1.2.22-py2.7.egg/plone/app/contenttypes/tests/test_indexes.py", line 173, in test_html_stripped_searchable_text_index
    self.assertEqual(len(brains), 1)
  File "/home/jenkins/.buildout/eggs/unittest2-0.5.1-py2.7.egg/unittest2/case.py", line 521, in assertEqual
    assertion_func(first, second, msg=msg)
  File "/home/jenkins/.buildout/eggs/unittest2-0.5.1-py2.7.egg/unittest2/case.py", line 514, in _baseAssertEqual
    raise self.failureException(msg)


FAILED:  plone.app.contenttypes.tests.test_indexes.CatalogIntegrationTest.test_remote_url_in_searchable_text_index

Error Message:
0 != 1

Stack Trace:
0 != 1

  File "/home/jenkins/.buildout/eggs/unittest2-0.5.1-py2.7.egg/unittest2/case.py", line 340, in run
    testMethod()
  File "/home/jenkins/.buildout/eggs/plone.app.contenttypes-1.2.22-py2.7.egg/plone/app/contenttypes/tests/test_indexes.py", line 129, in test_remote_url_in_searchable_text_index
    self.assertEqual(len(brains), 1)
  File "/home/jenkins/.buildout/eggs/unittest2-0.5.1-py2.7.egg/unittest2/case.py", line 521, in assertEqual
    assertion_func(first, second, msg=msg)
  File "/home/jenkins/.buildout/eggs/unittest2-0.5.1-py2.7.egg/unittest2/case.py", line 514, in _baseAssertEqual
    raise self.failureException(msg)


FAILED:  plone.app.contenttypes.tests.test_indexes.CatalogIntegrationTest.test_subject_in_searchable_text_index

Error Message:
0 != 1

Stack Trace:
0 != 1

  File "/home/jenkins/.buildout/eggs/unittest2-0.5.1-py2.7.egg/unittest2/case.py", line 340, in run
    testMethod()
  File "/home/jenkins/.buildout/eggs/plone.app.contenttypes-1.2.22-py2.7.egg/plone/app/contenttypes/tests/test_indexes.py", line 94, in test_subject_in_searchable_text_index
    self.assertEqual(len(brains), 1)
  File "/home/jenkins/.buildout/eggs/unittest2-0.5.1-py2.7.egg/unittest2/case.py", line 521, in assertEqual
    assertion_func(first, second, msg=msg)
  File "/home/jenkins/.buildout/eggs/unittest2-0.5.1-py2.7.egg/unittest2/case.py", line 514, in _baseAssertEqual
    raise self.failureException(msg)


FAILED:  plone.app.contenttypes.tests.test_indexes.CatalogIntegrationTest.test_text_in_searchable_text_index

Error Message:
0 != 2

Stack Trace:
0 != 2

  File "/home/jenkins/.buildout/eggs/unittest2-0.5.1-py2.7.egg/unittest2/case.py", line 340, in run
    testMethod()
  File "/home/jenkins/.buildout/eggs/plone.app.contenttypes-1.2.22-py2.7.egg/plone/app/contenttypes/tests/test_indexes.py", line 151, in test_text_in_searchable_text_index
    self.assertEqual(len(brains), 2)
  File "/home/jenkins/.buildout/eggs/unittest2-0.5.1-py2.7.egg/unittest2/case.py", line 521, in assertEqual
    assertion_func(first, second, msg=msg)
  File "/home/jenkins/.buildout/eggs/unittest2-0.5.1-py2.7.egg/unittest2/case.py", line 514, in _baseAssertEqual
    raise self.failureException(msg)


FAILED:  plone.app.contenttypes.tests.test_indexes.CatalogIntegrationTest.test_title_in_metadata

Error Message:
'' != 'My title'

Stack Trace:
'' != 'My title'

  File "/home/jenkins/.buildout/eggs/unittest2-0.5.1-py2.7.egg/unittest2/case.py", line 340, in run
    testMethod()
  File "/home/jenkins/.buildout/eggs/plone.app.contenttypes-1.2.22-py2.7.egg/plone/app/contenttypes/tests/test_indexes.py", line 231, in test_title_in_metadata
    'My title'
  File "/home/jenkins/.buildout/eggs/unittest2-0.5.1-py2.7.egg/unittest2/case.py", line 521, in assertEqual
    assertion_func(first, second, msg=msg)
  File "/home/jenkins/.buildout/eggs/unittest2-0.5.1-py2.7.egg/unittest2/case.py", line 514, in _baseAssertEqual
    raise self.failureException(msg)


FAILED:  plone.app.contenttypes.tests.test_indexes.CatalogIntegrationTest.test_title_in_searchable_text_index

Error Message:
0 != 1

Stack Trace:
0 != 1

  File "/home/jenkins/.buildout/eggs/unittest2-0.5.1-py2.7.egg/unittest2/case.py", line 340, in run
    testMethod()
  File "/home/jenkins/.buildout/eggs/plone.app.contenttypes-1.2.22-py2.7.egg/plone/app/contenttypes/tests/test_indexes.py", line 70, in test_title_in_searchable_text_index
    self.assertEqual(len(brains), 1)
  File "/home/jenkins/.buildout/eggs/unittest2-0.5.1-py2.7.egg/unittest2/case.py", line 521, in assertEqual
    assertion_func(first, second, msg=msg)
  File "/home/jenkins/.buildout/eggs/unittest2-0.5.1-py2.7.egg/unittest2/case.py", line 514, in _baseAssertEqual
    raise self.failureException(msg)


FAILED:  plone.app.contenttypes.tests.test_migration.MigrateFromATContentTypesTest.test_at_dx_relations_migrated_for_partialy_migrated_nested

Error Message:
Lists differ: [] != [<Document at /plone/folder/do...

Stack Trace:
Lists differ: [] != [<Document at /plone/folder/do...

Second list contains 1 additional elements.
First extra element 0:
<Document at doc>

- []
+ [<Document at /plone/folder/doc>]

  File "/home/jenkins/.buildout/eggs/unittest2-0.5.1-py2.7.egg/unittest2/case.py", line 340, in run
    testMethod()
  File "/home/jenkins/.buildout/eggs/plone.app.contenttypes-1.2.22-py2.7.egg/plone/app/contenttypes/tests/test_migration.py", line 1242, in test_at_dx_relations_migrated_for_partialy_migrated_nested
    self.assertEqual(at_folder.getRelatedItems(), [dx_doc])
  File "/home/jenkins/.buildout/eggs/unittest2-0.5.1-py2.7.egg/unittest2/case.py", line 521, in assertEqual
    assertion_func(first, second, msg=msg)
  File "/home/jenkins/.buildout/eggs/unittest2-0.5.1-py2.7.egg/unittest2/case.py", line 752, in assertListEqual
    self.assertSequenceEqual(list1, list2, msg, seq_type=list)
  File "/home/jenkins/.buildout/eggs/unittest2-0.5.1-py2.7.egg/unittest2/case.py", line 734, in assertSequenceEqual
    self.fail(msg)
  File "/home/jenkins/.buildout/eggs/unittest2-0.5.1-py2.7.egg/unittest2/case.py", line 415, in fail
    raise self.failureException(msg)


FAILED:  plone.app.contenttypes.tests.test_migration.MigrateFromATContentTypesTest.test_backrelations_are_migrated_for_unnested_content

Error Message:
Lists differ: [] != [<Document at /plone/doc>]

Stack Trace:
Lists differ: [] != [<Document at /plone/doc>]

Second list contains 1 additional elements.
First extra element 0:
<Document at doc>

- []
+ [<Document at /plone/doc>]

  File "/home/jenkins/.buildout/eggs/unittest2-0.5.1-py2.7.egg/unittest2/case.py", line 340, in run
    testMethod()
  File "/home/jenkins/.buildout/eggs/plone.app.contenttypes-1.2.22-py2.7.egg/plone/app/contenttypes/tests/test_migration.py", line 1140, in test_backrelations_are_migrated_for_unnested_content
    self.assertEqual([i.to_object for i in dx_news.relatedItems], [dx_doc])
  File "/home/jenkins/.buildout/eggs/unittest2-0.5.1-py2.7.egg/unittest2/case.py", line 521, in assertEqual
    assertion_func(first, second, msg=msg)
  File "/home/jenkins/.buildout/eggs/unittest2-0.5.1-py2.7.egg/unittest2/case.py", line 752, in assertListEqual
    self.assertSequenceEqual(list1, list2, msg, seq_type=list)
  File "/home/jenkins/.buildout/eggs/unittest2-0.5.1-py2.7.egg/unittest2/case.py", line 734, in assertSequenceEqual
    self.fail(msg)
  File "/home/jenkins/.buildout/eggs/unittest2-0.5.1-py2.7.egg/unittest2/case.py", line 415, in fail
    raise self.failureException(msg)


FAILED:  plone.app.contenttypes.tests.test_migration.MigrateFromATContentTypesTest.test_dx_at_relations_migrated_for_partially_migrated_nested

Error Message:
Lists differ: [] != [<ATDocument at /plone/folder/...

Stack Trace:
Lists differ: [] != [<ATDocument at /plone/folder/...

Second list contains 1 additional elements.
First extra element 0:
<ATDocument at doc>

- []
+ [<ATDocument at /plone/folder/doc>]

  File "/home/jenkins/.buildout/eggs/unittest2-0.5.1-py2.7.egg/unittest2/case.py", line 340, in run
    testMethod()
  File "/home/jenkins/.buildout/eggs/plone.app.contenttypes-1.2.22-py2.7.egg/plone/app/contenttypes/tests/test_migration.py", line 1189, in test_dx_at_relations_migrated_for_partially_migrated_nested
    [i.to_object for i in dx_folder.relatedItems], [at_doc])
  File "/home/jenkins/.buildout/eggs/unittest2-0.5.1-py2.7.egg/unittest2/case.py", line 521, in assertEqual
    assertion_func(first, second, msg=msg)
  File "/home/jenkins/.buildout/eggs/unittest2-0.5.1-py2.7.egg/unittest2/case.py", line 752, in assertListEqual
    self.assertSequenceEqual(list1, list2, msg, seq_type=list)
  File "/home/jenkins/.buildout/eggs/unittest2-0.5.1-py2.7.egg/unittest2/case.py", line 734, in assertSequenceEqual
    self.fail(msg)
  File "/home/jenkins/.buildout/eggs/unittest2-0.5.1-py2.7.egg/unittest2/case.py", line 415, in fail
    raise self.failureException(msg)


FAILED:  plone.app.contenttypes.tests.test_migration.MigrateFromATContentTypesTest.test_dx_content_is_indexed

Error Message:
0 != 1

Stack Trace:
0 != 1

  File "/home/jenkins/.buildout/eggs/unittest2-0.5.1-py2.7.egg/unittest2/case.py", line 340, in run
    testMethod()
  File "/home/jenkins/.buildout/eggs/plone.app.contenttypes-1.2.22-py2.7.egg/plone/app/contenttypes/tests/test_migration.py", line 444, in test_dx_content_is_indexed
    self.assertEqual(len(brains), 1)
  File "/home/jenkins/.buildout/eggs/unittest2-0.5.1-py2.7.egg/unittest2/case.py", line 521, in assertEqual
    assertion_func(first, second, msg=msg)
  File "/home/jenkins/.buildout/eggs/unittest2-0.5.1-py2.7.egg/unittest2/case.py", line 514, in _baseAssertEqual
    raise self.failureException(msg)


FAILED:  plone.app.contenttypes.tests.test_migration.MigrateFromATContentTypesTest.test_export_references

Error Message:
1 != 2

Stack Trace:
1 != 2

  File "/home/jenkins/.buildout/eggs/unittest2-0.5.1-py2.7.egg/unittest2/case.py", line 340, in run
    testMethod()
  File "/home/jenkins/.buildout/eggs/plone.app.contenttypes-1.2.22-py2.7.egg/plone/app/contenttypes/tests/test_migration.py", line 1347, in test_export_references
    self.assertEqual(len(data), 2)
  File "/home/jenkins/.buildout/eggs/unittest2-0.5.1-py2.7.egg/unittest2/case.py", line 521, in assertEqual
    assertion_func(first, second, msg=msg)
  File "/home/jenkins/.buildout/eggs/unittest2-0.5.1-py2.7.egg/unittest2/case.py", line 514, in _baseAssertEqual
    raise self.failureException(msg)


FAILED:  plone.app.contenttypes.tests.test_migration.MigrateFromATContentTypesTest.test_migrate_references_with_storage_on_portal

Error Message:
Lists differ: [] != [<Document at /plone/doc>]

Stack Trace:
Lists differ: [] != [<Document at /plone/doc>]

Second list contains 1 additional elements.
First extra element 0:
<Document at doc>

- []
+ [<Document at /plone/doc>]

  File "/home/jenkins/.buildout/eggs/unittest2-0.5.1-py2.7.egg/unittest2/case.py", line 340, in run
    testMethod()
  File "/home/jenkins/.buildout/eggs/plone.app.contenttypes-1.2.22-py2.7.egg/plone/app/contenttypes/tests/test_migration.py", line 1401, in test_migrate_references_with_storage_on_portal
    [i.to_object for i in dx_folder.relatedItems], [dx_doc])
  File "/home/jenkins/.buildout/eggs/unittest2-0.5.1-py2.7.egg/unittest2/case.py", line 521, in assertEqual
    assertion_func(first, second, msg=msg)
  File "/home/jenkins/.buildout/eggs/unittest2-0.5.1-py2.7.egg/unittest2/case.py", line 752, in assertListEqual
    self.assertSequenceEqual(list1, list2, msg, seq_type=list)
  File "/home/jenkins/.buildout/eggs/unittest2-0.5.1-py2.7.egg/unittest2/case.py", line 734, in assertSequenceEqual
    self.fail(msg)
  File "/home/jenkins/.buildout/eggs/unittest2-0.5.1-py2.7.egg/unittest2/case.py", line 415, in fail
    raise self.failureException(msg)


FAILED:  plone.app.contenttypes.tests.test_migration.MigrateFromATContentTypesTest.test_migrate_xx_functions

Error Message:
11 != 12

Stack Trace:
11 != 12

  File "/home/jenkins/.buildout/eggs/unittest2-0.5.1-py2.7.egg/unittest2/case.py", line 340, in run
    testMethod()
  File "/home/jenkins/.buildout/eggs/plone.app.contenttypes-1.2.22-py2.7.egg/plone/app/contenttypes/tests/test_migration.py", line 1596, in test_migrate_xx_functions
    self.assertEqual(len(dx_contents), 12)
  File "/home/jenkins/.buildout/eggs/unittest2-0.5.1-py2.7.egg/unittest2/case.py", line 521, in assertEqual
    assertion_func(first, second, msg=msg)
  File "/home/jenkins/.buildout/eggs/unittest2-0.5.1-py2.7.egg/unittest2/case.py", line 514, in _baseAssertEqual
    raise self.failureException(msg)


FAILED:  plone.app.contenttypes.tests.test_migration.MigrateFromATContentTypesTest.test_old_content_is_removed

Error Message:
0 != 1

Stack Trace:
0 != 1

  File "/home/jenkins/.buildout/eggs/unittest2-0.5.1-py2.7.egg/unittest2/case.py", line 340, in run
    testMethod()
  File "/home/jenkins/.buildout/eggs/plone.app.contenttypes-1.2.22-py2.7.egg/plone/app/contenttypes/tests/test_migration.py", line 455, in test_old_content_is_removed
    self.assertEqual(len(brains), 1)
  File "/home/jenkins/.buildout/eggs/unittest2-0.5.1-py2.7.egg/unittest2/case.py", line 521, in assertEqual
    assertion_func(first, second, msg=msg)
  File "/home/jenkins/.buildout/eggs/unittest2-0.5.1-py2.7.egg/unittest2/case.py", line 514, in _baseAssertEqual
    raise self.failureException(msg)


FAILED:  plone.app.contenttypes.tests.test_migration.MigrateFromATContentTypesTest.test_references_are_set_correctly

Error Message:
Lists differ: [] != [<Document at /plone/folder2/d...

Stack Trace:
Lists differ: [] != [<Document at /plone/folder2/d...

Second list contains 1 additional elements.
First extra element 0:
<Document at doc2>

- []
+ [<Document at /plone/folder2/doc2>]

  File "/home/jenkins/.buildout/eggs/unittest2-0.5.1-py2.7.egg/unittest2/case.py", line 340, in run
    testMethod()
  File "/home/jenkins/.buildout/eggs/plone.app.contenttypes-1.2.22-py2.7.egg/plone/app/contenttypes/tests/test_migration.py", line 988, in test_references_are_set_correctly
    self.assertEqual(dx_doc1_related, [dx_doc2])
  File "/home/jenkins/.buildout/eggs/unittest2-0.5.1-py2.7.egg/unittest2/case.py", line 521, in assertEqual
    assertion_func(first, second, msg=msg)
  File "/home/jenkins/.buildout/eggs/unittest2-0.5.1-py2.7.egg/unittest2/case.py", line 752, in assertListEqual
    self.assertSequenceEqual(list1, list2, msg, seq_type=list)
  File "/home/jenkins/.buildout/eggs/unittest2-0.5.1-py2.7.egg/unittest2/case.py", line 734, in assertSequenceEqual
    self.fail(msg)
  File "/home/jenkins/.buildout/eggs/unittest2-0.5.1-py2.7.egg/unittest2/case.py", line 415, in fail
    raise self.failureException(msg)


FAILED:  plone.app.contenttypes.tests.test_migration.MigrateFromATContentTypesTest.test_relations_are_migrated

Error Message:
Lists differ: [] != [<Document at /plone/folder1/d...

Stack Trace:
Lists differ: [] != [<Document at /plone/folder1/d...

Second list contains 1 additional elements.
First extra element 0:
<Document at doc1>

- []
+ [<Document at /plone/folder1/doc1>]

  File "/home/jenkins/.buildout/eggs/unittest2-0.5.1-py2.7.egg/unittest2/case.py", line 340, in run
    testMethod()
  File "/home/jenkins/.buildout/eggs/plone.app.contenttypes-1.2.22-py2.7.egg/plone/app/contenttypes/tests/test_migration.py", line 1077, in test_relations_are_migrated
    [x.to_object for x in dx_folder2.relatedItems], [dx_doc1])
  File "/home/jenkins/.buildout/eggs/unittest2-0.5.1-py2.7.egg/unittest2/case.py", line 521, in assertEqual
    assertion_func(first, second, msg=msg)
  File "/home/jenkins/.buildout/eggs/unittest2-0.5.1-py2.7.egg/unittest2/case.py", line 752, in assertListEqual
    self.assertSequenceEqual(list1, list2, msg, seq_type=list)
  File "/home/jenkins/.buildout/eggs/unittest2-0.5.1-py2.7.egg/unittest2/case.py", line 734, in assertSequenceEqual
    self.fail(msg)
  File "/home/jenkins/.buildout/eggs/unittest2-0.5.1-py2.7.egg/unittest2/case.py", line 415, in fail
    raise self.failureException(msg)


FAILED:  plone.app.contenttypes.tests.test_migration.MigrateFromATContentTypesTest.test_stats

Error Message:
"{'ATDocument': 1}" != "{'Document': 1, 'ATDocument': 1}"

Stack Trace:
"{'ATDocument': 1}" != "{'Document': 1, 'ATDocument': 1}"

  File "/home/jenkins/.buildout/eggs/unittest2-0.5.1-py2.7.egg/unittest2/case.py", line 340, in run
    testMethod()
  File "/home/jenkins/.buildout/eggs/plone.app.contenttypes-1.2.22-py2.7.egg/plone/app/contenttypes/tests/test_migration.py", line 1423, in test_stats
    self.assertEqual(str(stats), "{'Document': 1, 'ATDocument': 1}")
  File "/home/jenkins/.buildout/eggs/unittest2-0.5.1-py2.7.egg/unittest2/case.py", line 521, in assertEqual
    assertion_func(first, second, msg=msg)
  File "/home/jenkins/.buildout/eggs/unittest2-0.5.1-py2.7.egg/unittest2/case.py", line 514, in _baseAssertEqual
    raise self.failureException(msg)


FAILED:  plone.app.contenttypes.tests.test_migration.MigrateFromATContentTypesTest.test_store_references

Error Message:
1 != 2

Stack Trace:
1 != 2

  File "/home/jenkins/.buildout/eggs/unittest2-0.5.1-py2.7.egg/unittest2/case.py", line 340, in run
    testMethod()
  File "/home/jenkins/.buildout/eggs/plone.app.contenttypes-1.2.22-py2.7.egg/plone/app/contenttypes/tests/test_migration.py", line 1312, in test_store_references
    self.assertEqual(len(IAnnotations(self.portal)[key]), 2)
  File "/home/jenkins/.buildout/eggs/unittest2-0.5.1-py2.7.egg/unittest2/case.py", line 521, in assertEqual
    assertion_func(first, second, msg=msg)
  File "/home/jenkins/.buildout/eggs/unittest2-0.5.1-py2.7.egg/unittest2/case.py", line 514, in _baseAssertEqual
    raise self.failureException(msg)


FAILED:  plone.app.contenttypes.tests.test_migration_browser.FixBaseclassesTest.test_fix_interface_for_document

Error Message:
False is not True

Stack Trace:
False is not True

  File "/home/jenkins/.buildout/eggs/unittest2-0.5.1-py2.7.egg/unittest2/case.py", line 340, in run
    testMethod()
  File "/home/jenkins/.buildout/eggs/plone.app.contenttypes-1.2.22-py2.7.egg/plone/app/contenttypes/tests/test_migration_browser.py", line 50, in test_fix_interface_for_document
    self.assertTrue(IDocument.providedBy(self.obj))
  File "/home/jenkins/.buildout/eggs/unittest2-0.5.1-py2.7.egg/unittest2/case.py", line 427, in assertTrue
    raise self.failureException(msg)


FAILED:  plone.app.contenttypes.tests.test_migration_browser.FixBaseclassesTest.test_fix_interface_for_file

Error Message:
False is not True

Stack Trace:
False is not True

  File "/home/jenkins/.buildout/eggs/unittest2-0.5.1-py2.7.egg/unittest2/case.py", line 340, in run
    testMethod()
  File "/home/jenkins/.buildout/eggs/plone.app.contenttypes-1.2.22-py2.7.egg/plone/app/contenttypes/tests/test_migration_browser.py", line 66, in test_fix_interface_for_file
    self.assertTrue(IFile.providedBy(self.obj))
  File "/home/jenkins/.buildout/eggs/unittest2-0.5.1-py2.7.egg/unittest2/case.py", line 427, in assertTrue
    raise self.failureException(msg)


FAILED:  plone.app.contenttypes.tests.test_migration_browser.FixBaseclassesTest.test_fix_interface_for_folder

Error Message:
False is not True

Stack Trace:
False is not True

  File "/home/jenkins/.buildout/eggs/unittest2-0.5.1-py2.7.egg/unittest2/case.py", line 340, in run
    testMethod()
  File "/home/jenkins/.buildout/eggs/plone.app.contenttypes-1.2.22-py2.7.egg/plone/app/contenttypes/tests/test_migration_browser.py", line 74, in test_fix_interface_for_folder
    self.assertTrue(IFolder.providedBy(self.obj))
  File "/home/jenkins/.buildout/eggs/unittest2-0.5.1-py2.7.egg/unittest2/case.py", line 427, in assertTrue
    raise self.failureException(msg)


FAILED:  plone.app.contenttypes.tests.test_migration_browser.FixBaseclassesTest.test_fix_interface_for_image

Error Message:
False is not True

Stack Trace:
False is not True

  File "/home/jenkins/.buildout/eggs/unittest2-0.5.1-py2.7.egg/unittest2/case.py", line 340, in run
    testMethod()
  File "/home/jenkins/.buildout/eggs/plone.app.contenttypes-1.2.22-py2.7.egg/plone/app/contenttypes/tests/test_migration_browser.py", line 82, in test_fix_interface_for_image
    self.assertTrue(IImage.providedBy(self.obj))
  File "/home/jenkins/.buildout/eggs/unittest2-0.5.1-py2.7.egg/unittest2/case.py", line 427, in assertTrue
    raise self.failureException(msg)


FAILED:  plone.app.contenttypes.tests.test_migration_browser.FixBaseclassesTest.test_fix_interface_for_link

Error Message:
False is not True

Stack Trace:
False is not True

  File "/home/jenkins/.buildout/eggs/unittest2-0.5.1-py2.7.egg/unittest2/case.py", line 340, in run
    testMethod()
  File "/home/jenkins/.buildout/eggs/plone.app.contenttypes-1.2.22-py2.7.egg/plone/app/contenttypes/tests/test_migration_browser.py", line 90, in test_fix_interface_for_link
    self.assertTrue(ILink.providedBy(self.obj))
  File "/home/jenkins/.buildout/eggs/unittest2-0.5.1-py2.7.egg/unittest2/case.py", line 427, in assertTrue
    raise self.failureException(msg)


FAILED:  plone.app.contenttypes.tests.test_migration_browser.FixBaseclassesTest.test_fix_interface_for_news_item

Error Message:
False is not True

Stack Trace:
False is not True

  File "/home/jenkins/.buildout/eggs/unittest2-0.5.1-py2.7.egg/unittest2/case.py", line 340, in run
    testMethod()
  File "/home/jenkins/.buildout/eggs/plone.app.contenttypes-1.2.22-py2.7.egg/plone/app/contenttypes/tests/test_migration_browser.py", line 98, in test_fix_interface_for_news_item
    self.assertTrue(INewsItem.providedBy(self.obj))
  File "/home/jenkins/.buildout/eggs/unittest2-0.5.1-py2.7.egg/unittest2/case.py", line 427, in assertTrue
    raise self.failureException(msg)


FAILED:  plone.app.contenttypes.tests.test_upgrades_migrate_to_pa_event.MigrateEventContentTypesTest.test_pact_1_0_dxevent_is_migrated

Error Message:
Lists differ: ['eventb', [2017, 2, 21], [201... != ['eventb', [2013, 3, 3], [2019...

Stack Trace:
Lists differ: ['eventb', [2017, 2, 21], [201... != ['eventb', [2013, 3, 3], [2019...

First differing element 1:
[2017, 2, 21]
[2013, 3, 3]

- ['eventb', [2017, 2, 21], [2017, 2, 21], u'Newbraska', u'Me\r\nYou']
?                ^  ^  ^^       ^  ^  ^^                 ^   ^^^^

+ ['eventb', [2013, 3, 3], [2019, 5, 6], u'Newbraska', ('Me', 'You')]
?                ^  ^  ^       ^  ^  ^                 ^   ^^^^    +


  File "/home/jenkins/.buildout/eggs/unittest2-0.5.1-py2.7.egg/unittest2/case.py", line 340, in run
    testMethod()
  File "/home/jenkins/.buildout/eggs/plone.app.contenttypes-1.2.22-py2.7.egg/plone/app/contenttypes/tests/test_upgrades_migrate_to_pa_event.py", line 117, in test_pact_1_0_dxevent_is_migrated
    u'Newbraska', ('Me', 'You')],
  File "/home/jenkins/.buildout/eggs/unittest2-0.5.1-py2.7.egg/unittest2/case.py", line 521, in assertEqual
    assertion_func(first, second, msg=msg)
  File "/home/jenkins/.buildout/eggs/unittest2-0.5.1-py2.7.egg/unittest2/case.py", line 752, in assertListEqual
    self.assertSequenceEqual(list1, list2, msg, seq_type=list)
  File "/home/jenkins/.buildout/eggs/unittest2-0.5.1-py2.7.egg/unittest2/case.py", line 734, in assertSequenceEqual
    self.fail(msg)
  File "/home/jenkins/.buildout/eggs/unittest2-0.5.1-py2.7.egg/unittest2/case.py", line 415, in fail
    raise self.failureException(msg)


FAILED:  plone.app.discussion.tests.test_catalog.CommentCatalogTest.test_add_comment

Error Message:
0

Stack Trace:
0

  File "/home/jenkins/.buildout/eggs/unittest2-0.5.1-py2.7.egg/unittest2/case.py", line 333, in run
    self.setUp()
  File "/home/jenkins/.buildout/eggs/plone.app.discussion-3.0.0-py2.7.egg/plone/app/discussion/tests/test_catalog.py", line 283, in setUp
    self.comment_brain = brains[0]
  File "/home/jenkins/.buildout/eggs/Products.ZCatalog-3.0.2-py2.7.egg/Products/ZCatalog/Lazy.py", line 132, in __getitem__
    raise IndexError(index)


FAILED:  plone.app.discussion.tests.test_catalog.CommentCatalogTest.test_clear_and_rebuild_catalog

Error Message:
0

Stack Trace:
0

  File "/home/jenkins/.buildout/eggs/unittest2-0.5.1-py2.7.egg/unittest2/case.py", line 333, in run
    self.setUp()
  File "/home/jenkins/.buildout/eggs/plone.app.discussion-3.0.0-py2.7.egg/plone/app/discussion/tests/test_catalog.py", line 283, in setUp
    self.comment_brain = brains[0]
  File "/home/jenkins/.buildout/eggs/Products.ZCatalog-3.0.2-py2.7.egg/Products/ZCatalog/Lazy.py", line 132, in __getitem__
    raise IndexError(index)


FAILED:  plone.app.discussion.tests.test_catalog.CommentCatalogTest.test_clear_and_rebuild_catalog_for_nested_comments

Error Message:
0

Stack Trace:
0

  File "/home/jenkins/.buildout/eggs/unittest2-0.5.1-py2.7.egg/unittest2/case.py", line 333, in run
    self.setUp()
  File "/home/jenkins/.buildout/eggs/plone.app.discussion-3.0.0-py2.7.egg/plone/app/discussion/tests/test_catalog.py", line 283, in setUp
    self.comment_brain = brains[0]
  File "/home/jenkins/.buildout/eggs/Products.ZCatalog-3.0.2-py2.7.egg/Products/ZCatalog/Lazy.py", line 132, in __getitem__
    raise IndexError(index)


FAILED:  plone.app.discussion.tests.test_catalog.CommentCatalogTest.test_creator

Error Message:
0

Stack Trace:
0

  File "/home/jenkins/.buildout/eggs/unittest2-0.5.1-py2.7.egg/unittest2/case.py", line 333, in run
    self.setUp()
  File "/home/jenkins/.buildout/eggs/plone.app.discussion-3.0.0-py2.7.egg/plone/app/discussion/tests/test_catalog.py", line 283, in setUp
    self.comment_brain = brains[0]
  File "/home/jenkins/.buildout/eggs/Products.ZCatalog-3.0.2-py2.7.egg/Products/ZCatalog/Lazy.py", line 132, in __getitem__
    raise IndexError(index)


FAILED:  plone.app.discussion.tests.test_catalog.CommentCatalogTest.test_delete_comment

Error Message:
0

Stack Trace:
0

  File "/home/jenkins/.buildout/eggs/unittest2-0.5.1-py2.7.egg/unittest2/case.py", line 333, in run
    self.setUp()
  File "/home/jenkins/.buildout/eggs/plone.app.discussion-3.0.0-py2.7.egg/plone/app/discussion/tests/test_catalog.py", line 283, in setUp
    self.comment_brain = brains[0]
  File "/home/jenkins/.buildout/eggs/Products.ZCatalog-3.0.2-py2.7.egg/Products/ZCatalog/Lazy.py", line 132, in __getitem__
    raise IndexError(index)


FAILED:  plone.app.discussion.tests.test_catalog.CommentCatalogTest.test_in_response_to

Error Message:
0

Stack Trace:
0

  File "/home/jenkins/.buildout/eggs/unittest2-0.5.1-py2.7.egg/unittest2/case.py", line 333, in run
    self.setUp()
  File "/home/jenkins/.buildout/eggs/plone.app.discussion-3.0.0-py2.7.egg/plone/app/discussion/tests/test_catalog.py", line 283, in setUp
    self.comment_brain = brains[0]
  File "/home/jenkins/.buildout/eggs/Products.ZCatalog-3.0.2-py2.7.egg/Products/ZCatalog/Lazy.py", line 132, in __getitem__
    raise IndexError(index)


FAILED:  plone.app.discussion.tests.test_catalog.CommentCatalogTest.test_move_comments_when_content_object_is_moved

Error Message:
0

Stack Trace:
0

  File "/home/jenkins/.buildout/eggs/unittest2-0.5.1-py2.7.egg/unittest2/case.py", line 333, in run
    self.setUp()
  File "/home/jenkins/.buildout/eggs/plone.app.discussion-3.0.0-py2.7.egg/plone/app/discussion/tests/test_catalog.py", line 283, in setUp
    self.comment_brain = brains[0]
  File "/home/jenkins/.buildout/eggs/Products.ZCatalog-3.0.2-py2.7.egg/Products/ZCatalog/Lazy.py", line 132, in __getitem__
    raise IndexError(index)


FAILED:  plone.app.discussion.tests.test_catalog.CommentCatalogTest.test_move_upper_level_folder

Error Message:
0

Stack Trace:
0

  File "/home/jenkins/.buildout/eggs/unittest2-0.5.1-py2.7.egg/unittest2/case.py", line 333, in run
    self.setUp()
  File "/home/jenkins/.buildout/eggs/plone.app.discussion-3.0.0-py2.7.egg/plone/app/discussion/tests/test_catalog.py", line 283, in setUp
    self.comment_brain = brains[0]
  File "/home/jenkins/.buildout/eggs/Products.ZCatalog-3.0.2-py2.7.egg/Products/ZCatalog/Lazy.py", line 132, in __getitem__
    raise IndexError(index)


FAILED:  plone.app.discussion.tests.test_catalog.CommentCatalogTest.test_no_name_title

Error Message:
0

Stack Trace:
0

  File "/home/jenkins/.buildout/eggs/unittest2-0.5.1-py2.7.egg/unittest2/case.py", line 333, in run
    self.setUp()
  File "/home/jenkins/.buildout/eggs/plone.app.discussion-3.0.0-py2.7.egg/plone/app/discussion/tests/test_catalog.py", line 283, in setUp
    self.comment_brain = brains[0]
  File "/home/jenkins/.buildout/eggs/Products.ZCatalog-3.0.2-py2.7.egg/Products/ZCatalog/Lazy.py", line 132, in __getitem__
    raise IndexError(index)


FAILED:  plone.app.discussion.tests.test_catalog.CommentCatalogTest.test_reindex_comment

Error Message:
0

Stack Trace:
0

  File "/home/jenkins/.buildout/eggs/unittest2-0.5.1-py2.7.egg/unittest2/case.py", line 333, in run
    self.setUp()
  File "/home/jenkins/.buildout/eggs/plone.app.discussion-3.0.0-py2.7.egg/plone/app/discussion/tests/test_catalog.py", line 283, in setUp
    self.comment_brain = brains[0]
  File "/home/jenkins/.buildout/eggs/Products.ZCatalog-3.0.2-py2.7.egg/Products/ZCatalog/Lazy.py", line 132, in __getitem__
    raise IndexError(index)


FAILED:  plone.app.discussion.tests.test_catalog.CommentCatalogTest.test_remove_comments_when_content_object_is_removed

Error Message:
0

Stack Trace:
0

  File "/home/jenkins/.buildout/eggs/unittest2-0.5.1-py2.7.egg/unittest2/case.py", line 333, in run
    self.setUp()
  File "/home/jenkins/.buildout/eggs/plone.app.discussion-3.0.0-py2.7.egg/plone/app/discussion/tests/test_catalog.py", line 283, in setUp
    self.comment_brain = brains[0]
  File "/home/jenkins/.buildout/eggs/Products.ZCatalog-3.0.2-py2.7.egg/Products/ZCatalog/Lazy.py", line 132, in __getitem__
    raise IndexError(index)


FAILED:  plone.app.discussion.tests.test_catalog.CommentCatalogTest.test_review_state

Error Message:
0

Stack Trace:
0

  File "/home/jenkins/.buildout/eggs/unittest2-0.5.1-py2.7.egg/unittest2/case.py", line 333, in run
    self.setUp()
  File "/home/jenkins/.buildout/eggs/plone.app.discussion-3.0.0-py2.7.egg/plone/app/discussion/tests/test_catalog.py", line 283, in setUp
    self.comment_brain = brains[0]
  File "/home/jenkins/.buildout/eggs/Products.ZCatalog-3.0.2-py2.7.egg/Products/ZCatalog/Lazy.py", line 132, in __getitem__
    raise IndexError(index)


FAILED:  plone.app.discussion.tests.test_catalog.CommentCatalogTest.test_title

Error Message:
0

Stack Trace:
0

  File "/home/jenkins/.buildout/eggs/unittest2-0.5.1-py2.7.egg/unittest2/case.py", line 333, in run
    self.setUp()
  File "/home/jenkins/.buildout/eggs/plone.app.discussion-3.0.0-py2.7.egg/plone/app/discussion/tests/test_catalog.py", line 283, in setUp
    self.comment_brain = brains[0]
  File "/home/jenkins/.buildout/eggs/Products.ZCatalog-3.0.2-py2.7.egg/Products/ZCatalog/Lazy.py", line 132, in __getitem__
    raise IndexError(index)


FAILED:  plone.app.discussion.tests.test_catalog.CommentCatalogTest.test_type

Error Message:
0

Stack Trace:
0

  File "/home/jenkins/.buildout/eggs/unittest2-0.5.1-py2.7.egg/unittest2/case.py", line 333, in run
    self.setUp()
  File "/home/jenkins/.buildout/eggs/plone.app.discussion-3.0.0-py2.7.egg/plone/app/discussion/tests/test_catalog.py", line 283, in setUp
    self.comment_brain = brains[0]
  File "/home/jenkins/.buildout/eggs/Products.ZCatalog-3.0.2-py2.7.egg/Products/ZCatalog/Lazy.py", line 132, in __getitem__
    raise IndexError(index)


FAILED:  plone.app.discussion.tests.test_catalog.CommentCatalogTest.test_update_comments_when_content_object_is_renamed

Error Message:
0

Stack Trace:
0

  File "/home/jenkins/.buildout/eggs/unittest2-0.5.1-py2.7.egg/unittest2/case.py", line 333, in run
    self.setUp()
  File "/home/jenkins/.buildout/eggs/plone.app.discussion-3.0.0-py2.7.egg/plone/app/discussion/tests/test_catalog.py", line 283, in setUp
    self.comment_brain = brains[0]
  File "/home/jenkins/.buildout/eggs/Products.ZCatalog-3.0.2-py2.7.egg/Products/ZCatalog/Lazy.py", line 132, in __getitem__
    raise IndexError(index)


FAILED:  plone.app.discussion.tests.test_catalog.ConversationCatalogTest.test_commentators

Error Message:
Tuples differ: () != ('Jim',)

Stack Trace:
Tuples differ: () != ('Jim',)

Second tuple contains 1 additional elements.
First extra element 0:
Jim

- ()
+ ('Jim',)

  File "/home/jenkins/.buildout/eggs/unittest2-0.5.1-py2.7.egg/unittest2/case.py", line 340, in run
    testMethod()
  File "/home/jenkins/.buildout/eggs/plone.app.discussion-3.0.0-py2.7.egg/plone/app/discussion/tests/test_catalog.py", line 177, in test_commentators
    self.assertEqual(self.doc1_brain.commentators, ('Jim',))
  File "/home/jenkins/.buildout/eggs/unittest2-0.5.1-py2.7.egg/unittest2/case.py", line 521, in assertEqual
    assertion_func(first, second, msg=msg)
  File "/home/jenkins/.buildout/eggs/unittest2-0.5.1-py2.7.egg/unittest2/case.py", line 763, in assertTupleEqual
    self.assertSequenceEqual(tuple1, tuple2, msg, seq_type=tuple)
  File "/home/jenkins/.buildout/eggs/unittest2-0.5.1-py2.7.egg/unittest2/case.py", line 734, in assertSequenceEqual
    self.fail(msg)
  File "/home/jenkins/.buildout/eggs/unittest2-0.5.1-py2.7.egg/unittest2/case.py", line 415, in fail
    raise self.failureException(msg)


FAILED:  plone.app.discussion.tests.test_catalog.ConversationCatalogTest.test_conversation_indexes_not_in_comments

Error Message:
0

Stack Trace:
0

  File "/home/jenkins/.buildout/eggs/unittest2-0.5.1-py2.7.egg/unittest2/case.py", line 340, in run
    testMethod()
  File "/home/jenkins/.buildout/eggs/plone.app.discussion-3.0.0-py2.7.egg/plone/app/discussion/tests/test_catalog.py", line 235, in test_conversation_indexes_not_in_comments
    comment1_brain = brains[0]
  File "/home/jenkins/.buildout/eggs/Products.ZCatalog-3.0.2-py2.7.egg/Products/ZCatalog/Lazy.py", line 132, in __getitem__
    raise IndexError(index)


FAILED:  plone.app.discussion.tests.test_catalog.ConversationCatalogTest.test_last_comment_date

Error Message:
None != datetime.datetime(2006, 9, 17, 14, 18, 12)

Stack Trace:
None != datetime.datetime(2006, 9, 17, 14, 18, 12)

  File "/home/jenkins/.buildout/eggs/unittest2-0.5.1-py2.7.egg/unittest2/case.py", line 340, in run
    testMethod()
  File "/home/jenkins/.buildout/eggs/plone.app.discussion-3.0.0-py2.7.egg/plone/app/discussion/tests/test_catalog.py", line 119, in test_last_comment_date
    datetime(2006, 9, 17, 14, 18, 12)
  File "/home/jenkins/.buildout/eggs/unittest2-0.5.1-py2.7.egg/unittest2/case.py", line 521, in assertEqual
    assertion_func(first, second, msg=msg)
  File "/home/jenkins/.buildout/eggs/unittest2-0.5.1-py2.7.egg/unittest2/case.py", line 514, in _baseAssertEqual
    raise self.failureException(msg)


FAILED:  plone.app.discussion.tests.test_catalog.ConversationCatalogTest.test_total_comments

Error Message:
0 != 1

Stack Trace:
0 != 1

  File "/home/jenkins/.buildout/eggs/unittest2-0.5.1-py2.7.egg/unittest2/case.py", line 340, in run
    testMethod()
  File "/home/jenkins/.buildout/eggs/plone.app.discussion-3.0.0-py2.7.egg/plone/app/discussion/tests/test_catalog.py", line 94, in test_total_comments
    self.assertEqual(self.doc1_brain.total_comments, 1)
  File "/home/jenkins/.buildout/eggs/unittest2-0.5.1-py2.7.egg/unittest2/case.py", line 521, in assertEqual
    assertion_func(first, second, msg=msg)
  File "/home/jenkins/.buildout/eggs/unittest2-0.5.1-py2.7.egg/unittest2/case.py", line 514, in _baseAssertEqual
    raise self.failureException(msg)


FAILED:  plone.app.discussion.tests.test_comment.CommentTest.test_comment_uid_differs_from_content_uid

Error Message:
0

Stack Trace:
0

  File "/home/jenkins/.buildout/eggs/unittest2-0.5.1-py2.7.egg/unittest2/case.py", line 340, in run
    testMethod()
  File "/home/jenkins/.buildout/eggs/plone.app.discussion-3.0.0-py2.7.egg/plone/app/discussion/tests/test_comment.py", line 92, in test_comment_uid_differs_from_content_uid
    )[0]
  File "/home/jenkins/.buildout/eggs/Products.ZCatalog-3.0.2-py2.7.egg/Products/ZCatalog/Lazy.py", line 132, in __getitem__
    raise IndexError(index)


FAILED:  plone.app.discussion.tests.test_comment.CommentTest.test_uid

Error Message:
0

Stack Trace:
0

  File "/home/jenkins/.buildout/eggs/unittest2-0.5.1-py2.7.egg/unittest2/case.py", line 340, in run
    testMethod()
  File "/home/jenkins/.buildout/eggs/plone.app.discussion-3.0.0-py2.7.egg/plone/app/discussion/tests/test_comment.py", line 72, in test_uid
    )[0]
  File "/home/jenkins/.buildout/eggs/Products.ZCatalog-3.0.2-py2.7.egg/Products/ZCatalog/Lazy.py", line 132, in __getitem__
    raise IndexError(index)


FAILED:  plone.app.discussion.tests.test_comment.CommentTest.test_uid_is_unique

Error Message:
list index out of range

Stack Trace:
list index out of range

  File "/home/jenkins/.buildout/eggs/unittest2-0.5.1-py2.7.egg/unittest2/case.py", line 340, in run
    testMethod()
  File "/home/jenkins/.buildout/eggs/plone.app.discussion-3.0.0-py2.7.egg/plone/app/discussion/tests/test_comment.py", line 84, in test_uid_is_unique
    self.assertNotEqual(brains[0].UID, brains[1].UID)
  File "/home/jenkins/.buildout/eggs/Products.ZCatalog-3.0.2-py2.7.egg/Products/ZCatalog/Lazy.py", line 190, in __getitem__
    value = data[index] = self._func(self._seq[index])


FAILED:  plone.app.event.tests.test_base_module.TestGetEventsOptimizations.test_expand_all

Error Message:
Lists differ: [(u'Past Event', '2013-04-25 0... != [(u'Past Event', '2013-04-25 0...

Stack Trace:
Lists differ: [(u'Past Event', '2013-04-25 0... != [(u'Past Event', '2013-04-25 0...

First differing element 7:
(u'Now Event', '2013-05-07 10:00:00', '2013-05-07 11:00:00')
(u'Tomorrow event', '2013-05-06 10:00:00', '2013-05-06 23:59:59')

Second list contains 1 additional elements.
First extra element 12:
(u'Past Recur', '2013-05-16 11:00:00', '2013-05-16 12:00:00')

Diff is 861 characters long. Set self.maxDiff to None to see it.

  File "/usr/lib/python2.7/unittest/case.py", line 329, in run
    testMethod()
  File "/home/jenkins/.buildout/eggs/plone.app.event-3.0.4-py2.7.egg/plone/app/event/tests/test_base_module.py", line 723, in test_expand_all
    self.assertEqual(res, self.occ)
  File "/usr/lib/python2.7/unittest/case.py", line 513, in assertEqual
    assertion_func(first, second, msg=msg)
  File "/usr/lib/python2.7/unittest/case.py", line 742, in assertListEqual
    self.assertSequenceEqual(list1, list2, msg, seq_type=list)
  File "/usr/lib/python2.7/unittest/case.py", line 724, in assertSequenceEqual
    self.fail(msg)
  File "/usr/lib/python2.7/unittest/case.py", line 410, in fail
    raise self.failureException(msg)


FAILED:  plone.app.event.tests.test_base_module.TestGetEventsOptimizations.test_expand_start

Error Message:
[(u'Tomorrow event', '2013-05-06 10:00:00', '2013-05-06 23:59:59')]

Stack Trace:
[(u'Tomorrow event', '2013-05-06 10:00:00', '2013-05-06 23:59:59')]

  File "/usr/lib/python2.7/unittest/case.py", line 329, in run
    testMethod()
  File "/home/jenkins/.buildout/eggs/plone.app.event-3.0.4-py2.7.egg/plone/app/event/tests/test_base_module.py", line 739, in test_expand_start
    self.assertEqual(res, expect, self.diff(res, expect))
  File "/usr/lib/python2.7/unittest/case.py", line 513, in assertEqual
    assertion_func(first, second, msg=msg)
  File "/usr/lib/python2.7/unittest/case.py", line 742, in assertListEqual
    self.assertSequenceEqual(list1, list2, msg, seq_type=list)
  File "/usr/lib/python2.7/unittest/case.py", line 724, in assertSequenceEqual
    self.fail(msg)
  File "/usr/lib/python2.7/unittest/case.py", line 410, in fail
    raise self.failureException(msg)


FAILED:  plone.app.event.tests.test_base_module.TestGetEventsOptimizations.test_expand_start_limit

Error Message:
[(u'Now Event', '2013-05-07 10:00:00', '2013-05-07 11:00:00'), (u'Tomorrow event', '2013-05-06 10:00:00', '2013-05-06 23:59:59')]

Stack Trace:
[(u'Now Event', '2013-05-07 10:00:00', '2013-05-07 11:00:00'), (u'Tomorrow event', '2013-05-06 10:00:00', '2013-05-06 23:59:59')]

  File "/usr/lib/python2.7/unittest/case.py", line 329, in run
    testMethod()
  File "/home/jenkins/.buildout/eggs/plone.app.event-3.0.4-py2.7.egg/plone/app/event/tests/test_base_module.py", line 747, in test_expand_start_limit
    self.assertEqual(res, expect, self.diff(res, expect))
  File "/usr/lib/python2.7/unittest/case.py", line 513, in assertEqual
    assertion_func(first, second, msg=msg)
  File "/usr/lib/python2.7/unittest/case.py", line 742, in assertListEqual
    self.assertSequenceEqual(list1, list2, msg, seq_type=list)
  File "/usr/lib/python2.7/unittest/case.py", line 724, in assertSequenceEqual
    self.fail(msg)
  File "/usr/lib/python2.7/unittest/case.py", line 410, in fail
    raise self.failureException(msg)


FAILED:  plone.app.event.tests.test_base_module.TestGetEventsOptimizations.test_noexpand_all

Error Message:
[(u'Tomorrow event', '2013-05-06 10:00:00', '2013-05-06 23:59:59')]

Stack Trace:
[(u'Tomorrow event', '2013-05-06 10:00:00', '2013-05-06 23:59:59')]

  File "/usr/lib/python2.7/unittest/case.py", line 329, in run
    testMethod()
  File "/home/jenkins/.buildout/eggs/plone.app.event-3.0.4-py2.7.egg/plone/app/event/tests/test_base_module.py", line 762, in test_noexpand_all
    self.assertEqual(res, expect, self.diff(res, expect))
  File "/usr/lib/python2.7/unittest/case.py", line 513, in assertEqual
    assertion_func(first, second, msg=msg)
  File "/usr/lib/python2.7/unittest/case.py", line 742, in assertListEqual
    self.assertSequenceEqual(list1, list2, msg, seq_type=list)
  File "/usr/lib/python2.7/unittest/case.py", line 724, in assertSequenceEqual
    self.fail(msg)
  File "/usr/lib/python2.7/unittest/case.py", line 410, in fail
    raise self.failureException(msg)


FAILED:  plone.app.event.tests.test_base_module.TestGetEventsOptimizations.test_noexpand_start

Error Message:
[(u'Tomorrow event', '2013-05-06 10:00:00', '2013-05-06 23:59:59')]

Stack Trace:
[(u'Tomorrow event', '2013-05-06 10:00:00', '2013-05-06 23:59:59')]

  File "/usr/lib/python2.7/unittest/case.py", line 329, in run
    testMethod()
  File "/home/jenkins/.buildout/eggs/plone.app.event-3.0.4-py2.7.egg/plone/app/event/tests/test_base_module.py", line 783, in test_noexpand_start
    self.assertEqual(res, expect, self.diff(res, expect))
  File "/usr/lib/python2.7/unittest/case.py", line 513, in assertEqual
    assertion_func(first, second, msg=msg)
  File "/usr/lib/python2.7/unittest/case.py", line 742, in assertListEqual
    self.assertSequenceEqual(list1, list2, msg, seq_type=list)
  File "/usr/lib/python2.7/unittest/case.py", line 724, in assertSequenceEqual
    self.fail(msg)
  File "/usr/lib/python2.7/unittest/case.py", line 410, in fail
    raise self.failureException(msg)


FAILED:  plone.app.event.tests.test_portlet_calendar.RendererTest.test_event_created_last_day_of_month_invalidate_cache

Error Message:
Cache key wasn't invalidated

Stack Trace:
Cache key wasn't invalidated

  File "/usr/lib/python2.7/unittest/case.py", line 329, in run
    testMethod()
  File "/home/jenkins/.buildout/eggs/plone.app.event-3.0.4-py2.7.egg/plone/app/event/tests/test_portlet_calendar.py", line 218, in test_event_created_last_day_of_month_invalidate_cache
    html, portlet.render(), "Cache key wasn't invalidated"
  File "/usr/lib/python2.7/unittest/case.py", line 522, in assertNotEqual
    raise self.failureException(msg)


FAILED:  plone.app.event.tests.test_portlet_events.RendererTest.test_portlet_event_renderer__get_events

Error Message:
2 != 1

Stack Trace:
2 != 1

  File "/usr/lib/python2.7/unittest/case.py", line 329, in run
    testMethod()
  File "/home/jenkins/.buildout/eggs/plone.app.event-3.0.4-py2.7.egg/plone/app/event/tests/test_portlet_events.py", line 177, in test_portlet_event_renderer__get_events
    self.assertEqual(2, len(portlet.events))
  File "/usr/lib/python2.7/unittest/case.py", line 513, in assertEqual
    assertion_func(first, second, msg=msg)
  File "/usr/lib/python2.7/unittest/case.py", line 506, in _baseAssertEqual
    raise self.failureException(msg)


FAILED:  plone.app.layout.sitemap.tests.test_sitemap.SiteMapTestCase.test_default_pages

Error Message:
False is not true

Stack Trace:
False is not true

  File "/usr/lib/python2.7/unittest/case.py", line 329, in run
    testMethod()
  File "/home/jenkins/.buildout/eggs/plone.app.layout-2.6.4-py2.7.egg/plone/app/layout/sitemap/tests/test_sitemap.py", line 249, in test_default_pages
    self.assertTrue('<lastmod>2001-01-01T' in xml)
  File "/usr/lib/python2.7/unittest/case.py", line 422, in assertTrue
    raise self.failureException(msg)


FAILED:  plone.app.layout.sitemap.tests.test_sitemap.SiteMapTestCase.test_navroot

Error Message:
False is not true

Stack Trace:
False is not true

  File "/usr/lib/python2.7/unittest/case.py", line 329, in run
    testMethod()
  File "/home/jenkins/.buildout/eggs/plone.app.layout-2.6.4-py2.7.egg/plone/app/layout/sitemap/tests/test_sitemap.py", line 176, in test_navroot
    '<loc>http://nohost/plone/navroot/published</loc>' in xml)
  File "/usr/lib/python2.7/unittest/case.py", line 422, in assertTrue
    raise self.failureException(msg)


FAILED:  plone.app.linkintegrity.tests.test_circular.CircularReferencesDXTestCase.test_internal_breaches_are_dropped

Error Message:
0 != 1

Stack Trace:
0 != 1

  File "/usr/lib/python2.7/unittest/case.py", line 329, in run
    testMethod()
  File "/home/jenkins/.buildout/eggs/plone.app.linkintegrity-3.2.1-py2.7.egg/plone/app/linkintegrity/tests/test_circular.py", line 70, in test_internal_breaches_are_dropped
    self.assertEqual(len(view.get_breaches([doc5])), 1)
  File "/usr/lib/python2.7/unittest/case.py", line 513, in assertEqual
    assertion_func(first, second, msg=msg)
  File "/usr/lib/python2.7/unittest/case.py", line 506, in _baseAssertEqual
    raise self.failureException(msg)


FAILED:  plone.app.multilingual.tests.test_lrf.TestLanguageRootFolder.test_moving_shared_content_to_lrf

Error Message:
0 != 1

Stack Trace:
0 != 1

  File "/home/jenkins/.buildout/eggs/unittest2-0.5.1-py2.7.egg/unittest2/case.py", line 340, in run
    testMethod()
  File "/home/jenkins/.buildout/eggs/plone.app.multilingual-5.0.3-py2.7.egg/plone/app/multilingual/tests/test_lrf.py", line 91, in test_moving_shared_content_to_lrf
    self.assertEqual(len(brains), 1)
  File "/home/jenkins/.buildout/eggs/unittest2-0.5.1-py2.7.egg/unittest2/case.py", line 521, in assertEqual
    assertion_func(first, second, msg=msg)
  File "/home/jenkins/.buildout/eggs/unittest2-0.5.1-py2.7.egg/unittest2/case.py", line 514, in _baseAssertEqual
    raise self.failureException(msg)


FAILED:  plone.app.multilingual.tests.test_lrf.TestLanguageRootFolder.test_shared_content_indexing

Error Message:
1 != 3

Stack Trace:
1 != 3

  File "/home/jenkins/.buildout/eggs/unittest2-0.5.1-py2.7.egg/unittest2/case.py", line 340, in run
    testMethod()
  File "/home/jenkins/.buildout/eggs/plone.app.multilingual-5.0.3-py2.7.egg/plone/app/multilingual/tests/test_lrf.py", line 50, in test_shared_content_indexing
    self.assertEqual(len(elements), 3)
  File "/home/jenkins/.buildout/eggs/unittest2-0.5.1-py2.7.egg/unittest2/case.py", line 521, in assertEqual
    assertion_func(first, second, msg=msg)
  File "/home/jenkins/.buildout/eggs/unittest2-0.5.1-py2.7.egg/unittest2/case.py", line 514, in _baseAssertEqual
    raise self.failureException(msg)


FAILED:  plone.app.versioningbehavior.tests.test_IntegrationTests.TestDexterityIntegration.test11_versionAFolderishObjectThatTreatsChildrensAsInsideRefs

Error Message:
'v3 of doc1' != 'v2 of doc1'

Stack Trace:
'v3 of doc1' != 'v2 of doc1'

  File "/usr/lib/python2.7/unittest/case.py", line 329, in run
    testMethod()
  File "/home/jenkins/workspace/plone-5.1-python-2.7 at 3/src/Products.CMFEditions/Products/CMFEditions/tests/test_IntegrationTests.py", line 339, in test11_versionAFolderishObjectThatTreatsChildrensAsInsideRefs
    self.assertEqual(doc1.Title(), "v2 of doc1")
  File "/usr/lib/python2.7/unittest/case.py", line 513, in assertEqual
    assertion_func(first, second, msg=msg)
  File "/usr/lib/python2.7/unittest/case.py", line 506, in _baseAssertEqual
    raise self.failureException(msg)


FAILED:  plone.app.versioningbehavior.tests.test_IntegrationTests.TestDexterityIntegration.test15_retrieveInsideRefsFolderWithAddedOrDeletedObjects

Error Message:
Lists differ: ['doc1_CMFEditionsTempId_93289... != ['doc1', 'doc2']

Stack Trace:
Lists differ: ['doc1_CMFEditionsTempId_93289... != ['doc1', 'doc2']

First differing element 0:
'doc1_CMFEditionsTempId_932892'
'doc1'

First list contains 1 additional elements.
First extra element 2:
'doc2'

- ['doc1_CMFEditionsTempId_932892', 'doc1', 'doc2']
+ ['doc1', 'doc2']

  File "/usr/lib/python2.7/unittest/case.py", line 329, in run
    testMethod()
  File "/home/jenkins/workspace/plone-5.1-python-2.7 at 3/src/Products.CMFEditions/Products/CMFEditions/tests/test_IntegrationTests.py", line 533, in test15_retrieveInsideRefsFolderWithAddedOrDeletedObjects
    self.assertEqual(ret_folder.objectIds(), orig_ids)
  File "/usr/lib/python2.7/unittest/case.py", line 513, in assertEqual
    assertion_func(first, second, msg=msg)
  File "/usr/lib/python2.7/unittest/case.py", line 742, in assertListEqual
    self.assertSequenceEqual(list1, list2, msg, seq_type=list)
  File "/usr/lib/python2.7/unittest/case.py", line 724, in assertSequenceEqual
    self.fail(msg)
  File "/usr/lib/python2.7/unittest/case.py", line 410, in fail
    raise self.failureException(msg)


FAILED:  plone.app.versioningbehavior.tests.test_IntegrationTests.TestDexterityIntegration.test16_revertInsideRefsUpdatesCatalog

Error Message:
0 != 1

Stack Trace:
0 != 1

  File "/usr/lib/python2.7/unittest/case.py", line 329, in run
    testMethod()
  File "/home/jenkins/workspace/plone-5.1-python-2.7 at 3/src/Products.CMFEditions/Products/CMFEditions/tests/test_IntegrationTests.py", line 621, in test16_revertInsideRefsUpdatesCatalog
    self.assertEqual(len(results), 1)
  File "/usr/lib/python2.7/unittest/case.py", line 513, in assertEqual
    assertion_func(first, second, msg=msg)
  File "/usr/lib/python2.7/unittest/case.py", line 506, in _baseAssertEqual
    raise self.failureException(msg)


FAILED:  plone.app.versioningbehavior.tests.test_IntegrationTests.TestDexterityIntegration.test17_moveInsideRefThenRevertChangesUid

Error Message:
UIDs should not be equal, current value: 3

Stack Trace:
UIDs should not be equal, current value: 3

  File "/usr/lib/python2.7/unittest/case.py", line 329, in run
    testMethod()
  File "/home/jenkins/workspace/plone-5.1-python-2.7 at 3/src/Products.CMFEditions/Products/CMFEditions/tests/test_IntegrationTests.py", line 692, in test17_moveInsideRefThenRevertChangesUid
    "UIDs should not be equal, current value: %s" % orig_uid)
  File "/usr/lib/python2.7/unittest/case.py", line 612, in deprecated_func
    return original_func(*args, **kwargs)
  File "/usr/lib/python2.7/unittest/case.py", line 416, in assertFalse
    raise self.failureException(msg)


FAILED:  plone.app.versioningbehavior.tests.test_IntegrationTests.TestDexterityIntegration.test21_DontLeaveDanglingCatalogEntriesWhenInvokingFactory

Error Message:
1 != 0

Stack Trace:
1 != 0

  File "/usr/lib/python2.7/unittest/case.py", line 329, in run
    testMethod()
  File "/home/jenkins/workspace/plone-5.1-python-2.7 at 3/src/Products.CMFEditions/Products/CMFEditions/tests/test_IntegrationTests.py", line 867, in test21_DontLeaveDanglingCatalogEntriesWhenInvokingFactory
    self.assertEqual(len(catalog(getId='doc1')), 0)
  File "/usr/lib/python2.7/unittest/case.py", line 513, in assertEqual
    assertion_func(first, second, msg=msg)
  File "/usr/lib/python2.7/unittest/case.py", line 506, in _baseAssertEqual
    raise self.failureException(msg)


FAILED:  plone.app.versioningbehavior.tests.test_IntegrationTests.TestDexterityIntegration.test21_RestoreMovedObject

Error Message:
1 != 0

Stack Trace:
1 != 0

  File "/usr/lib/python2.7/unittest/case.py", line 329, in run
    testMethod()
  File "/home/jenkins/workspace/plone-5.1-python-2.7 at 3/src/Products.CMFEditions/Products/CMFEditions/tests/test_IntegrationTests.py", line 933, in test21_RestoreMovedObject
    self.assertEqual(len(catalog(getId='doc1')), 0)
  File "/usr/lib/python2.7/unittest/case.py", line 513, in assertEqual
    assertion_func(first, second, msg=msg)
  File "/usr/lib/python2.7/unittest/case.py", line 506, in _baseAssertEqual
    raise self.failureException(msg)


FAILED:  plone.app.versioningbehavior.tests.test_IntegrationTests.TestDexterityIntegration.test21_RevertObjectWithChangedIdMaintainsConsistentCatalog

Error Message:
1 != 0

Stack Trace:
1 != 0

  File "/usr/lib/python2.7/unittest/case.py", line 329, in run
    testMethod()
  File "/home/jenkins/workspace/plone-5.1-python-2.7 at 3/src/Products.CMFEditions/Products/CMFEditions/tests/test_IntegrationTests.py", line 900, in test21_RevertObjectWithChangedIdMaintainsConsistentCatalog
    self.assertEqual(len(catalog(getId='doc1')), 0)
  File "/usr/lib/python2.7/unittest/case.py", line 513, in assertEqual
    assertion_func(first, second, msg=msg)
  File "/usr/lib/python2.7/unittest/case.py", line 506, in _baseAssertEqual
    raise self.failureException(msg)


FAILED:  plone.app.versioningbehavior.tests.test_IntegrationTests.TestDexterityIntegration.test25_versioningRestoresInsideRefsFolderOrder

Error Message:
'doc1_CMFEditionsTempId_562304' != 'doc1'

Stack Trace:
'doc1_CMFEditionsTempId_562304' != 'doc1'

  File "/usr/lib/python2.7/unittest/case.py", line 329, in run
    testMethod()
  File "/home/jenkins/workspace/plone-5.1-python-2.7 at 3/src/Products.CMFEditions/Products/CMFEditions/tests/test_IntegrationTests.py", line 1094, in test25_versioningRestoresInsideRefsFolderOrder
    self.failUnlessEqual(repo_fol1.objectIds()[0], 'doc1')
  File "/usr/lib/python2.7/unittest/case.py", line 612, in deprecated_func
    return original_func(*args, **kwargs)
  File "/usr/lib/python2.7/unittest/case.py", line 513, in assertEqual
    assertion_func(first, second, msg=msg)
  File "/usr/lib/python2.7/unittest/case.py", line 506, in _baseAssertEqual
    raise self.failureException(msg)


FAILED:  plone.app.workflow.tests.test_folder_workflow.TestFolderWorkflow.testFindPrivateFolder

Error Message:
[<Products.ZCatalog.Catalog.mybrains object at 0x7fac8ef22870>] is not false

Stack Trace:
[<Products.ZCatalog.Catalog.mybrains object at 0x7fac8ef22870>] is not false

  File "/usr/lib/python2.7/unittest/case.py", line 329, in run
    testMethod()
  File "/home/jenkins/.buildout/eggs/plone.app.workflow-2.2.7-py2.7.egg/plone/app/workflow/tests/test_folder_workflow.py", line 416, in testFindPrivateFolder
    self.assertFalse(self.catalog(id='dir'))
  File "/usr/lib/python2.7/unittest/case.py", line 416, in assertFalse
    raise self.failureException(msg)


FAILED:  plone.app.workflow.tests.test_plone_workflow.TestDefaultWorkflow.testFindPrivateDocument

Error Message:
[<Products.ZCatalog.Catalog.mybrains object at 0x7fac8f17e738>] is not false

Stack Trace:
[<Products.ZCatalog.Catalog.mybrains object at 0x7fac8f17e738>] is not false

  File "/usr/lib/python2.7/unittest/case.py", line 329, in run
    testMethod()
  File "/home/jenkins/.buildout/eggs/plone.app.workflow-2.2.7-py2.7.egg/plone/app/workflow/tests/test_plone_workflow.py", line 421, in testFindPrivateDocument
    self.assertFalse(self.catalog(id='doc'))
  File "/usr/lib/python2.7/unittest/case.py", line 416, in assertFalse
    raise self.failureException(msg)


FAILED:  plone.portlet.collection.tests.test_portlet_collection.TestCollectionQuery.test_exclude_context

Error Message:
2 != 3 : Wrong number of random rendered results

Stack Trace:
2 != 3 : Wrong number of random rendered results

  File "/home/jenkins/.buildout/eggs/unittest2-0.5.1-py2.7.egg/unittest2/case.py", line 340, in run
    testMethod()
  File "/home/jenkins/.buildout/eggs/plone.portlet.collection-3.1-py2.7.egg/plone/portlet/collection/tests/test_portlet_collection.py", line 419, in test_exclude_context
    len(random_results), 3, 'Wrong number of random rendered results')
  File "/home/jenkins/.buildout/eggs/unittest2-0.5.1-py2.7.egg/unittest2/case.py", line 521, in assertEqual
    assertion_func(first, second, msg=msg)
  File "/home/jenkins/.buildout/eggs/unittest2-0.5.1-py2.7.egg/unittest2/case.py", line 514, in _baseAssertEqual
    raise self.failureException(msg)





More information about the Testbot mailing list