[Testbot] Plone 5.1 - Python 2.7 - Archetypes - Build # 1533 - Failure!

jenkins at plone.org jenkins at plone.org
Tue Feb 21 20:54:53 UTC 2017


Plone 5.1 - Python 2.7 - Archetypes - Build # 1533 - Failure:

Check console output at http://jenkins.plone.org/job/plone-5.1-python-2.7-at/1533/ to view the results.

Changes:

[noreply] Add CMFCore







Test Results:

9 tests failed.
FAILED:  Products.CMFEditions.tests.test_IntegrationTests.TestIntegration.test13_revertUpdatesCatalog

Error Message:
1 != 0

Stack Trace:
1 != 0

  File "/usr/lib/python2.7/unittest/case.py", line 329, in run
    testMethod()
  File "/home/jenkins/.buildout/eggs/Products.CMFEditions-3.0.1-py2.7.egg/Products/CMFEditions/tests/test_IntegrationTests.py", line 434, in test13_revertUpdatesCatalog
    self.assertEqual(len(results), 0)
  File "/usr/lib/python2.7/unittest/case.py", line 513, in assertEqual
    assertion_func(first, second, msg=msg)
  File "/usr/lib/python2.7/unittest/case.py", line 506, in _baseAssertEqual
    raise self.failureException(msg)


FAILED:  Products.CMFEditions.tests.test_IntegrationTests.TestIntegration.test16_revertInsideRefsUpdatesCatalog

Error Message:
2 != 0

Stack Trace:
2 != 0

  File "/usr/lib/python2.7/unittest/case.py", line 329, in run
    testMethod()
  File "/home/jenkins/.buildout/eggs/Products.CMFEditions-3.0.1-py2.7.egg/Products/CMFEditions/tests/test_IntegrationTests.py", line 638, in test16_revertInsideRefsUpdatesCatalog
    self.assertEqual(len(results), 0)
  File "/usr/lib/python2.7/unittest/case.py", line 513, in assertEqual
    assertion_func(first, second, msg=msg)
  File "/usr/lib/python2.7/unittest/case.py", line 506, in _baseAssertEqual
    raise self.failureException(msg)


FAILED:  Products.CMFEditions.tests.test_IntegrationTests.TestIntegration.test21_RestoreMovedObject

Error Message:
0 != 1

Stack Trace:
0 != 1

  File "/usr/lib/python2.7/unittest/case.py", line 329, in run
    testMethod()
  File "/home/jenkins/.buildout/eggs/Products.CMFEditions-3.0.1-py2.7.egg/Products/CMFEditions/tests/test_IntegrationTests.py", line 941, in test21_RestoreMovedObject
    self.assertEqual(len(catalog(Title='v1 of doc1')), 1)
  File "/usr/lib/python2.7/unittest/case.py", line 513, in assertEqual
    assertion_func(first, second, msg=msg)
  File "/usr/lib/python2.7/unittest/case.py", line 506, in _baseAssertEqual
    raise self.failureException(msg)


FAILED:  Products.CMFEditions.tests.test_IntegrationTests.TestIntegration.test21_RevertObjectWithChangedIdMaintainsConsistentCatalog

Error Message:
0 != 1

Stack Trace:
0 != 1

  File "/usr/lib/python2.7/unittest/case.py", line 329, in run
    testMethod()
  File "/home/jenkins/.buildout/eggs/Products.CMFEditions-3.0.1-py2.7.egg/Products/CMFEditions/tests/test_IntegrationTests.py", line 908, in test21_RevertObjectWithChangedIdMaintainsConsistentCatalog
    self.assertEqual(len(catalog(Title='v1 of doc1')), 1)
  File "/usr/lib/python2.7/unittest/case.py", line 513, in assertEqual
    assertion_func(first, second, msg=msg)
  File "/usr/lib/python2.7/unittest/case.py", line 506, in _baseAssertEqual
    raise self.failureException(msg)


FAILED:  Products.CMFUid.tests.test_uidhandling.UniqueIdHandlerTests.test_UidCataloging

Error Message:
0 != 1

Stack Trace:
0 != 1

  File "/usr/lib/python2.7/unittest/case.py", line 329, in run
    testMethod()
  File "/home/jenkins/.buildout/eggs/Products.CMFUid-2.2.1-py2.7.egg/Products/CMFUid/tests/test_uidhandling.py", line 260, in test_UidCataloging
    self.assertEqual(len(brains), 1)
  File "/usr/lib/python2.7/unittest/case.py", line 513, in assertEqual
    assertion_func(first, second, msg=msg)
  File "/usr/lib/python2.7/unittest/case.py", line 506, in _baseAssertEqual
    raise self.failureException(msg)


FAILED:  Products.CMFUid.tests.test_uidhandling.UniqueIdHandlerTests.test_UidCatalogingDoesNotAcquireUid

Error Message:
0 != 1

Stack Trace:
0 != 1

  File "/usr/lib/python2.7/unittest/case.py", line 329, in run
    testMethod()
  File "/home/jenkins/.buildout/eggs/Products.CMFUid-2.2.1-py2.7.egg/Products/CMFUid/tests/test_uidhandling.py", line 270, in test_UidCatalogingDoesNotAcquireUid
    self.assertEqual(len(brains), 1)
  File "/usr/lib/python2.7/unittest/case.py", line 513, in assertEqual
    assertion_func(first, second, msg=msg)
  File "/usr/lib/python2.7/unittest/case.py", line 506, in _baseAssertEqual
    raise self.failureException(msg)


FAILED:  Products.CMFUid.tests.test_uidhandling.UniqueIdHandlerTests.test_getRegisteredObjectByUid

Error Message:
No object found with '1' as uid.

Stack Trace:
No object found with '1' as uid.

  File "/usr/lib/python2.7/unittest/case.py", line 329, in run
    testMethod()
  File "/home/jenkins/.buildout/eggs/Products.CMFUid-2.2.1-py2.7.egg/Products/CMFUid/tests/test_uidhandling.py", line 129, in test_getRegisteredObjectByUid
    self.assertEqual(handler.getObject(uid), dummy)
  File "/home/jenkins/.buildout/eggs/Products.CMFUid-2.2.1-py2.7.egg/Products/CMFUid/UniqueIdHandlerTool.py", line 215, in getObject
    return self.getBrain(uid).getObject()
  File "/home/jenkins/.buildout/eggs/Products.CMFUid-2.2.1-py2.7.egg/Products/CMFUid/UniqueIdHandlerTool.py", line 209, in getBrain
    return self._getBrain(uid, self.queryBrain)
  File "/home/jenkins/.buildout/eggs/Products.CMFUid-2.2.1-py2.7.egg/Products/CMFUid/UniqueIdHandlerTool.py", line 202, in _getBrain
    raise UniqueIdError, "No object found with '%s' as uid." % uid


FAILED:  Products.CMFUid.tests.test_uidhandling.UniqueIdHandlerTests.test_setExistingUidOnDifferentObjectWithCheckRaisesException

Error Message:
UniqueIdError not raised

Stack Trace:
UniqueIdError not raised

  File "/usr/lib/python2.7/unittest/case.py", line 329, in run
    testMethod()
  File "/home/jenkins/.buildout/eggs/Products.CMFUid-2.2.1-py2.7.egg/Products/CMFUid/tests/test_uidhandling.py", line 208, in test_setExistingUidOnDifferentObjectWithCheckRaisesException
    self.assertRaises(UniqueIdError, handler.setUid, dummy2, uid1_reg)
  File "/usr/lib/python2.7/unittest/case.py", line 473, in assertRaises
    callableObj(*args, **kwargs)
  File "/usr/lib/python2.7/unittest/case.py", line 116, in __exit__
    "{0} not raised".format(exc_name))


FAILED:  Products.CMFUid.tests.test_uidhandling.UniqueIdHandlerTests.test_setExistingUidOnDifferentObjectWithoutCheck

Error Message:
0 != 2

Stack Trace:
0 != 2

  File "/usr/lib/python2.7/unittest/case.py", line 329, in run
    testMethod()
  File "/home/jenkins/.buildout/eggs/Products.CMFUid-2.2.1-py2.7.egg/Products/CMFUid/tests/test_uidhandling.py", line 227, in test_setExistingUidOnDifferentObjectWithoutCheck
    self.assertEqual(len(result), 2)
  File "/usr/lib/python2.7/unittest/case.py", line 513, in assertEqual
    assertion_func(first, second, msg=msg)
  File "/usr/lib/python2.7/unittest/case.py", line 506, in _baseAssertEqual
    raise self.failureException(msg)





More information about the Testbot mailing list