[Testbot] Plone 4.3 - Python 2.6 - Build # 1825 - Failure!

jenkins at plone.org jenkins at plone.org
Wed Feb 8 16:32:44 UTC 2017


Plone 4.3 - Python 2.6 - Build # 1825 - Failure:

Check console output at http://jenkins.plone.org/job/plone-4.3-python-2.6/1825/ to view the results.

Changes:

[Philip Bauer] [fc] Add plone.app.uuid to checkouts.cfg

[Jens W. Klein] [fc] Repository: plone.app.uuid Branch: refs/heads/master Date:







Test Results:

3 tests failed.
FAILED:  Products.GenericSetup.tests.test_tool.SetupToolTests.test_runAllImportStepsFromProfile_step_registration_with_depends

Error Message:


Stack Trace:


  File "/usr/lib/python2.6/unittest.py", line 279, in run
    testMethod()
  File "/home/jenkins/.buildout/eggs/Products.GenericSetup-1.8.6-py2.6.egg/Products/GenericSetup/tests/test_tool.py", line 750, in test_runAllImportStepsFromProfile_step_registration_with_depends
    self.failUnless('one' in result['steps'])
  File "/usr/lib/python2.6/unittest.py", line 325, in failUnless
    if not expr: raise self.failureException, msg


FAILED:  Products.GenericSetup.tests.test_tool.SetupToolTests.test_runAllImportStepsFromProfile_unicode_id_creates_reports

Error Message:
[Errno 2] No such file or directory: '/tmp/STT_test/import_steps.xml'

Stack Trace:
[Errno 2] No such file or directory: '/tmp/STT_test/import_steps.xml'

  File "/usr/lib/python2.6/unittest.py", line 289, in run
    self.tearDown()
  File "/home/jenkins/workspace/plone-4.3-python-2.6/src/Zope2/src/Testing/ZopeTestCase/base.py", line 101, in tearDown
    self.beforeTearDown()
  File "/home/jenkins/.buildout/eggs/Products.GenericSetup-1.8.6-py2.6.egg/Products/GenericSetup/tests/test_tool.py", line 117, in beforeTearDown
    FilesystemTestBase.beforeTearDown(self)
  File "/home/jenkins/.buildout/eggs/Products.GenericSetup-1.8.6-py2.6.egg/Products/GenericSetup/tests/common.py", line 109, in beforeTearDown
    _clearTestDirectory(self._PROFILE_PATH)
  File "/home/jenkins/.buildout/eggs/Products.GenericSetup-1.8.6-py2.6.egg/Products/GenericSetup/tests/common.py", line 83, in _clearTestDirectory
    shutil.rmtree(root_path)
  File "/usr/lib/python2.6/shutil.py", line 217, in rmtree
    onerror(os.remove, fullname, sys.exc_info())
  File "/usr/lib/python2.6/shutil.py", line 215, in rmtree
    os.remove(fullname)


FAILED:  Products.GenericSetup.tests.test_tool.SetupToolTests.test_runAllImportStepsFromProfile_with_depends

Error Message:
['/tmp/STT_test'] != ['/tmp/STT_test2', '/tmp/STT_test']

Stack Trace:
['/tmp/STT_test'] != ['/tmp/STT_test2', '/tmp/STT_test']

  File "/usr/lib/python2.6/unittest.py", line 279, in run
    testMethod()
  File "/home/jenkins/.buildout/eggs/Products.GenericSetup-1.8.6-py2.6.egg/Products/GenericSetup/tests/test_tool.py", line 568, in test_runAllImportStepsFromProfile_with_depends
    self.assertEqual(_imported, [self._PROFILE_PATH2, self._PROFILE_PATH])
  File "/usr/lib/python2.6/unittest.py", line 350, in failUnlessEqual
    (msg or '%r != %r' % (first, second))





More information about the Testbot mailing list