[Testbot] Plone 5.1 - Python 2.7 - Build # 1404 - Failure!

jenkins at plone.org jenkins at plone.org
Thu Feb 2 19:51:27 UTC 2017


Plone 5.1 - Python 2.7 - Build # 1404 - Failure:

Check console output at http://jenkins.plone.org/job/plone-5.1-python-2.7/1404/ to view the results.

Changes:

[Thomas Schorr] intro wsgi.py







Test Results:

3 tests failed.
FAILED:  Products.CMFPlone.tests.testSearch.TestSection.test_default_search_order_alphabetic

Error Message:
Lists differ: ['my-page4', 'my-page5', 'my-p... != ['my-page0', 'my-page1', 'my-p...

Stack Trace:
Lists differ: ['my-page4', 'my-page5', 'my-p... != ['my-page0', 'my-page1', 'my-p...

First differing element 0:
'my-page4'
'my-page0'

- ['my-page4',
?          ^

+ ['my-page0',
?          ^

+  'my-page1',
+  'my-page2',
+  'my-page3',
+  'my-page4',
   'my-page5',
   'my-page6',
   'my-page7',
   'my-page8',
-  'my-page9',
?            ^

+  'my-page9']
?            ^

-  'my-page10',
-  'my-page11',
-  'my-page0',
-  'my-page1']

  File "/usr/lib/python2.7/unittest/case.py", line 329, in run
    testMethod()
  File "/home/jenkins/workspace/plone-5.1-python-2.7/src/Products.CMFPlone/Products/CMFPlone/tests/testSearch.py", line 211, in test_default_search_order_alphabetic
    self.assertEqual(ids, expected)
  File "/usr/lib/python2.7/unittest/case.py", line 513, in assertEqual
    assertion_func(first, second, msg=msg)
  File "/usr/lib/python2.7/unittest/case.py", line 742, in assertListEqual
    self.assertSequenceEqual(list1, list2, msg, seq_type=list)
  File "/usr/lib/python2.7/unittest/case.py", line 724, in assertSequenceEqual
    self.fail(msg)
  File "/usr/lib/python2.7/unittest/case.py", line 410, in fail
    raise self.failureException(msg)


FAILED:  Products.CMFPlone.tests.testSearch.TestSection.test_default_search_order_date

Error Message:
Lists differ: ['my-page3', 'my-page2', 'my-p... != ['my-page11', 'my-page10', 'my...

Stack Trace:
Lists differ: ['my-page3', 'my-page2', 'my-p... != ['my-page11', 'my-page10', 'my...

First differing element 0:
'my-page3'
'my-page11'

- ['my-page3',
-  'my-page2',
-  'my-page1',
-  'my-page0',
-  'my-page11',
? ^

+ ['my-page11',
? ^

   'my-page10',
   'my-page9',
   'my-page8',
   'my-page7',
-  'my-page6']
?            ^

+  'my-page6',
?            ^

+  'my-page4',
+  'my-page3',
+  'my-page2',
+  'my-page1']

  File "/usr/lib/python2.7/unittest/case.py", line 329, in run
    testMethod()
  File "/home/jenkins/workspace/plone-5.1-python-2.7/src/Products.CMFPlone/Products/CMFPlone/tests/testSearch.py", line 195, in test_default_search_order_date
    self.assertEqual(ids, expected)
  File "/usr/lib/python2.7/unittest/case.py", line 513, in assertEqual
    assertion_func(first, second, msg=msg)
  File "/usr/lib/python2.7/unittest/case.py", line 742, in assertListEqual
    self.assertSequenceEqual(list1, list2, msg, seq_type=list)
  File "/usr/lib/python2.7/unittest/case.py", line 724, in assertSequenceEqual
    self.fail(msg)
  File "/usr/lib/python2.7/unittest/case.py", line 410, in fail
    raise self.failureException(msg)


FAILED:  Products.CMFPlone.tests.testSearch.TestSection.test_default_search_order_relevance

Error Message:
Lists differ: ['my-page3', 'my-page2', 'my-p... != ['my-page11', 'my-page10', 'my...

Stack Trace:
Lists differ: ['my-page3', 'my-page2', 'my-p... != ['my-page11', 'my-page10', 'my...

First differing element 0:
'my-page3'
'my-page11'

- ['my-page3',
-  'my-page2',
-  'my-page1',
-  'my-page0',
-  'my-page11',
? ^

+ ['my-page11',
? ^

   'my-page10',
   'my-page9',
   'my-page8',
   'my-page7',
-  'my-page6']
?            ^

+  'my-page6',
?            ^

+  'my-page5',
+  'my-page4',
+  'my-page3',
+  'my-page2']

  File "/usr/lib/python2.7/unittest/case.py", line 329, in run
    testMethod()
  File "/home/jenkins/workspace/plone-5.1-python-2.7/src/Products.CMFPlone/Products/CMFPlone/tests/testSearch.py", line 174, in test_default_search_order_relevance
    self.assertEqual(ids, expected)
  File "/usr/lib/python2.7/unittest/case.py", line 513, in assertEqual
    assertion_func(first, second, msg=msg)
  File "/usr/lib/python2.7/unittest/case.py", line 742, in assertListEqual
    self.assertSequenceEqual(list1, list2, msg, seq_type=list)
  File "/usr/lib/python2.7/unittest/case.py", line 724, in assertSequenceEqual
    self.fail(msg)
  File "/usr/lib/python2.7/unittest/case.py", line 410, in fail
    raise self.failureException(msg)





More information about the Testbot mailing list