[Testbot] Plone 5.1 - Python 2.7 - Build # 437 - Failure!

jenkins at plone.org jenkins at plone.org
Mon Aug 28 12:57:58 UTC 2017


Plone 5.1 - Python 2.7 - Build # 437 - Failure:

Check console output at http://jenkins.plone.org/job/plone-5.1-python-2.7/437/ to view the results.

Changes:

[Eric Steele] diazo 1.2.7







Test Results:

149 tests failed.
FAILED:  diazo.tests.test_diazo.Test-absolute-prefix-disabled.testAll

Error Message:
No section: 'diazotest'

Stack Trace:
No section: 'diazotest'

  File "/usr/lib/python2.7/unittest/case.py", line 329, in run
    testMethod()
  File "/home/jenkins/.buildout/eggs/diazo-1.2.7-py2.7.egg/diazo/tests/test_diazo.py", line 84, in testAll
    if config.get('diazotest', 'theme'):
  File "/usr/lib/python2.7/ConfigParser.py", line 607, in get
    raise NoSectionError(section)


FAILED:  diazo.tests.test_diazo.Test-absolute-prefix-ie-conditional-comments.testAll

Error Message:
No section: 'diazotest'

Stack Trace:
No section: 'diazotest'

  File "/usr/lib/python2.7/unittest/case.py", line 329, in run
    testMethod()
  File "/home/jenkins/.buildout/eggs/diazo-1.2.7-py2.7.egg/diazo/tests/test_diazo.py", line 84, in testAll
    if config.get('diazotest', 'theme'):
  File "/usr/lib/python2.7/ConfigParser.py", line 607, in get
    raise NoSectionError(section)


FAILED:  diazo.tests.test_diazo.Test-absolute-prefix.testAll

Error Message:
No section: 'diazotest'

Stack Trace:
No section: 'diazotest'

  File "/usr/lib/python2.7/unittest/case.py", line 329, in run
    testMethod()
  File "/home/jenkins/.buildout/eggs/diazo-1.2.7-py2.7.egg/diazo/tests/test_diazo.py", line 84, in testAll
    if config.get('diazotest', 'theme'):
  File "/usr/lib/python2.7/ConfigParser.py", line 607, in get
    raise NoSectionError(section)


FAILED:  diazo.tests.test_diazo.Test-allow-curly-brackets.testAll

Error Message:
No section: 'diazotest'

Stack Trace:
No section: 'diazotest'

  File "/usr/lib/python2.7/unittest/case.py", line 329, in run
    testMethod()
  File "/home/jenkins/.buildout/eggs/diazo-1.2.7-py2.7.egg/diazo/tests/test_diazo.py", line 84, in testAll
    if config.get('diazotest', 'theme'):
  File "/usr/lib/python2.7/ConfigParser.py", line 607, in get
    raise NoSectionError(section)


FAILED:  diazo.tests.test_diazo.Test-append.testAll

Error Message:
No section: 'diazotest'

Stack Trace:
No section: 'diazotest'

  File "/usr/lib/python2.7/unittest/case.py", line 329, in run
    testMethod()
  File "/home/jenkins/.buildout/eggs/diazo-1.2.7-py2.7.egg/diazo/tests/test_diazo.py", line 84, in testAll
    if config.get('diazotest', 'theme'):
  File "/usr/lib/python2.7/ConfigParser.py", line 607, in get
    raise NoSectionError(section)


FAILED:  diazo.tests.test_diazo.Test-before-content-conditional.testAll

Error Message:
No section: 'diazotest'

Stack Trace:
No section: 'diazotest'

  File "/usr/lib/python2.7/unittest/case.py", line 329, in run
    testMethod()
  File "/home/jenkins/.buildout/eggs/diazo-1.2.7-py2.7.egg/diazo/tests/test_diazo.py", line 84, in testAll
    if config.get('diazotest', 'theme'):
  File "/usr/lib/python2.7/ConfigParser.py", line 607, in get
    raise NoSectionError(section)


FAILED:  diazo.tests.test_diazo.Test-before-prepend-append-after.testAll

Error Message:
No section: 'diazotest'

Stack Trace:
No section: 'diazotest'

  File "/usr/lib/python2.7/unittest/case.py", line 329, in run
    testMethod()
  File "/home/jenkins/.buildout/eggs/diazo-1.2.7-py2.7.egg/diazo/tests/test_diazo.py", line 84, in testAll
    if config.get('diazotest', 'theme'):
  File "/usr/lib/python2.7/ConfigParser.py", line 607, in get
    raise NoSectionError(section)


FAILED:  diazo.tests.test_diazo.Test-comments-outside-root-tag.testAll

Error Message:
No section: 'diazotest'

Stack Trace:
No section: 'diazotest'

  File "/usr/lib/python2.7/unittest/case.py", line 329, in run
    testMethod()
  File "/home/jenkins/.buildout/eggs/diazo-1.2.7-py2.7.egg/diazo/tests/test_diazo.py", line 84, in testAll
    if config.get('diazotest', 'theme'):
  File "/usr/lib/python2.7/ConfigParser.py", line 607, in get
    raise NoSectionError(section)


FAILED:  diazo.tests.test_diazo.Test-comments.testAll

Error Message:
No section: 'diazotest'

Stack Trace:
No section: 'diazotest'

  File "/usr/lib/python2.7/unittest/case.py", line 329, in run
    testMethod()
  File "/home/jenkins/.buildout/eggs/diazo-1.2.7-py2.7.egg/diazo/tests/test_diazo.py", line 84, in testAll
    if config.get('diazotest', 'theme'):
  File "/usr/lib/python2.7/ConfigParser.py", line 607, in get
    raise NoSectionError(section)


FAILED:  diazo.tests.test_diazo.Test-conditional-content-rules-with-variable.testAll

Error Message:
No section: 'diazotest'

Stack Trace:
No section: 'diazotest'

  File "/usr/lib/python2.7/unittest/case.py", line 329, in run
    testMethod()
  File "/home/jenkins/.buildout/eggs/diazo-1.2.7-py2.7.egg/diazo/tests/test_diazo.py", line 84, in testAll
    if config.get('diazotest', 'theme'):
  File "/usr/lib/python2.7/ConfigParser.py", line 607, in get
    raise NoSectionError(section)


FAILED:  diazo.tests.test_diazo.Test-conditional-drop-in-append-1.testAll

Error Message:
No section: 'diazotest'

Stack Trace:
No section: 'diazotest'

  File "/usr/lib/python2.7/unittest/case.py", line 329, in run
    testMethod()
  File "/home/jenkins/.buildout/eggs/diazo-1.2.7-py2.7.egg/diazo/tests/test_diazo.py", line 84, in testAll
    if config.get('diazotest', 'theme'):
  File "/usr/lib/python2.7/ConfigParser.py", line 607, in get
    raise NoSectionError(section)


FAILED:  diazo.tests.test_diazo.Test-conditional-drop-in-append-2.testAll

Error Message:
No section: 'diazotest'

Stack Trace:
No section: 'diazotest'

  File "/usr/lib/python2.7/unittest/case.py", line 329, in run
    testMethod()
  File "/home/jenkins/.buildout/eggs/diazo-1.2.7-py2.7.egg/diazo/tests/test_diazo.py", line 84, in testAll
    if config.get('diazotest', 'theme'):
  File "/usr/lib/python2.7/ConfigParser.py", line 607, in get
    raise NoSectionError(section)


FAILED:  diazo.tests.test_diazo.Test-conditional-include-content.testAll

Error Message:
No section: 'diazotest'

Stack Trace:
No section: 'diazotest'

  File "/usr/lib/python2.7/unittest/case.py", line 329, in run
    testMethod()
  File "/home/jenkins/.buildout/eggs/diazo-1.2.7-py2.7.egg/diazo/tests/test_diazo.py", line 84, in testAll
    if config.get('diazotest', 'theme'):
  File "/usr/lib/python2.7/ConfigParser.py", line 607, in get
    raise NoSectionError(section)


FAILED:  diazo.tests.test_diazo.Test-conditional-rules-1.testAll

Error Message:
No section: 'diazotest'

Stack Trace:
No section: 'diazotest'

  File "/usr/lib/python2.7/unittest/case.py", line 329, in run
    testMethod()
  File "/home/jenkins/.buildout/eggs/diazo-1.2.7-py2.7.egg/diazo/tests/test_diazo.py", line 84, in testAll
    if config.get('diazotest', 'theme'):
  File "/usr/lib/python2.7/ConfigParser.py", line 607, in get
    raise NoSectionError(section)


FAILED:  diazo.tests.test_diazo.Test-conditional-rules-2.testAll

Error Message:
No section: 'diazotest'

Stack Trace:
No section: 'diazotest'

  File "/usr/lib/python2.7/unittest/case.py", line 329, in run
    testMethod()
  File "/home/jenkins/.buildout/eggs/diazo-1.2.7-py2.7.egg/diazo/tests/test_diazo.py", line 84, in testAll
    if config.get('diazotest', 'theme'):
  File "/usr/lib/python2.7/ConfigParser.py", line 607, in get
    raise NoSectionError(section)


FAILED:  diazo.tests.test_diazo.Test-copy-xsl.testAll

Error Message:
No section: 'diazotest'

Stack Trace:
No section: 'diazotest'

  File "/usr/lib/python2.7/unittest/case.py", line 329, in run
    testMethod()
  File "/home/jenkins/.buildout/eggs/diazo-1.2.7-py2.7.egg/diazo/tests/test_diazo.py", line 84, in testAll
    if config.get('diazotest', 'theme'):
  File "/usr/lib/python2.7/ConfigParser.py", line 607, in get
    raise NoSectionError(section)


FAILED:  diazo.tests.test_diazo.Test-copy.testAll

Error Message:
No section: 'diazotest'

Stack Trace:
No section: 'diazotest'

  File "/usr/lib/python2.7/unittest/case.py", line 329, in run
    testMethod()
  File "/home/jenkins/.buildout/eggs/diazo-1.2.7-py2.7.egg/diazo/tests/test_diazo.py", line 84, in testAll
    if config.get('diazotest', 'theme'):
  File "/usr/lib/python2.7/ConfigParser.py", line 607, in get
    raise NoSectionError(section)


FAILED:  diazo.tests.test_diazo.Test-css-prefix.testAll

Error Message:
No section: 'diazotest'

Stack Trace:
No section: 'diazotest'

  File "/usr/lib/python2.7/unittest/case.py", line 329, in run
    testMethod()
  File "/home/jenkins/.buildout/eggs/diazo-1.2.7-py2.7.egg/diazo/tests/test_diazo.py", line 84, in testAll
    if config.get('diazotest', 'theme'):
  File "/usr/lib/python2.7/ConfigParser.py", line 607, in get
    raise NoSectionError(section)


FAILED:  diazo.tests.test_diazo.Test-css-xpath-child-selectors.testAll

Error Message:
No section: 'diazotest'

Stack Trace:
No section: 'diazotest'

  File "/usr/lib/python2.7/unittest/case.py", line 329, in run
    testMethod()
  File "/home/jenkins/.buildout/eggs/diazo-1.2.7-py2.7.egg/diazo/tests/test_diazo.py", line 84, in testAll
    if config.get('diazotest', 'theme'):
  File "/usr/lib/python2.7/ConfigParser.py", line 607, in get
    raise NoSectionError(section)


FAILED:  diazo.tests.test_diazo.Test-css-xsl-template.testAll

Error Message:
No section: 'diazotest'

Stack Trace:
No section: 'diazotest'

  File "/usr/lib/python2.7/unittest/case.py", line 329, in run
    testMethod()
  File "/home/jenkins/.buildout/eggs/diazo-1.2.7-py2.7.egg/diazo/tests/test_diazo.py", line 84, in testAll
    if config.get('diazotest', 'theme'):
  File "/usr/lib/python2.7/ConfigParser.py", line 607, in get
    raise NoSectionError(section)


FAILED:  diazo.tests.test_diazo.Test-document-includes.testAll

Error Message:
No section: 'diazotest'

Stack Trace:
No section: 'diazotest'

  File "/usr/lib/python2.7/unittest/case.py", line 329, in run
    testMethod()
  File "/home/jenkins/.buildout/eggs/diazo-1.2.7-py2.7.egg/diazo/tests/test_diazo.py", line 84, in testAll
    if config.get('diazotest', 'theme'):
  File "/usr/lib/python2.7/ConfigParser.py", line 607, in get
    raise NoSectionError(section)


FAILED:  diazo.tests.test_diazo.Test-drop-content-comment.testAll

Error Message:
No section: 'diazotest'

Stack Trace:
No section: 'diazotest'

  File "/usr/lib/python2.7/unittest/case.py", line 329, in run
    testMethod()
  File "/home/jenkins/.buildout/eggs/diazo-1.2.7-py2.7.egg/diazo/tests/test_diazo.py", line 84, in testAll
    if config.get('diazotest', 'theme'):
  File "/usr/lib/python2.7/ConfigParser.py", line 607, in get
    raise NoSectionError(section)


FAILED:  diazo.tests.test_diazo.Test-drop-content.testAll

Error Message:
No section: 'diazotest'

Stack Trace:
No section: 'diazotest'

  File "/usr/lib/python2.7/unittest/case.py", line 329, in run
    testMethod()
  File "/home/jenkins/.buildout/eggs/diazo-1.2.7-py2.7.egg/diazo/tests/test_diazo.py", line 84, in testAll
    if config.get('diazotest', 'theme'):
  File "/usr/lib/python2.7/ConfigParser.py", line 607, in get
    raise NoSectionError(section)


FAILED:  diazo.tests.test_diazo.Test-drop-replace.testAll

Error Message:
No section: 'diazotest'

Stack Trace:
No section: 'diazotest'

  File "/usr/lib/python2.7/unittest/case.py", line 329, in run
    testMethod()
  File "/home/jenkins/.buildout/eggs/diazo-1.2.7-py2.7.egg/diazo/tests/test_diazo.py", line 84, in testAll
    if config.get('diazotest', 'theme'):
  File "/usr/lib/python2.7/ConfigParser.py", line 607, in get
    raise NoSectionError(section)


FAILED:  diazo.tests.test_diazo.Test-drop-theme-children.testAll

Error Message:
No section: 'diazotest'

Stack Trace:
No section: 'diazotest'

  File "/usr/lib/python2.7/unittest/case.py", line 329, in run
    testMethod()
  File "/home/jenkins/.buildout/eggs/diazo-1.2.7-py2.7.egg/diazo/tests/test_diazo.py", line 84, in testAll
    if config.get('diazotest', 'theme'):
  File "/usr/lib/python2.7/ConfigParser.py", line 607, in get
    raise NoSectionError(section)


FAILED:  diazo.tests.test_diazo.Test-drop-theme-comment.testAll

Error Message:
No section: 'diazotest'

Stack Trace:
No section: 'diazotest'

  File "/usr/lib/python2.7/unittest/case.py", line 329, in run
    testMethod()
  File "/home/jenkins/.buildout/eggs/diazo-1.2.7-py2.7.egg/diazo/tests/test_diazo.py", line 84, in testAll
    if config.get('diazotest', 'theme'):
  File "/usr/lib/python2.7/ConfigParser.py", line 607, in get
    raise NoSectionError(section)


FAILED:  diazo.tests.test_diazo.Test-empty-xmlns.testAll

Error Message:
No section: 'diazotest'

Stack Trace:
No section: 'diazotest'

  File "/usr/lib/python2.7/unittest/case.py", line 329, in run
    testMethod()
  File "/home/jenkins/.buildout/eggs/diazo-1.2.7-py2.7.egg/diazo/tests/test_diazo.py", line 84, in testAll
    if config.get('diazotest', 'theme'):
  File "/usr/lib/python2.7/ConfigParser.py", line 607, in get
    raise NoSectionError(section)


FAILED:  diazo.tests.test_diazo.Test-entities.testAll

Error Message:
No section: 'diazotest'

Stack Trace:
No section: 'diazotest'

  File "/usr/lib/python2.7/unittest/case.py", line 329, in run
    testMethod()
  File "/home/jenkins/.buildout/eggs/diazo-1.2.7-py2.7.egg/diazo/tests/test_diazo.py", line 84, in testAll
    if config.get('diazotest', 'theme'):
  File "/usr/lib/python2.7/ConfigParser.py", line 607, in get
    raise NoSectionError(section)


FAILED:  diazo.tests.test_diazo.Test-esi.testAll

Error Message:
No section: 'diazotest'

Stack Trace:
No section: 'diazotest'

  File "/usr/lib/python2.7/unittest/case.py", line 329, in run
    testMethod()
  File "/home/jenkins/.buildout/eggs/diazo-1.2.7-py2.7.egg/diazo/tests/test_diazo.py", line 84, in testAll
    if config.get('diazotest', 'theme'):
  File "/usr/lib/python2.7/ConfigParser.py", line 607, in get
    raise NoSectionError(section)


FAILED:  diazo.tests.test_diazo.Test-html-attributes.testAll

Error Message:
No section: 'diazotest'

Stack Trace:
No section: 'diazotest'

  File "/usr/lib/python2.7/unittest/case.py", line 329, in run
    testMethod()
  File "/home/jenkins/.buildout/eggs/diazo-1.2.7-py2.7.egg/diazo/tests/test_diazo.py", line 84, in testAll
    if config.get('diazotest', 'theme'):
  File "/usr/lib/python2.7/ConfigParser.py", line 607, in get
    raise NoSectionError(section)


FAILED:  diazo.tests.test_diazo.Test-html-xml-lang-2.testAll

Error Message:
No section: 'diazotest'

Stack Trace:
No section: 'diazotest'

  File "/usr/lib/python2.7/unittest/case.py", line 329, in run
    testMethod()
  File "/home/jenkins/.buildout/eggs/diazo-1.2.7-py2.7.egg/diazo/tests/test_diazo.py", line 84, in testAll
    if config.get('diazotest', 'theme'):
  File "/usr/lib/python2.7/ConfigParser.py", line 607, in get
    raise NoSectionError(section)


FAILED:  diazo.tests.test_diazo.Test-html-xml-lang-3.testAll

Error Message:
No section: 'diazotest'

Stack Trace:
No section: 'diazotest'

  File "/usr/lib/python2.7/unittest/case.py", line 329, in run
    testMethod()
  File "/home/jenkins/.buildout/eggs/diazo-1.2.7-py2.7.egg/diazo/tests/test_diazo.py", line 84, in testAll
    if config.get('diazotest', 'theme'):
  File "/usr/lib/python2.7/ConfigParser.py", line 607, in get
    raise NoSectionError(section)


FAILED:  diazo.tests.test_diazo.Test-html-xml-lang.testAll

Error Message:
No section: 'diazotest'

Stack Trace:
No section: 'diazotest'

  File "/usr/lib/python2.7/unittest/case.py", line 329, in run
    testMethod()
  File "/home/jenkins/.buildout/eggs/diazo-1.2.7-py2.7.egg/diazo/tests/test_diazo.py", line 84, in testAll
    if config.get('diazotest', 'theme'):
  File "/usr/lib/python2.7/ConfigParser.py", line 607, in get
    raise NoSectionError(section)


FAILED:  diazo.tests.test_diazo.Test-if-path-1.testAll

Error Message:
No section: 'diazotest'

Stack Trace:
No section: 'diazotest'

  File "/usr/lib/python2.7/unittest/case.py", line 329, in run
    testMethod()
  File "/home/jenkins/.buildout/eggs/diazo-1.2.7-py2.7.egg/diazo/tests/test_diazo.py", line 84, in testAll
    if config.get('diazotest', 'theme'):
  File "/usr/lib/python2.7/ConfigParser.py", line 607, in get
    raise NoSectionError(section)


FAILED:  diazo.tests.test_diazo.Test-if-path-2.testAll

Error Message:
No section: 'diazotest'

Stack Trace:
No section: 'diazotest'

  File "/usr/lib/python2.7/unittest/case.py", line 329, in run
    testMethod()
  File "/home/jenkins/.buildout/eggs/diazo-1.2.7-py2.7.egg/diazo/tests/test_diazo.py", line 84, in testAll
    if config.get('diazotest', 'theme'):
  File "/usr/lib/python2.7/ConfigParser.py", line 607, in get
    raise NoSectionError(section)


FAILED:  diazo.tests.test_diazo.Test-if-path-3.testAll

Error Message:
No section: 'diazotest'

Stack Trace:
No section: 'diazotest'

  File "/usr/lib/python2.7/unittest/case.py", line 329, in run
    testMethod()
  File "/home/jenkins/.buildout/eggs/diazo-1.2.7-py2.7.egg/diazo/tests/test_diazo.py", line 84, in testAll
    if config.get('diazotest', 'theme'):
  File "/usr/lib/python2.7/ConfigParser.py", line 607, in get
    raise NoSectionError(section)


FAILED:  diazo.tests.test_diazo.Test-if-path-4.testAll

Error Message:
No section: 'diazotest'

Stack Trace:
No section: 'diazotest'

  File "/usr/lib/python2.7/unittest/case.py", line 329, in run
    testMethod()
  File "/home/jenkins/.buildout/eggs/diazo-1.2.7-py2.7.egg/diazo/tests/test_diazo.py", line 84, in testAll
    if config.get('diazotest', 'theme'):
  File "/usr/lib/python2.7/ConfigParser.py", line 607, in get
    raise NoSectionError(section)


FAILED:  diazo.tests.test_diazo.Test-if-path-5.testAll

Error Message:
No section: 'diazotest'

Stack Trace:
No section: 'diazotest'

  File "/usr/lib/python2.7/unittest/case.py", line 329, in run
    testMethod()
  File "/home/jenkins/.buildout/eggs/diazo-1.2.7-py2.7.egg/diazo/tests/test_diazo.py", line 84, in testAll
    if config.get('diazotest', 'theme'):
  File "/usr/lib/python2.7/ConfigParser.py", line 607, in get
    raise NoSectionError(section)


FAILED:  diazo.tests.test_diazo.Test-if-path-6.testAll

Error Message:
No section: 'diazotest'

Stack Trace:
No section: 'diazotest'

  File "/usr/lib/python2.7/unittest/case.py", line 329, in run
    testMethod()
  File "/home/jenkins/.buildout/eggs/diazo-1.2.7-py2.7.egg/diazo/tests/test_diazo.py", line 84, in testAll
    if config.get('diazotest', 'theme'):
  File "/usr/lib/python2.7/ConfigParser.py", line 607, in get
    raise NoSectionError(section)


FAILED:  diazo.tests.test_diazo.Test-if-path-7.testAll

Error Message:
No section: 'diazotest'

Stack Trace:
No section: 'diazotest'

  File "/usr/lib/python2.7/unittest/case.py", line 329, in run
    testMethod()
  File "/home/jenkins/.buildout/eggs/diazo-1.2.7-py2.7.egg/diazo/tests/test_diazo.py", line 84, in testAll
    if config.get('diazotest', 'theme'):
  File "/usr/lib/python2.7/ConfigParser.py", line 607, in get
    raise NoSectionError(section)


FAILED:  diazo.tests.test_diazo.Test-if-path-8.testAll

Error Message:
No section: 'diazotest'

Stack Trace:
No section: 'diazotest'

  File "/usr/lib/python2.7/unittest/case.py", line 329, in run
    testMethod()
  File "/home/jenkins/.buildout/eggs/diazo-1.2.7-py2.7.egg/diazo/tests/test_diazo.py", line 84, in testAll
    if config.get('diazotest', 'theme'):
  File "/usr/lib/python2.7/ConfigParser.py", line 607, in get
    raise NoSectionError(section)


FAILED:  diazo.tests.test_diazo.Test-include-content.testAll

Error Message:
No section: 'diazotest'

Stack Trace:
No section: 'diazotest'

  File "/usr/lib/python2.7/unittest/case.py", line 329, in run
    testMethod()
  File "/home/jenkins/.buildout/eggs/diazo-1.2.7-py2.7.egg/diazo/tests/test_diazo.py", line 84, in testAll
    if config.get('diazotest', 'theme'):
  File "/usr/lib/python2.7/ConfigParser.py", line 607, in get
    raise NoSectionError(section)


FAILED:  diazo.tests.test_diazo.Test-indent-off.testAll

Error Message:
No section: 'diazotest'

Stack Trace:
No section: 'diazotest'

  File "/usr/lib/python2.7/unittest/case.py", line 329, in run
    testMethod()
  File "/home/jenkins/.buildout/eggs/diazo-1.2.7-py2.7.egg/diazo/tests/test_diazo.py", line 84, in testAll
    if config.get('diazotest', 'theme'):
  File "/usr/lib/python2.7/ConfigParser.py", line 607, in get
    raise NoSectionError(section)


FAILED:  diazo.tests.test_diazo.Test-inline-xsl-apply-templates.testAll

Error Message:
No section: 'diazotest'

Stack Trace:
No section: 'diazotest'

  File "/usr/lib/python2.7/unittest/case.py", line 329, in run
    testMethod()
  File "/home/jenkins/.buildout/eggs/diazo-1.2.7-py2.7.egg/diazo/tests/test_diazo.py", line 84, in testAll
    if config.get('diazotest', 'theme'):
  File "/usr/lib/python2.7/ConfigParser.py", line 607, in get
    raise NoSectionError(section)


FAILED:  diazo.tests.test_diazo.Test-inline-xsl-directives.testAll

Error Message:
No section: 'diazotest'

Stack Trace:
No section: 'diazotest'

  File "/usr/lib/python2.7/unittest/case.py", line 329, in run
    testMethod()
  File "/home/jenkins/.buildout/eggs/diazo-1.2.7-py2.7.egg/diazo/tests/test_diazo.py", line 84, in testAll
    if config.get('diazotest', 'theme'):
  File "/usr/lib/python2.7/ConfigParser.py", line 607, in get
    raise NoSectionError(section)


FAILED:  diazo.tests.test_diazo.Test-modify-theme.testAll

Error Message:
No section: 'diazotest'

Stack Trace:
No section: 'diazotest'

  File "/usr/lib/python2.7/unittest/case.py", line 329, in run
    testMethod()
  File "/home/jenkins/.buildout/eggs/diazo-1.2.7-py2.7.egg/diazo/tests/test_diazo.py", line 84, in testAll
    if config.get('diazotest', 'theme'):
  File "/usr/lib/python2.7/ConfigParser.py", line 607, in get
    raise NoSectionError(section)


FAILED:  diazo.tests.test_diazo.Test-multi-copy-1.testAll

Error Message:
No section: 'diazotest'

Stack Trace:
No section: 'diazotest'

  File "/usr/lib/python2.7/unittest/case.py", line 329, in run
    testMethod()
  File "/home/jenkins/.buildout/eggs/diazo-1.2.7-py2.7.egg/diazo/tests/test_diazo.py", line 84, in testAll
    if config.get('diazotest', 'theme'):
  File "/usr/lib/python2.7/ConfigParser.py", line 607, in get
    raise NoSectionError(section)


FAILED:  diazo.tests.test_diazo.Test-multi-copy-2.testAll

Error Message:
No section: 'diazotest'

Stack Trace:
No section: 'diazotest'

  File "/usr/lib/python2.7/unittest/case.py", line 329, in run
    testMethod()
  File "/home/jenkins/.buildout/eggs/diazo-1.2.7-py2.7.egg/diazo/tests/test_diazo.py", line 84, in testAll
    if config.get('diazotest', 'theme'):
  File "/usr/lib/python2.7/ConfigParser.py", line 607, in get
    raise NoSectionError(section)


FAILED:  diazo.tests.test_diazo.Test-multi-copy-3.testAll

Error Message:
No section: 'diazotest'

Stack Trace:
No section: 'diazotest'

  File "/usr/lib/python2.7/unittest/case.py", line 329, in run
    testMethod()
  File "/home/jenkins/.buildout/eggs/diazo-1.2.7-py2.7.egg/diazo/tests/test_diazo.py", line 84, in testAll
    if config.get('diazotest', 'theme'):
  File "/usr/lib/python2.7/ConfigParser.py", line 607, in get
    raise NoSectionError(section)


FAILED:  diazo.tests.test_diazo.Test-multi-copy-4.testAll

Error Message:
No section: 'diazotest'

Stack Trace:
No section: 'diazotest'

  File "/usr/lib/python2.7/unittest/case.py", line 329, in run
    testMethod()
  File "/home/jenkins/.buildout/eggs/diazo-1.2.7-py2.7.egg/diazo/tests/test_diazo.py", line 84, in testAll
    if config.get('diazotest', 'theme'):
  File "/usr/lib/python2.7/ConfigParser.py", line 607, in get
    raise NoSectionError(section)


FAILED:  diazo.tests.test_diazo.Test-multi-replace-1.testAll

Error Message:
No section: 'diazotest'

Stack Trace:
No section: 'diazotest'

  File "/usr/lib/python2.7/unittest/case.py", line 329, in run
    testMethod()
  File "/home/jenkins/.buildout/eggs/diazo-1.2.7-py2.7.egg/diazo/tests/test_diazo.py", line 84, in testAll
    if config.get('diazotest', 'theme'):
  File "/usr/lib/python2.7/ConfigParser.py", line 607, in get
    raise NoSectionError(section)


FAILED:  diazo.tests.test_diazo.Test-multi-replace-2.testAll

Error Message:
No section: 'diazotest'

Stack Trace:
No section: 'diazotest'

  File "/usr/lib/python2.7/unittest/case.py", line 329, in run
    testMethod()
  File "/home/jenkins/.buildout/eggs/diazo-1.2.7-py2.7.egg/diazo/tests/test_diazo.py", line 84, in testAll
    if config.get('diazotest', 'theme'):
  File "/usr/lib/python2.7/ConfigParser.py", line 607, in get
    raise NoSectionError(section)


FAILED:  diazo.tests.test_diazo.Test-multi-replace-3.testAll

Error Message:
No section: 'diazotest'

Stack Trace:
No section: 'diazotest'

  File "/usr/lib/python2.7/unittest/case.py", line 329, in run
    testMethod()
  File "/home/jenkins/.buildout/eggs/diazo-1.2.7-py2.7.egg/diazo/tests/test_diazo.py", line 84, in testAll
    if config.get('diazotest', 'theme'):
  File "/usr/lib/python2.7/ConfigParser.py", line 607, in get
    raise NoSectionError(section)


FAILED:  diazo.tests.test_diazo.Test-multi-replace-4.testAll

Error Message:
No section: 'diazotest'

Stack Trace:
No section: 'diazotest'

  File "/usr/lib/python2.7/unittest/case.py", line 329, in run
    testMethod()
  File "/home/jenkins/.buildout/eggs/diazo-1.2.7-py2.7.egg/diazo/tests/test_diazo.py", line 84, in testAll
    if config.get('diazotest', 'theme'):
  File "/usr/lib/python2.7/ConfigParser.py", line 607, in get
    raise NoSectionError(section)


FAILED:  diazo.tests.test_diazo.Test-multi-theme-1.testAll

Error Message:
No section: 'diazotest'

Stack Trace:
No section: 'diazotest'

  File "/usr/lib/python2.7/unittest/case.py", line 329, in run
    testMethod()
  File "/home/jenkins/.buildout/eggs/diazo-1.2.7-py2.7.egg/diazo/tests/test_diazo.py", line 84, in testAll
    if config.get('diazotest', 'theme'):
  File "/usr/lib/python2.7/ConfigParser.py", line 607, in get
    raise NoSectionError(section)


FAILED:  diazo.tests.test_diazo.Test-multi-theme-2.testAll

Error Message:
No section: 'diazotest'

Stack Trace:
No section: 'diazotest'

  File "/usr/lib/python2.7/unittest/case.py", line 329, in run
    testMethod()
  File "/home/jenkins/.buildout/eggs/diazo-1.2.7-py2.7.egg/diazo/tests/test_diazo.py", line 84, in testAll
    if config.get('diazotest', 'theme'):
  File "/usr/lib/python2.7/ConfigParser.py", line 607, in get
    raise NoSectionError(section)


FAILED:  diazo.tests.test_diazo.Test-multi-theme-3.testAll

Error Message:
No section: 'diazotest'

Stack Trace:
No section: 'diazotest'

  File "/usr/lib/python2.7/unittest/case.py", line 329, in run
    testMethod()
  File "/home/jenkins/.buildout/eggs/diazo-1.2.7-py2.7.egg/diazo/tests/test_diazo.py", line 84, in testAll
    if config.get('diazotest', 'theme'):
  File "/usr/lib/python2.7/ConfigParser.py", line 607, in get
    raise NoSectionError(section)


FAILED:  diazo.tests.test_diazo.Test-multi-theme-4.testAll

Error Message:
No section: 'diazotest'

Stack Trace:
No section: 'diazotest'

  File "/usr/lib/python2.7/unittest/case.py", line 329, in run
    testMethod()
  File "/home/jenkins/.buildout/eggs/diazo-1.2.7-py2.7.egg/diazo/tests/test_diazo.py", line 84, in testAll
    if config.get('diazotest', 'theme'):
  File "/usr/lib/python2.7/ConfigParser.py", line 607, in get
    raise NoSectionError(section)


FAILED:  diazo.tests.test_diazo.Test-multi-theme-5.testAll

Error Message:
No section: 'diazotest'

Stack Trace:
No section: 'diazotest'

  File "/usr/lib/python2.7/unittest/case.py", line 329, in run
    testMethod()
  File "/home/jenkins/.buildout/eggs/diazo-1.2.7-py2.7.egg/diazo/tests/test_diazo.py", line 84, in testAll
    if config.get('diazotest', 'theme'):
  File "/usr/lib/python2.7/ConfigParser.py", line 607, in get
    raise NoSectionError(section)


FAILED:  diazo.tests.test_diazo.Test-multi-theme-variable-1.testAll

Error Message:
No section: 'diazotest'

Stack Trace:
No section: 'diazotest'

  File "/usr/lib/python2.7/unittest/case.py", line 329, in run
    testMethod()
  File "/home/jenkins/.buildout/eggs/diazo-1.2.7-py2.7.egg/diazo/tests/test_diazo.py", line 84, in testAll
    if config.get('diazotest', 'theme'):
  File "/usr/lib/python2.7/ConfigParser.py", line 607, in get
    raise NoSectionError(section)


FAILED:  diazo.tests.test_diazo.Test-nested-conditions-1.testAll

Error Message:
No section: 'diazotest'

Stack Trace:
No section: 'diazotest'

  File "/usr/lib/python2.7/unittest/case.py", line 329, in run
    testMethod()
  File "/home/jenkins/.buildout/eggs/diazo-1.2.7-py2.7.egg/diazo/tests/test_diazo.py", line 84, in testAll
    if config.get('diazotest', 'theme'):
  File "/usr/lib/python2.7/ConfigParser.py", line 607, in get
    raise NoSectionError(section)


FAILED:  diazo.tests.test_diazo.Test-nested-conditions-2.testAll

Error Message:
No section: 'diazotest'

Stack Trace:
No section: 'diazotest'

  File "/usr/lib/python2.7/unittest/case.py", line 329, in run
    testMethod()
  File "/home/jenkins/.buildout/eggs/diazo-1.2.7-py2.7.egg/diazo/tests/test_diazo.py", line 84, in testAll
    if config.get('diazotest', 'theme'):
  File "/usr/lib/python2.7/ConfigParser.py", line 607, in get
    raise NoSectionError(section)


FAILED:  diazo.tests.test_diazo.Test-nested-conditions-3.testAll

Error Message:
No section: 'diazotest'

Stack Trace:
No section: 'diazotest'

  File "/usr/lib/python2.7/unittest/case.py", line 329, in run
    testMethod()
  File "/home/jenkins/.buildout/eggs/diazo-1.2.7-py2.7.egg/diazo/tests/test_diazo.py", line 84, in testAll
    if config.get('diazotest', 'theme'):
  File "/usr/lib/python2.7/ConfigParser.py", line 607, in get
    raise NoSectionError(section)


FAILED:  diazo.tests.test_diazo.Test-nested-rules-for-xinclude.testAll

Error Message:
No section: 'diazotest'

Stack Trace:
No section: 'diazotest'

  File "/usr/lib/python2.7/unittest/case.py", line 329, in run
    testMethod()
  File "/home/jenkins/.buildout/eggs/diazo-1.2.7-py2.7.egg/diazo/tests/test_diazo.py", line 84, in testAll
    if config.get('diazotest', 'theme'):
  File "/usr/lib/python2.7/ConfigParser.py", line 607, in get
    raise NoSectionError(section)


FAILED:  diazo.tests.test_diazo.Test-notheme-xmlns.testAll

Error Message:
No section: 'diazotest'

Stack Trace:
No section: 'diazotest'

  File "/usr/lib/python2.7/unittest/case.py", line 329, in run
    testMethod()
  File "/home/jenkins/.buildout/eggs/diazo-1.2.7-py2.7.egg/diazo/tests/test_diazo.py", line 84, in testAll
    if config.get('diazotest', 'theme'):
  File "/usr/lib/python2.7/ConfigParser.py", line 607, in get
    raise NoSectionError(section)


FAILED:  diazo.tests.test_diazo.Test-null-if-content.testAll

Error Message:
No section: 'diazotest'

Stack Trace:
No section: 'diazotest'

  File "/usr/lib/python2.7/unittest/case.py", line 329, in run
    testMethod()
  File "/home/jenkins/.buildout/eggs/diazo-1.2.7-py2.7.egg/diazo/tests/test_diazo.py", line 84, in testAll
    if config.get('diazotest', 'theme'):
  File "/usr/lib/python2.7/ConfigParser.py", line 607, in get
    raise NoSectionError(section)


FAILED:  diazo.tests.test_diazo.Test-path-param-1.testAll

Error Message:
No section: 'diazotest'

Stack Trace:
No section: 'diazotest'

  File "/usr/lib/python2.7/unittest/case.py", line 329, in run
    testMethod()
  File "/home/jenkins/.buildout/eggs/diazo-1.2.7-py2.7.egg/diazo/tests/test_diazo.py", line 84, in testAll
    if config.get('diazotest', 'theme'):
  File "/usr/lib/python2.7/ConfigParser.py", line 607, in get
    raise NoSectionError(section)


FAILED:  diazo.tests.test_diazo.Test-path-param-2.testAll

Error Message:
No section: 'diazotest'

Stack Trace:
No section: 'diazotest'

  File "/usr/lib/python2.7/unittest/case.py", line 329, in run
    testMethod()
  File "/home/jenkins/.buildout/eggs/diazo-1.2.7-py2.7.egg/diazo/tests/test_diazo.py", line 84, in testAll
    if config.get('diazotest', 'theme'):
  File "/usr/lib/python2.7/ConfigParser.py", line 607, in get
    raise NoSectionError(section)


FAILED:  diazo.tests.test_diazo.Test-pre-line-endings.testAll

Error Message:
No section: 'diazotest'

Stack Trace:
No section: 'diazotest'

  File "/usr/lib/python2.7/unittest/case.py", line 329, in run
    testMethod()
  File "/home/jenkins/.buildout/eggs/diazo-1.2.7-py2.7.egg/diazo/tests/test_diazo.py", line 84, in testAll
    if config.get('diazotest', 'theme'):
  File "/usr/lib/python2.7/ConfigParser.py", line 607, in get
    raise NoSectionError(section)


FAILED:  diazo.tests.test_diazo.Test-prepend-append.testAll

Error Message:
No section: 'diazotest'

Stack Trace:
No section: 'diazotest'

  File "/usr/lib/python2.7/unittest/case.py", line 329, in run
    testMethod()
  File "/home/jenkins/.buildout/eggs/diazo-1.2.7-py2.7.egg/diazo/tests/test_diazo.py", line 84, in testAll
    if config.get('diazotest', 'theme'):
  File "/usr/lib/python2.7/ConfigParser.py", line 607, in get
    raise NoSectionError(section)


FAILED:  diazo.tests.test_diazo.Test-prepend.testAll

Error Message:
No section: 'diazotest'

Stack Trace:
No section: 'diazotest'

  File "/usr/lib/python2.7/unittest/case.py", line 329, in run
    testMethod()
  File "/home/jenkins/.buildout/eggs/diazo-1.2.7-py2.7.egg/diazo/tests/test_diazo.py", line 84, in testAll
    if config.get('diazotest', 'theme'):
  File "/usr/lib/python2.7/ConfigParser.py", line 607, in get
    raise NoSectionError(section)


FAILED:  diazo.tests.test_diazo.Test-replace-after.testAll

Error Message:
No section: 'diazotest'

Stack Trace:
No section: 'diazotest'

  File "/usr/lib/python2.7/unittest/case.py", line 329, in run
    testMethod()
  File "/home/jenkins/.buildout/eggs/diazo-1.2.7-py2.7.egg/diazo/tests/test_diazo.py", line 84, in testAll
    if config.get('diazotest', 'theme'):
  File "/usr/lib/python2.7/ConfigParser.py", line 607, in get
    raise NoSectionError(section)


FAILED:  diazo.tests.test_diazo.Test-replace.testAll

Error Message:
No section: 'diazotest'

Stack Trace:
No section: 'diazotest'

  File "/usr/lib/python2.7/unittest/case.py", line 329, in run
    testMethod()
  File "/home/jenkins/.buildout/eggs/diazo-1.2.7-py2.7.egg/diazo/tests/test_diazo.py", line 84, in testAll
    if config.get('diazotest', 'theme'):
  File "/usr/lib/python2.7/ConfigParser.py", line 607, in get
    raise NoSectionError(section)


FAILED:  diazo.tests.test_diazo.Test-ssi.testAll

Error Message:
No section: 'diazotest'

Stack Trace:
No section: 'diazotest'

  File "/usr/lib/python2.7/unittest/case.py", line 329, in run
    testMethod()
  File "/home/jenkins/.buildout/eggs/diazo-1.2.7-py2.7.egg/diazo/tests/test_diazo.py", line 84, in testAll
    if config.get('diazotest', 'theme'):
  File "/usr/lib/python2.7/ConfigParser.py", line 607, in get
    raise NoSectionError(section)


FAILED:  diazo.tests.test_diazo.Test-ssiwait.testAll

Error Message:
No section: 'diazotest'

Stack Trace:
No section: 'diazotest'

  File "/usr/lib/python2.7/unittest/case.py", line 329, in run
    testMethod()
  File "/home/jenkins/.buildout/eggs/diazo-1.2.7-py2.7.egg/diazo/tests/test_diazo.py", line 84, in testAll
    if config.get('diazotest', 'theme'):
  File "/usr/lib/python2.7/ConfigParser.py", line 607, in get
    raise NoSectionError(section)


FAILED:  diazo.tests.test_diazo.Test-style-script-quoting-1.testAll

Error Message:
No section: 'diazotest'

Stack Trace:
No section: 'diazotest'

  File "/usr/lib/python2.7/unittest/case.py", line 329, in run
    testMethod()
  File "/home/jenkins/.buildout/eggs/diazo-1.2.7-py2.7.egg/diazo/tests/test_diazo.py", line 84, in testAll
    if config.get('diazotest', 'theme'):
  File "/usr/lib/python2.7/ConfigParser.py", line 607, in get
    raise NoSectionError(section)


FAILED:  diazo.tests.test_diazo.Test-style-script-quoting-2.testAll

Error Message:
No section: 'diazotest'

Stack Trace:
No section: 'diazotest'

  File "/usr/lib/python2.7/unittest/case.py", line 329, in run
    testMethod()
  File "/home/jenkins/.buildout/eggs/diazo-1.2.7-py2.7.egg/diazo/tests/test_diazo.py", line 84, in testAll
    if config.get('diazotest', 'theme'):
  File "/usr/lib/python2.7/ConfigParser.py", line 607, in get
    raise NoSectionError(section)


FAILED:  diazo.tests.test_diazo.Test-update-namespace-1.testAll

Error Message:
No section: 'diazotest'

Stack Trace:
No section: 'diazotest'

  File "/usr/lib/python2.7/unittest/case.py", line 329, in run
    testMethod()
  File "/home/jenkins/.buildout/eggs/diazo-1.2.7-py2.7.egg/diazo/tests/test_diazo.py", line 84, in testAll
    if config.get('diazotest', 'theme'):
  File "/usr/lib/python2.7/ConfigParser.py", line 607, in get
    raise NoSectionError(section)


FAILED:  diazo.tests.test_diazo.Test-update-namespace-2.testAll

Error Message:
No section: 'diazotest'

Stack Trace:
No section: 'diazotest'

  File "/usr/lib/python2.7/unittest/case.py", line 329, in run
    testMethod()
  File "/home/jenkins/.buildout/eggs/diazo-1.2.7-py2.7.egg/diazo/tests/test_diazo.py", line 84, in testAll
    if config.get('diazotest', 'theme'):
  File "/usr/lib/python2.7/ConfigParser.py", line 607, in get
    raise NoSectionError(section)


FAILED:  diazo.tests.test_diazo.Test-update-namespace-3.testAll

Error Message:
No section: 'diazotest'

Stack Trace:
No section: 'diazotest'

  File "/usr/lib/python2.7/unittest/case.py", line 329, in run
    testMethod()
  File "/home/jenkins/.buildout/eggs/diazo-1.2.7-py2.7.egg/diazo/tests/test_diazo.py", line 84, in testAll
    if config.get('diazotest', 'theme'):
  File "/usr/lib/python2.7/ConfigParser.py", line 607, in get
    raise NoSectionError(section)


FAILED:  diazo.tests.test_diazo.Test-v1-after-both-children.testAll

Error Message:
No section: 'diazotest'

Stack Trace:
No section: 'diazotest'

  File "/usr/lib/python2.7/unittest/case.py", line 329, in run
    testMethod()
  File "/home/jenkins/.buildout/eggs/diazo-1.2.7-py2.7.egg/diazo/tests/test_diazo.py", line 84, in testAll
    if config.get('diazotest', 'theme'):
  File "/usr/lib/python2.7/ConfigParser.py", line 607, in get
    raise NoSectionError(section)


FAILED:  diazo.tests.test_diazo.Test-v1-after-content-children.testAll

Error Message:
No section: 'diazotest'

Stack Trace:
No section: 'diazotest'

  File "/usr/lib/python2.7/unittest/case.py", line 329, in run
    testMethod()
  File "/home/jenkins/.buildout/eggs/diazo-1.2.7-py2.7.egg/diazo/tests/test_diazo.py", line 84, in testAll
    if config.get('diazotest', 'theme'):
  File "/usr/lib/python2.7/ConfigParser.py", line 607, in get
    raise NoSectionError(section)


FAILED:  diazo.tests.test_diazo.Test-v1-after-theme-children.testAll

Error Message:
No section: 'diazotest'

Stack Trace:
No section: 'diazotest'

  File "/usr/lib/python2.7/unittest/case.py", line 329, in run
    testMethod()
  File "/home/jenkins/.buildout/eggs/diazo-1.2.7-py2.7.egg/diazo/tests/test_diazo.py", line 84, in testAll
    if config.get('diazotest', 'theme'):
  File "/usr/lib/python2.7/ConfigParser.py", line 607, in get
    raise NoSectionError(section)


FAILED:  diazo.tests.test_diazo.Test-v1-after.testAll

Error Message:
No section: 'diazotest'

Stack Trace:
No section: 'diazotest'

  File "/usr/lib/python2.7/unittest/case.py", line 329, in run
    testMethod()
  File "/home/jenkins/.buildout/eggs/diazo-1.2.7-py2.7.egg/diazo/tests/test_diazo.py", line 84, in testAll
    if config.get('diazotest', 'theme'):
  File "/usr/lib/python2.7/ConfigParser.py", line 607, in get
    raise NoSectionError(section)


FAILED:  diazo.tests.test_diazo.Test-v1-before-both-children.testAll

Error Message:
No section: 'diazotest'

Stack Trace:
No section: 'diazotest'

  File "/usr/lib/python2.7/unittest/case.py", line 329, in run
    testMethod()
  File "/home/jenkins/.buildout/eggs/diazo-1.2.7-py2.7.egg/diazo/tests/test_diazo.py", line 84, in testAll
    if config.get('diazotest', 'theme'):
  File "/usr/lib/python2.7/ConfigParser.py", line 607, in get
    raise NoSectionError(section)


FAILED:  diazo.tests.test_diazo.Test-v1-before-content-children.testAll

Error Message:
No section: 'diazotest'

Stack Trace:
No section: 'diazotest'

  File "/usr/lib/python2.7/unittest/case.py", line 329, in run
    testMethod()
  File "/home/jenkins/.buildout/eggs/diazo-1.2.7-py2.7.egg/diazo/tests/test_diazo.py", line 84, in testAll
    if config.get('diazotest', 'theme'):
  File "/usr/lib/python2.7/ConfigParser.py", line 607, in get
    raise NoSectionError(section)


FAILED:  diazo.tests.test_diazo.Test-v1-before-content-content-children.testAll

Error Message:
No section: 'diazotest'

Stack Trace:
No section: 'diazotest'

  File "/usr/lib/python2.7/unittest/case.py", line 329, in run
    testMethod()
  File "/home/jenkins/.buildout/eggs/diazo-1.2.7-py2.7.egg/diazo/tests/test_diazo.py", line 84, in testAll
    if config.get('diazotest', 'theme'):
  File "/usr/lib/python2.7/ConfigParser.py", line 607, in get
    raise NoSectionError(section)


FAILED:  diazo.tests.test_diazo.Test-v1-before-replace-after-content.testAll

Error Message:
No section: 'diazotest'

Stack Trace:
No section: 'diazotest'

  File "/usr/lib/python2.7/unittest/case.py", line 329, in run
    testMethod()
  File "/home/jenkins/.buildout/eggs/diazo-1.2.7-py2.7.egg/diazo/tests/test_diazo.py", line 84, in testAll
    if config.get('diazotest', 'theme'):
  File "/usr/lib/python2.7/ConfigParser.py", line 607, in get
    raise NoSectionError(section)


FAILED:  diazo.tests.test_diazo.Test-v1-before-theme-children.testAll

Error Message:
No section: 'diazotest'

Stack Trace:
No section: 'diazotest'

  File "/usr/lib/python2.7/unittest/case.py", line 329, in run
    testMethod()
  File "/home/jenkins/.buildout/eggs/diazo-1.2.7-py2.7.egg/diazo/tests/test_diazo.py", line 84, in testAll
    if config.get('diazotest', 'theme'):
  File "/usr/lib/python2.7/ConfigParser.py", line 607, in get
    raise NoSectionError(section)


FAILED:  diazo.tests.test_diazo.Test-v1-before.testAll

Error Message:
No section: 'diazotest'

Stack Trace:
No section: 'diazotest'

  File "/usr/lib/python2.7/unittest/case.py", line 329, in run
    testMethod()
  File "/home/jenkins/.buildout/eggs/diazo-1.2.7-py2.7.egg/diazo/tests/test_diazo.py", line 84, in testAll
    if config.get('diazotest', 'theme'):
  File "/usr/lib/python2.7/ConfigParser.py", line 607, in get
    raise NoSectionError(section)


FAILED:  diazo.tests.test_diazo.Test-v1-copy-all-attributes-conditional-1.testAll

Error Message:
No section: 'diazotest'

Stack Trace:
No section: 'diazotest'

  File "/usr/lib/python2.7/unittest/case.py", line 329, in run
    testMethod()
  File "/home/jenkins/.buildout/eggs/diazo-1.2.7-py2.7.egg/diazo/tests/test_diazo.py", line 84, in testAll
    if config.get('diazotest', 'theme'):
  File "/usr/lib/python2.7/ConfigParser.py", line 607, in get
    raise NoSectionError(section)


FAILED:  diazo.tests.test_diazo.Test-v1-copy-all-attributes-conditional-2.testAll

Error Message:
No section: 'diazotest'

Stack Trace:
No section: 'diazotest'

  File "/usr/lib/python2.7/unittest/case.py", line 329, in run
    testMethod()
  File "/home/jenkins/.buildout/eggs/diazo-1.2.7-py2.7.egg/diazo/tests/test_diazo.py", line 84, in testAll
    if config.get('diazotest', 'theme'):
  File "/usr/lib/python2.7/ConfigParser.py", line 607, in get
    raise NoSectionError(section)


FAILED:  diazo.tests.test_diazo.Test-v1-copy-all-attributes-conditional-3.testAll

Error Message:
No section: 'diazotest'

Stack Trace:
No section: 'diazotest'

  File "/usr/lib/python2.7/unittest/case.py", line 329, in run
    testMethod()
  File "/home/jenkins/.buildout/eggs/diazo-1.2.7-py2.7.egg/diazo/tests/test_diazo.py", line 84, in testAll
    if config.get('diazotest', 'theme'):
  File "/usr/lib/python2.7/ConfigParser.py", line 607, in get
    raise NoSectionError(section)


FAILED:  diazo.tests.test_diazo.Test-v1-copy-all-attributes-href.testAll

Error Message:
No section: 'diazotest'

Stack Trace:
No section: 'diazotest'

  File "/usr/lib/python2.7/unittest/case.py", line 329, in run
    testMethod()
  File "/home/jenkins/.buildout/eggs/diazo-1.2.7-py2.7.egg/diazo/tests/test_diazo.py", line 84, in testAll
    if config.get('diazotest', 'theme'):
  File "/usr/lib/python2.7/ConfigParser.py", line 607, in get
    raise NoSectionError(section)


FAILED:  diazo.tests.test_diazo.Test-v1-copy-all-attributes-multiple-rules-conditional-1.testAll

Error Message:
No section: 'diazotest'

Stack Trace:
No section: 'diazotest'

  File "/usr/lib/python2.7/unittest/case.py", line 329, in run
    testMethod()
  File "/home/jenkins/.buildout/eggs/diazo-1.2.7-py2.7.egg/diazo/tests/test_diazo.py", line 84, in testAll
    if config.get('diazotest', 'theme'):
  File "/usr/lib/python2.7/ConfigParser.py", line 607, in get
    raise NoSectionError(section)


FAILED:  diazo.tests.test_diazo.Test-v1-copy-all-attributes-multiple-rules-unconditional.testAll

Error Message:
No section: 'diazotest'

Stack Trace:
No section: 'diazotest'

  File "/usr/lib/python2.7/unittest/case.py", line 329, in run
    testMethod()
  File "/home/jenkins/.buildout/eggs/diazo-1.2.7-py2.7.egg/diazo/tests/test_diazo.py", line 84, in testAll
    if config.get('diazotest', 'theme'):
  File "/usr/lib/python2.7/ConfigParser.py", line 607, in get
    raise NoSectionError(section)


FAILED:  diazo.tests.test_diazo.Test-v1-copy-all-attributes.testAll

Error Message:
No section: 'diazotest'

Stack Trace:
No section: 'diazotest'

  File "/usr/lib/python2.7/unittest/case.py", line 329, in run
    testMethod()
  File "/home/jenkins/.buildout/eggs/diazo-1.2.7-py2.7.egg/diazo/tests/test_diazo.py", line 84, in testAll
    if config.get('diazotest', 'theme'):
  File "/usr/lib/python2.7/ConfigParser.py", line 607, in get
    raise NoSectionError(section)


FAILED:  diazo.tests.test_diazo.Test-v1-copy-attribute-exists.testAll

Error Message:
No section: 'diazotest'

Stack Trace:
No section: 'diazotest'

  File "/usr/lib/python2.7/unittest/case.py", line 329, in run
    testMethod()
  File "/home/jenkins/.buildout/eggs/diazo-1.2.7-py2.7.egg/diazo/tests/test_diazo.py", line 84, in testAll
    if config.get('diazotest', 'theme'):
  File "/usr/lib/python2.7/ConfigParser.py", line 607, in get
    raise NoSectionError(section)


FAILED:  diazo.tests.test_diazo.Test-v1-copy-attribute-not-exists.testAll

Error Message:
No section: 'diazotest'

Stack Trace:
No section: 'diazotest'

  File "/usr/lib/python2.7/unittest/case.py", line 329, in run
    testMethod()
  File "/home/jenkins/.buildout/eggs/diazo-1.2.7-py2.7.egg/diazo/tests/test_diazo.py", line 84, in testAll
    if config.get('diazotest', 'theme'):
  File "/usr/lib/python2.7/ConfigParser.py", line 607, in get
    raise NoSectionError(section)


FAILED:  diazo.tests.test_diazo.Test-v1-copy-multi-attribute.testAll

Error Message:
No section: 'diazotest'

Stack Trace:
No section: 'diazotest'

  File "/usr/lib/python2.7/unittest/case.py", line 329, in run
    testMethod()
  File "/home/jenkins/.buildout/eggs/diazo-1.2.7-py2.7.egg/diazo/tests/test_diazo.py", line 84, in testAll
    if config.get('diazotest', 'theme'):
  File "/usr/lib/python2.7/ConfigParser.py", line 607, in get
    raise NoSectionError(section)


FAILED:  diazo.tests.test_diazo.Test-v1-drop-all-attributes-content.testAll

Error Message:
No section: 'diazotest'

Stack Trace:
No section: 'diazotest'

  File "/usr/lib/python2.7/unittest/case.py", line 329, in run
    testMethod()
  File "/home/jenkins/.buildout/eggs/diazo-1.2.7-py2.7.egg/diazo/tests/test_diazo.py", line 84, in testAll
    if config.get('diazotest', 'theme'):
  File "/usr/lib/python2.7/ConfigParser.py", line 607, in get
    raise NoSectionError(section)


FAILED:  diazo.tests.test_diazo.Test-v1-drop-all-attributes-theme-conditional-1.testAll

Error Message:
No section: 'diazotest'

Stack Trace:
No section: 'diazotest'

  File "/usr/lib/python2.7/unittest/case.py", line 329, in run
    testMethod()
  File "/home/jenkins/.buildout/eggs/diazo-1.2.7-py2.7.egg/diazo/tests/test_diazo.py", line 84, in testAll
    if config.get('diazotest', 'theme'):
  File "/usr/lib/python2.7/ConfigParser.py", line 607, in get
    raise NoSectionError(section)


FAILED:  diazo.tests.test_diazo.Test-v1-drop-all-attributes-theme-conditional-2.testAll

Error Message:
No section: 'diazotest'

Stack Trace:
No section: 'diazotest'

  File "/usr/lib/python2.7/unittest/case.py", line 329, in run
    testMethod()
  File "/home/jenkins/.buildout/eggs/diazo-1.2.7-py2.7.egg/diazo/tests/test_diazo.py", line 84, in testAll
    if config.get('diazotest', 'theme'):
  File "/usr/lib/python2.7/ConfigParser.py", line 607, in get
    raise NoSectionError(section)


FAILED:  diazo.tests.test_diazo.Test-v1-drop-all-attributes-theme-conditional-3.testAll

Error Message:
No section: 'diazotest'

Stack Trace:
No section: 'diazotest'

  File "/usr/lib/python2.7/unittest/case.py", line 329, in run
    testMethod()
  File "/home/jenkins/.buildout/eggs/diazo-1.2.7-py2.7.egg/diazo/tests/test_diazo.py", line 84, in testAll
    if config.get('diazotest', 'theme'):
  File "/usr/lib/python2.7/ConfigParser.py", line 607, in get
    raise NoSectionError(section)


FAILED:  diazo.tests.test_diazo.Test-v1-drop-all-attributes-theme-conditional-4.testAll

Error Message:
No section: 'diazotest'

Stack Trace:
No section: 'diazotest'

  File "/usr/lib/python2.7/unittest/case.py", line 329, in run
    testMethod()
  File "/home/jenkins/.buildout/eggs/diazo-1.2.7-py2.7.egg/diazo/tests/test_diazo.py", line 84, in testAll
    if config.get('diazotest', 'theme'):
  File "/usr/lib/python2.7/ConfigParser.py", line 607, in get
    raise NoSectionError(section)


FAILED:  diazo.tests.test_diazo.Test-v1-drop-all-attributes-theme-conditional-5.testAll

Error Message:
No section: 'diazotest'

Stack Trace:
No section: 'diazotest'

  File "/usr/lib/python2.7/unittest/case.py", line 329, in run
    testMethod()
  File "/home/jenkins/.buildout/eggs/diazo-1.2.7-py2.7.egg/diazo/tests/test_diazo.py", line 84, in testAll
    if config.get('diazotest', 'theme'):
  File "/usr/lib/python2.7/ConfigParser.py", line 607, in get
    raise NoSectionError(section)


FAILED:  diazo.tests.test_diazo.Test-v1-drop-all-attributes-theme.testAll

Error Message:
No section: 'diazotest'

Stack Trace:
No section: 'diazotest'

  File "/usr/lib/python2.7/unittest/case.py", line 329, in run
    testMethod()
  File "/home/jenkins/.buildout/eggs/diazo-1.2.7-py2.7.egg/diazo/tests/test_diazo.py", line 84, in testAll
    if config.get('diazotest', 'theme'):
  File "/usr/lib/python2.7/ConfigParser.py", line 607, in get
    raise NoSectionError(section)


FAILED:  diazo.tests.test_diazo.Test-v1-drop-and-replace-messages.testAll

Error Message:
No section: 'diazotest'

Stack Trace:
No section: 'diazotest'

  File "/usr/lib/python2.7/unittest/case.py", line 329, in run
    testMethod()
  File "/home/jenkins/.buildout/eggs/diazo-1.2.7-py2.7.egg/diazo/tests/test_diazo.py", line 84, in testAll
    if config.get('diazotest', 'theme'):
  File "/usr/lib/python2.7/ConfigParser.py", line 607, in get
    raise NoSectionError(section)


FAILED:  diazo.tests.test_diazo.Test-v1-drop-and-replace-portlets.testAll

Error Message:
No section: 'diazotest'

Stack Trace:
No section: 'diazotest'

  File "/usr/lib/python2.7/unittest/case.py", line 329, in run
    testMethod()
  File "/home/jenkins/.buildout/eggs/diazo-1.2.7-py2.7.egg/diazo/tests/test_diazo.py", line 84, in testAll
    if config.get('diazotest', 'theme'):
  File "/usr/lib/python2.7/ConfigParser.py", line 607, in get
    raise NoSectionError(section)


FAILED:  diazo.tests.test_diazo.Test-v1-drop-attribute-content.testAll

Error Message:
No section: 'diazotest'

Stack Trace:
No section: 'diazotest'

  File "/usr/lib/python2.7/unittest/case.py", line 329, in run
    testMethod()
  File "/home/jenkins/.buildout/eggs/diazo-1.2.7-py2.7.egg/diazo/tests/test_diazo.py", line 84, in testAll
    if config.get('diazotest', 'theme'):
  File "/usr/lib/python2.7/ConfigParser.py", line 607, in get
    raise NoSectionError(section)


FAILED:  diazo.tests.test_diazo.Test-v1-drop-attribute-theme-conditional-1.testAll

Error Message:
No section: 'diazotest'

Stack Trace:
No section: 'diazotest'

  File "/usr/lib/python2.7/unittest/case.py", line 329, in run
    testMethod()
  File "/home/jenkins/.buildout/eggs/diazo-1.2.7-py2.7.egg/diazo/tests/test_diazo.py", line 84, in testAll
    if config.get('diazotest', 'theme'):
  File "/usr/lib/python2.7/ConfigParser.py", line 607, in get
    raise NoSectionError(section)


FAILED:  diazo.tests.test_diazo.Test-v1-drop-attribute-theme-conditional-2.testAll

Error Message:
No section: 'diazotest'

Stack Trace:
No section: 'diazotest'

  File "/usr/lib/python2.7/unittest/case.py", line 329, in run
    testMethod()
  File "/home/jenkins/.buildout/eggs/diazo-1.2.7-py2.7.egg/diazo/tests/test_diazo.py", line 84, in testAll
    if config.get('diazotest', 'theme'):
  File "/usr/lib/python2.7/ConfigParser.py", line 607, in get
    raise NoSectionError(section)


FAILED:  diazo.tests.test_diazo.Test-v1-drop-attribute-theme.testAll

Error Message:
No section: 'diazotest'

Stack Trace:
No section: 'diazotest'

  File "/usr/lib/python2.7/unittest/case.py", line 329, in run
    testMethod()
  File "/home/jenkins/.buildout/eggs/diazo-1.2.7-py2.7.egg/diazo/tests/test_diazo.py", line 84, in testAll
    if config.get('diazotest', 'theme'):
  File "/usr/lib/python2.7/ConfigParser.py", line 607, in get
    raise NoSectionError(section)


FAILED:  diazo.tests.test_diazo.Test-v1-drop-multi-attributes-content.testAll

Error Message:
No section: 'diazotest'

Stack Trace:
No section: 'diazotest'

  File "/usr/lib/python2.7/unittest/case.py", line 329, in run
    testMethod()
  File "/home/jenkins/.buildout/eggs/diazo-1.2.7-py2.7.egg/diazo/tests/test_diazo.py", line 84, in testAll
    if config.get('diazotest', 'theme'):
  File "/usr/lib/python2.7/ConfigParser.py", line 607, in get
    raise NoSectionError(section)


FAILED:  diazo.tests.test_diazo.Test-v1-drop-multi-attributes-theme.testAll

Error Message:
No section: 'diazotest'

Stack Trace:
No section: 'diazotest'

  File "/usr/lib/python2.7/unittest/case.py", line 329, in run
    testMethod()
  File "/home/jenkins/.buildout/eggs/diazo-1.2.7-py2.7.egg/diazo/tests/test_diazo.py", line 84, in testAll
    if config.get('diazotest', 'theme'):
  File "/usr/lib/python2.7/ConfigParser.py", line 607, in get
    raise NoSectionError(section)


FAILED:  diazo.tests.test_diazo.Test-v1-if-content.testAll

Error Message:
No section: 'diazotest'

Stack Trace:
No section: 'diazotest'

  File "/usr/lib/python2.7/unittest/case.py", line 329, in run
    testMethod()
  File "/home/jenkins/.buildout/eggs/diazo-1.2.7-py2.7.egg/diazo/tests/test_diazo.py", line 84, in testAll
    if config.get('diazotest', 'theme'):
  File "/usr/lib/python2.7/ConfigParser.py", line 607, in get
    raise NoSectionError(section)


FAILED:  diazo.tests.test_diazo.Test-v1-if-custom-param.testAll

Error Message:
No section: 'diazotest'

Stack Trace:
No section: 'diazotest'

  File "/usr/lib/python2.7/unittest/case.py", line 329, in run
    testMethod()
  File "/home/jenkins/.buildout/eggs/diazo-1.2.7-py2.7.egg/diazo/tests/test_diazo.py", line 84, in testAll
    if config.get('diazotest', 'theme'):
  File "/usr/lib/python2.7/ConfigParser.py", line 607, in get
    raise NoSectionError(section)


FAILED:  diazo.tests.test_diazo.Test-v1-if-merge.testAll

Error Message:
No section: 'diazotest'

Stack Trace:
No section: 'diazotest'

  File "/usr/lib/python2.7/unittest/case.py", line 329, in run
    testMethod()
  File "/home/jenkins/.buildout/eggs/diazo-1.2.7-py2.7.egg/diazo/tests/test_diazo.py", line 84, in testAll
    if config.get('diazotest', 'theme'):
  File "/usr/lib/python2.7/ConfigParser.py", line 607, in get
    raise NoSectionError(section)


FAILED:  diazo.tests.test_diazo.Test-v1-if-not-content.testAll

Error Message:
No section: 'diazotest'

Stack Trace:
No section: 'diazotest'

  File "/usr/lib/python2.7/unittest/case.py", line 329, in run
    testMethod()
  File "/home/jenkins/.buildout/eggs/diazo-1.2.7-py2.7.egg/diazo/tests/test_diazo.py", line 84, in testAll
    if config.get('diazotest', 'theme'):
  File "/usr/lib/python2.7/ConfigParser.py", line 607, in get
    raise NoSectionError(section)


FAILED:  diazo.tests.test_diazo.Test-v1-if-not-path.testAll

Error Message:
No section: 'diazotest'

Stack Trace:
No section: 'diazotest'

  File "/usr/lib/python2.7/unittest/case.py", line 329, in run
    testMethod()
  File "/home/jenkins/.buildout/eggs/diazo-1.2.7-py2.7.egg/diazo/tests/test_diazo.py", line 84, in testAll
    if config.get('diazotest', 'theme'):
  File "/usr/lib/python2.7/ConfigParser.py", line 607, in get
    raise NoSectionError(section)


FAILED:  diazo.tests.test_diazo.Test-v1-if-not.testAll

Error Message:
No section: 'diazotest'

Stack Trace:
No section: 'diazotest'

  File "/usr/lib/python2.7/unittest/case.py", line 329, in run
    testMethod()
  File "/home/jenkins/.buildout/eggs/diazo-1.2.7-py2.7.egg/diazo/tests/test_diazo.py", line 84, in testAll
    if config.get('diazotest', 'theme'):
  File "/usr/lib/python2.7/ConfigParser.py", line 607, in get
    raise NoSectionError(section)


FAILED:  diazo.tests.test_diazo.Test-v1-if-path.testAll

Error Message:
No section: 'diazotest'

Stack Trace:
No section: 'diazotest'

  File "/usr/lib/python2.7/unittest/case.py", line 329, in run
    testMethod()
  File "/home/jenkins/.buildout/eggs/diazo-1.2.7-py2.7.egg/diazo/tests/test_diazo.py", line 84, in testAll
    if config.get('diazotest', 'theme'):
  File "/usr/lib/python2.7/ConfigParser.py", line 607, in get
    raise NoSectionError(section)


FAILED:  diazo.tests.test_diazo.Test-v1-if.testAll

Error Message:
No section: 'diazotest'

Stack Trace:
No section: 'diazotest'

  File "/usr/lib/python2.7/unittest/case.py", line 329, in run
    testMethod()
  File "/home/jenkins/.buildout/eggs/diazo-1.2.7-py2.7.egg/diazo/tests/test_diazo.py", line 84, in testAll
    if config.get('diazotest', 'theme'):
  File "/usr/lib/python2.7/ConfigParser.py", line 607, in get
    raise NoSectionError(section)


FAILED:  diazo.tests.test_diazo.Test-v1-merge-multiple-if-true.testAll

Error Message:
No section: 'diazotest'

Stack Trace:
No section: 'diazotest'

  File "/usr/lib/python2.7/unittest/case.py", line 329, in run
    testMethod()
  File "/home/jenkins/.buildout/eggs/diazo-1.2.7-py2.7.egg/diazo/tests/test_diazo.py", line 84, in testAll
    if config.get('diazotest', 'theme'):
  File "/usr/lib/python2.7/ConfigParser.py", line 607, in get
    raise NoSectionError(section)


FAILED:  diazo.tests.test_diazo.Test-v1-merge-multiple.testAll

Error Message:
No section: 'diazotest'

Stack Trace:
No section: 'diazotest'

  File "/usr/lib/python2.7/unittest/case.py", line 329, in run
    testMethod()
  File "/home/jenkins/.buildout/eggs/diazo-1.2.7-py2.7.egg/diazo/tests/test_diazo.py", line 84, in testAll
    if config.get('diazotest', 'theme'):
  File "/usr/lib/python2.7/ConfigParser.py", line 607, in get
    raise NoSectionError(section)


FAILED:  diazo.tests.test_diazo.Test-v1-merge-separator.testAll

Error Message:
No section: 'diazotest'

Stack Trace:
No section: 'diazotest'

  File "/usr/lib/python2.7/unittest/case.py", line 329, in run
    testMethod()
  File "/home/jenkins/.buildout/eggs/diazo-1.2.7-py2.7.egg/diazo/tests/test_diazo.py", line 84, in testAll
    if config.get('diazotest', 'theme'):
  File "/usr/lib/python2.7/ConfigParser.py", line 607, in get
    raise NoSectionError(section)


FAILED:  diazo.tests.test_diazo.Test-v1-merge.testAll

Error Message:
No section: 'diazotest'

Stack Trace:
No section: 'diazotest'

  File "/usr/lib/python2.7/unittest/case.py", line 329, in run
    testMethod()
  File "/home/jenkins/.buildout/eggs/diazo-1.2.7-py2.7.egg/diazo/tests/test_diazo.py", line 84, in testAll
    if config.get('diazotest', 'theme'):
  File "/usr/lib/python2.7/ConfigParser.py", line 607, in get
    raise NoSectionError(section)


FAILED:  diazo.tests.test_diazo.Test-v1-notheme-if-content.testAll

Error Message:
No section: 'diazotest'

Stack Trace:
No section: 'diazotest'

  File "/usr/lib/python2.7/unittest/case.py", line 329, in run
    testMethod()
  File "/home/jenkins/.buildout/eggs/diazo-1.2.7-py2.7.egg/diazo/tests/test_diazo.py", line 84, in testAll
    if config.get('diazotest', 'theme'):
  File "/usr/lib/python2.7/ConfigParser.py", line 607, in get
    raise NoSectionError(section)


FAILED:  diazo.tests.test_diazo.Test-v1-notheme-if-merge.testAll

Error Message:
No section: 'diazotest'

Stack Trace:
No section: 'diazotest'

  File "/usr/lib/python2.7/unittest/case.py", line 329, in run
    testMethod()
  File "/home/jenkins/.buildout/eggs/diazo-1.2.7-py2.7.egg/diazo/tests/test_diazo.py", line 84, in testAll
    if config.get('diazotest', 'theme'):
  File "/usr/lib/python2.7/ConfigParser.py", line 607, in get
    raise NoSectionError(section)


FAILED:  diazo.tests.test_diazo.Test-v1-notheme-if-path.testAll

Error Message:
No section: 'diazotest'

Stack Trace:
No section: 'diazotest'

  File "/usr/lib/python2.7/unittest/case.py", line 329, in run
    testMethod()
  File "/home/jenkins/.buildout/eggs/diazo-1.2.7-py2.7.egg/diazo/tests/test_diazo.py", line 84, in testAll
    if config.get('diazotest', 'theme'):
  File "/usr/lib/python2.7/ConfigParser.py", line 607, in get
    raise NoSectionError(section)


FAILED:  diazo.tests.test_diazo.Test-v1-notheme-if.testAll

Error Message:
No section: 'diazotest'

Stack Trace:
No section: 'diazotest'

  File "/usr/lib/python2.7/unittest/case.py", line 329, in run
    testMethod()
  File "/home/jenkins/.buildout/eggs/diazo-1.2.7-py2.7.egg/diazo/tests/test_diazo.py", line 84, in testAll
    if config.get('diazotest', 'theme'):
  File "/usr/lib/python2.7/ConfigParser.py", line 607, in get
    raise NoSectionError(section)


FAILED:  diazo.tests.test_diazo.Test-v1-notheme-nomatch.testAll

Error Message:
No section: 'diazotest'

Stack Trace:
No section: 'diazotest'

  File "/usr/lib/python2.7/unittest/case.py", line 329, in run
    testMethod()
  File "/home/jenkins/.buildout/eggs/diazo-1.2.7-py2.7.egg/diazo/tests/test_diazo.py", line 84, in testAll
    if config.get('diazotest', 'theme'):
  File "/usr/lib/python2.7/ConfigParser.py", line 607, in get
    raise NoSectionError(section)


FAILED:  diazo.tests.test_diazo.Test-v1-notheme-theme-precedence.testAll

Error Message:
No section: 'diazotest'

Stack Trace:
No section: 'diazotest'

  File "/usr/lib/python2.7/unittest/case.py", line 329, in run
    testMethod()
  File "/home/jenkins/.buildout/eggs/diazo-1.2.7-py2.7.egg/diazo/tests/test_diazo.py", line 84, in testAll
    if config.get('diazotest', 'theme'):
  File "/usr/lib/python2.7/ConfigParser.py", line 607, in get
    raise NoSectionError(section)


FAILED:  diazo.tests.test_diazo.Test-v1-replace-both-children.testAll

Error Message:
No section: 'diazotest'

Stack Trace:
No section: 'diazotest'

  File "/usr/lib/python2.7/unittest/case.py", line 329, in run
    testMethod()
  File "/home/jenkins/.buildout/eggs/diazo-1.2.7-py2.7.egg/diazo/tests/test_diazo.py", line 84, in testAll
    if config.get('diazotest', 'theme'):
  File "/usr/lib/python2.7/ConfigParser.py", line 607, in get
    raise NoSectionError(section)


FAILED:  diazo.tests.test_diazo.Test-v1-replace-content-children.testAll

Error Message:
No section: 'diazotest'

Stack Trace:
No section: 'diazotest'

  File "/usr/lib/python2.7/unittest/case.py", line 329, in run
    testMethod()
  File "/home/jenkins/.buildout/eggs/diazo-1.2.7-py2.7.egg/diazo/tests/test_diazo.py", line 84, in testAll
    if config.get('diazotest', 'theme'):
  File "/usr/lib/python2.7/ConfigParser.py", line 607, in get
    raise NoSectionError(section)


FAILED:  diazo.tests.test_diazo.Test-v1-replace-content-conditional-1.testAll

Error Message:
No section: 'diazotest'

Stack Trace:
No section: 'diazotest'

  File "/usr/lib/python2.7/unittest/case.py", line 329, in run
    testMethod()
  File "/home/jenkins/.buildout/eggs/diazo-1.2.7-py2.7.egg/diazo/tests/test_diazo.py", line 84, in testAll
    if config.get('diazotest', 'theme'):
  File "/usr/lib/python2.7/ConfigParser.py", line 607, in get
    raise NoSectionError(section)


FAILED:  diazo.tests.test_diazo.Test-v1-replace-content-conditional-2.testAll

Error Message:
No section: 'diazotest'

Stack Trace:
No section: 'diazotest'

  File "/usr/lib/python2.7/unittest/case.py", line 329, in run
    testMethod()
  File "/home/jenkins/.buildout/eggs/diazo-1.2.7-py2.7.egg/diazo/tests/test_diazo.py", line 84, in testAll
    if config.get('diazotest', 'theme'):
  File "/usr/lib/python2.7/ConfigParser.py", line 607, in get
    raise NoSectionError(section)


FAILED:  diazo.tests.test_diazo.Test-v1-replace-content-content-children-conditional-1.testAll

Error Message:
No section: 'diazotest'

Stack Trace:
No section: 'diazotest'

  File "/usr/lib/python2.7/unittest/case.py", line 329, in run
    testMethod()
  File "/home/jenkins/.buildout/eggs/diazo-1.2.7-py2.7.egg/diazo/tests/test_diazo.py", line 84, in testAll
    if config.get('diazotest', 'theme'):
  File "/usr/lib/python2.7/ConfigParser.py", line 607, in get
    raise NoSectionError(section)


FAILED:  diazo.tests.test_diazo.Test-v1-replace-content-content-children-conditional-2.testAll

Error Message:
No section: 'diazotest'

Stack Trace:
No section: 'diazotest'

  File "/usr/lib/python2.7/unittest/case.py", line 329, in run
    testMethod()
  File "/home/jenkins/.buildout/eggs/diazo-1.2.7-py2.7.egg/diazo/tests/test_diazo.py", line 84, in testAll
    if config.get('diazotest', 'theme'):
  File "/usr/lib/python2.7/ConfigParser.py", line 607, in get
    raise NoSectionError(section)


FAILED:  diazo.tests.test_diazo.Test-v1-replace-content-content-children.testAll

Error Message:
No section: 'diazotest'

Stack Trace:
No section: 'diazotest'

  File "/usr/lib/python2.7/unittest/case.py", line 329, in run
    testMethod()
  File "/home/jenkins/.buildout/eggs/diazo-1.2.7-py2.7.egg/diazo/tests/test_diazo.py", line 84, in testAll
    if config.get('diazotest', 'theme'):
  File "/usr/lib/python2.7/ConfigParser.py", line 607, in get
    raise NoSectionError(section)


FAILED:  diazo.tests.test_diazo.Test-v1-replace-content.testAll

Error Message:
No section: 'diazotest'

Stack Trace:
No section: 'diazotest'

  File "/usr/lib/python2.7/unittest/case.py", line 329, in run
    testMethod()
  File "/home/jenkins/.buildout/eggs/diazo-1.2.7-py2.7.egg/diazo/tests/test_diazo.py", line 84, in testAll
    if config.get('diazotest', 'theme'):
  File "/usr/lib/python2.7/ConfigParser.py", line 607, in get
    raise NoSectionError(section)


FAILED:  diazo.tests.test_diazo.Test-v1-replace-theme-children.testAll

Error Message:
No section: 'diazotest'

Stack Trace:
No section: 'diazotest'

  File "/usr/lib/python2.7/unittest/case.py", line 329, in run
    testMethod()
  File "/home/jenkins/.buildout/eggs/diazo-1.2.7-py2.7.egg/diazo/tests/test_diazo.py", line 84, in testAll
    if config.get('diazotest', 'theme'):
  File "/usr/lib/python2.7/ConfigParser.py", line 607, in get
    raise NoSectionError(section)


FAILED:  diazo.tests.test_diazo.Test-v1-replace.testAll

Error Message:
No section: 'diazotest'

Stack Trace:
No section: 'diazotest'

  File "/usr/lib/python2.7/unittest/case.py", line 329, in run
    testMethod()
  File "/home/jenkins/.buildout/eggs/diazo-1.2.7-py2.7.egg/diazo/tests/test_diazo.py", line 84, in testAll
    if config.get('diazotest', 'theme'):
  File "/usr/lib/python2.7/ConfigParser.py", line 607, in get
    raise NoSectionError(section)


FAILED:  diazo.tests.test_diazo.Test-v1-strip-content.testAll

Error Message:
No section: 'diazotest'

Stack Trace:
No section: 'diazotest'

  File "/usr/lib/python2.7/unittest/case.py", line 329, in run
    testMethod()
  File "/home/jenkins/.buildout/eggs/diazo-1.2.7-py2.7.egg/diazo/tests/test_diazo.py", line 84, in testAll
    if config.get('diazotest', 'theme'):
  File "/usr/lib/python2.7/ConfigParser.py", line 607, in get
    raise NoSectionError(section)


FAILED:  diazo.tests.test_diazo.Test-v1-strip-if-content.testAll

Error Message:
No section: 'diazotest'

Stack Trace:
No section: 'diazotest'

  File "/usr/lib/python2.7/unittest/case.py", line 329, in run
    testMethod()
  File "/home/jenkins/.buildout/eggs/diazo-1.2.7-py2.7.egg/diazo/tests/test_diazo.py", line 84, in testAll
    if config.get('diazotest', 'theme'):
  File "/usr/lib/python2.7/ConfigParser.py", line 607, in get
    raise NoSectionError(section)


FAILED:  diazo.tests.test_diazo.Test-v1-strip-if-theme.testAll

Error Message:
No section: 'diazotest'

Stack Trace:
No section: 'diazotest'

  File "/usr/lib/python2.7/unittest/case.py", line 329, in run
    testMethod()
  File "/home/jenkins/.buildout/eggs/diazo-1.2.7-py2.7.egg/diazo/tests/test_diazo.py", line 84, in testAll
    if config.get('diazotest', 'theme'):
  File "/usr/lib/python2.7/ConfigParser.py", line 607, in get
    raise NoSectionError(section)


FAILED:  diazo.tests.test_diazo.Test-v1-strip-theme.testAll

Error Message:
No section: 'diazotest'

Stack Trace:
No section: 'diazotest'

  File "/usr/lib/python2.7/unittest/case.py", line 329, in run
    testMethod()
  File "/home/jenkins/.buildout/eggs/diazo-1.2.7-py2.7.egg/diazo/tests/test_diazo.py", line 84, in testAll
    if config.get('diazotest', 'theme'):
  File "/usr/lib/python2.7/ConfigParser.py", line 607, in get
    raise NoSectionError(section)


FAILED:  diazo.tests.test_diazo.Test-without-theme.testAll

Error Message:
No section: 'diazotest'

Stack Trace:
No section: 'diazotest'

  File "/usr/lib/python2.7/unittest/case.py", line 329, in run
    testMethod()
  File "/home/jenkins/.buildout/eggs/diazo-1.2.7-py2.7.egg/diazo/tests/test_diazo.py", line 84, in testAll
    if config.get('diazotest', 'theme'):
  File "/usr/lib/python2.7/ConfigParser.py", line 607, in get
    raise NoSectionError(section)


FAILED:  diazo.tests.test_diazo.Test-xinclude.testAll

Error Message:
No section: 'diazotest'

Stack Trace:
No section: 'diazotest'

  File "/usr/lib/python2.7/unittest/case.py", line 329, in run
    testMethod()
  File "/home/jenkins/.buildout/eggs/diazo-1.2.7-py2.7.egg/diazo/tests/test_diazo.py", line 84, in testAll
    if config.get('diazotest', 'theme'):
  File "/usr/lib/python2.7/ConfigParser.py", line 607, in get
    raise NoSectionError(section)


More information about the Testbot mailing list