[Testbot] Plone 5.0 - Python 2.7 - Build # 255 - Failure!

jenkins at plone.org jenkins at plone.org
Thu Aug 10 11:35:37 UTC 2017


Plone 5.0 - Python 2.7 - Build # 255 - Failure:

Check console output at http://jenkins.plone.org/job/plone-5.0-python-2.7/255/ to view the results.

Changes:

[peter.holzer] [fc] Add plone.app.multilingual to checkouts.cfg

[agitator] [fc] Repository: plone.app.multilingual







Test Results:

7 tests failed.
FAILED:  plone.app.multilingual.tests.test_selector.TestLanguageSelectorBasics.test_languages_partially_translated_by_closest

Error Message:
list index out of range

Stack Trace:
list index out of range

  File "/usr/lib/python2.7/unittest/case.py", line 329, in run
    testMethod()
  File "/home/jenkins/workspace/plone-5.0-python-2.7/src/plone.app.multilingual/src/plone/app/multilingual/tests/test_selector.py", line 285, in test_languages_partially_translated_by_closest
    self.browser.open(selector_languages[1]['url'])


FAILED:  plone.app.multilingual.tests.test_selector.TestLanguageSelectorBasics.test_languages_partially_translated_by_dialog

Error Message:
list index out of range

Stack Trace:
list index out of range

  File "/usr/lib/python2.7/unittest/case.py", line 329, in run
    testMethod()
  File "/home/jenkins/workspace/plone-5.0-python-2.7/src/plone.app.multilingual/src/plone/app/multilingual/tests/test_selector.py", line 325, in test_languages_partially_translated_by_dialog
    tgid = selector_languages[1]['url'].split('/')[-2]


FAILED:  plone.app.multilingual.tests.test_selector.TestLanguageSelectorBasics.test_languages_preserve_by_closest

Error Message:
list index out of range

Stack Trace:
list index out of range

  File "/usr/lib/python2.7/unittest/case.py", line 329, in run
    testMethod()
  File "/home/jenkins/workspace/plone-5.0-python-2.7/src/plone.app.multilingual/src/plone/app/multilingual/tests/test_selector.py", line 686, in test_languages_preserve_by_closest
    self.assertLanguagesPreserveQuery('closest')
  File "/home/jenkins/workspace/plone-5.0-python-2.7/src/plone.app.multilingual/src/plone/app/multilingual/tests/test_selector.py", line 632, in assertLanguagesPreserveQuery
    tgid = selector_languages[2]['url'].split('/')[-3]


FAILED:  plone.app.multilingual.tests.test_selector.TestLanguageSelectorBasics.test_languages_preserve_by_dialog

Error Message:
list index out of range

Stack Trace:
list index out of range

  File "/usr/lib/python2.7/unittest/case.py", line 329, in run
    testMethod()
  File "/home/jenkins/workspace/plone-5.0-python-2.7/src/plone.app.multilingual/src/plone/app/multilingual/tests/test_selector.py", line 694, in test_languages_preserve_by_dialog
    self.assertLanguagesPreserveQuery('dialog')
  File "/home/jenkins/workspace/plone-5.0-python-2.7/src/plone.app.multilingual/src/plone/app/multilingual/tests/test_selector.py", line 632, in assertLanguagesPreserveQuery
    tgid = selector_languages[2]['url'].split('/')[-3]


FAILED:  plone.app.multilingual.tests.test_selector.TestLanguageSelectorBasics.test_languages_preserve_view

Error Message:
list index out of range

Stack Trace:
list index out of range

  File "/usr/lib/python2.7/unittest/case.py", line 329, in run
    testMethod()
  File "/home/jenkins/workspace/plone-5.0-python-2.7/src/plone.app.multilingual/src/plone/app/multilingual/tests/test_selector.py", line 557, in test_languages_preserve_view
    self.browser.open(selector_languages[2]['url'])


FAILED:  plone.app.multilingual.tests.test_selector.TestLanguageSelectorBasics.test_siteroot_by_closest

Error Message:
u'http://nohost/plone/?set_language=en' != 'http://nohost/plone/@@multilingual-selector/notg/en?set_language=en'

Stack Trace:
u'http://nohost/plone/?set_language=en' != 'http://nohost/plone/@@multilingual-selector/notg/en?set_language=en'

  File "/usr/lib/python2.7/unittest/case.py", line 329, in run
    testMethod()
  File "/home/jenkins/workspace/plone-5.0-python-2.7/src/plone.app.multilingual/src/plone/app/multilingual/tests/test_selector.py", line 404, in test_siteroot_by_closest
    self.assertSiteRoot()
  File "/home/jenkins/workspace/plone-5.0-python-2.7/src/plone.app.multilingual/src/plone/app/multilingual/tests/test_selector.py", line 365, in assertSiteRoot
    '/@@multilingual-selector/notg/en?set_language=en')
  File "/usr/lib/python2.7/unittest/case.py", line 513, in assertEqual
    assertion_func(first, second, msg=msg)
  File "/usr/lib/python2.7/unittest/case.py", line 506, in _baseAssertEqual
    raise self.failureException(msg)


FAILED:  plone.app.multilingual.tests.test_selector.TestLanguageSelectorBasics.test_siteroot_by_dialog

Error Message:
u'http://nohost/plone/?set_language=en' != 'http://nohost/plone/@@multilingual-selector/notg/en?set_language=en'

Stack Trace:
u'http://nohost/plone/?set_language=en' != 'http://nohost/plone/@@multilingual-selector/notg/en?set_language=en'

  File "/usr/lib/python2.7/unittest/case.py", line 329, in run
    testMethod()
  File "/home/jenkins/workspace/plone-5.0-python-2.7/src/plone.app.multilingual/src/plone/app/multilingual/tests/test_selector.py", line 412, in test_siteroot_by_dialog
    self.assertSiteRoot()
  File "/home/jenkins/workspace/plone-5.0-python-2.7/src/plone.app.multilingual/src/plone/app/multilingual/tests/test_selector.py", line 365, in assertSiteRoot
    '/@@multilingual-selector/notg/en?set_language=en')
  File "/usr/lib/python2.7/unittest/case.py", line 513, in assertEqual
    assertion_func(first, second, msg=msg)
  File "/usr/lib/python2.7/unittest/case.py", line 506, in _baseAssertEqual
    raise self.failureException(msg)


More information about the Testbot mailing list