[Testbot] Plone 5.0 - Python 2.7 - Build # 232 - Failure!

jenkins at plone.org jenkins at plone.org
Fri Aug 4 12:24:38 UTC 2017


Plone 5.0 - Python 2.7 - Build # 232 - Failure:

Check console output at http://jenkins.plone.org/job/plone-5.0-python-2.7/232/ to view the results.

Changes:

[Mikel Larreategi] [fc] Add plone.app.multilingual to checkouts.cfg







Test Results:

4 tests failed.
FAILED:  plone.app.multilingual.tests.test_lrf.TestLanguageRootFolder.test_moving_shared_content_to_lrf

Error Message:
'/plone/es/recursos/test-document' != '/plone/es/assets/test-document'

Stack Trace:
'/plone/es/recursos/test-document' != '/plone/es/assets/test-document'

  File "/usr/lib/python2.7/unittest/case.py", line 329, in run
    testMethod()
  File "/home/jenkins/workspace/plone-5.0-python-2.7/src/plone.app.multilingual/src/plone/app/multilingual/tests/test_lrf.py", line 97, in test_moving_shared_content_to_lrf
    self.assertEqual(brains[0].getPath(), '/plone/es/assets/test-document')
  File "/usr/lib/python2.7/unittest/case.py", line 513, in assertEqual
    assertion_func(first, second, msg=msg)
  File "/usr/lib/python2.7/unittest/case.py", line 506, in _baseAssertEqual
    raise self.failureException(msg)


FAILED:  plone.app.multilingual.tests.test_lrf.TestLanguageRootFolder.test_shared_content

Error Message:
assets

Stack Trace:
assets

  File "/usr/lib/python2.7/unittest/case.py", line 329, in run
    testMethod()
  File "/home/jenkins/workspace/plone-5.0-python-2.7/src/plone.app.multilingual/src/plone/app/multilingual/tests/test_lrf.py", line 33, in test_shared_content
    self.portal.es.assets['test-document'])


FAILED:  plone.app.multilingual.tests.test_sitemap.TestSitemap.test_navroot_sitemap

Error Message:
'<loc>http://nohost/plone/es/assets/test-document</loc>' not found in '<?xml version="1.0" encoding="UTF-8"?>\n<urlset xmlns="http://www.sitemaps.org/schemas/sitemap/0.9" xmlns:xsi="http://www.w3.org/2001/XMLSchema-instance" xsi:schemaLocation="http://www.sitemaps.org/schemas/sitemap/0.9 http://www.sitemaps.org/schemas/sitemap/0.9/sitemap.xsd">\n<url>\n  <loc>http://nohost/plone/es</loc>\n  <lastmod>2017-08-04T05:21:09-07:00</lastmod>\n  \n  \n</url>\n<url>\n  <loc>http://nohost/plone/es/recursos</loc>\n  <lastmod>2017-08-04T05:20:01-07:00</lastmod>\n  \n  \n</url>\n<url>\n  <loc>http://nohost/plone/es/recursos/test-document</loc>\n  <lastmod>2017-08-04T05:21:08-07:00</lastmod>\n  \n  \n</url>\n<url>\n  <loc>http://nohost/plone/es/test-document</loc>\n  <lastmod>2017-08-04T05:21:09-07:00</lastmod>\n  \n  \n</url>\n</urlset>\n'

Stack Trace:
'<loc>http://nohost/plone/es/assets/test-document</loc>' not found in '<?xml version="1.0" encoding="UTF-8"?>\n<urlset xmlns="http://www.sitemaps.org/schemas/sitemap/0.9" xmlns:xsi="http://www.w3.org/2001/XMLSchema-instance" xsi:schemaLocation="http://www.sitemaps.org/schemas/sitemap/0.9 http://www.sitemaps.org/schemas/sitemap/0.9/sitemap.xsd">\n<url>\n  <loc>http://nohost/plone/es</loc>\n  <lastmod>2017-08-04T05:21:09-07:00</lastmod>\n  \n  \n</url>\n<url>\n  <loc>http://nohost/plone/es/recursos</loc>\n  <lastmod>2017-08-04T05:20:01-07:00</lastmod>\n  \n  \n</url>\n<url>\n  <loc>http://nohost/plone/es/recursos/test-document</loc>\n  <lastmod>2017-08-04T05:21:08-07:00</lastmod>\n  \n  \n</url>\n<url>\n  <loc>http://nohost/plone/es/test-document</loc>\n  <lastmod>2017-08-04T05:21:09-07:00</lastmod>\n  \n  \n</url>\n</urlset>\n'

  File "/usr/lib/python2.7/unittest/case.py", line 329, in run
    testMethod()
  File "/home/jenkins/workspace/plone-5.0-python-2.7/src/plone.app.multilingual/src/plone/app/multilingual/tests/test_sitemap.py", line 79, in test_navroot_sitemap
    self.assertIn('<loc>http://nohost/plone/es/assets/test-document</loc>', xml)
  File "/usr/lib/python2.7/unittest/case.py", line 803, in assertIn
    self.fail(self._formatMessage(msg, standardMsg))
  File "/usr/lib/python2.7/unittest/case.py", line 410, in fail
    raise self.failureException(msg)


FAILED:  plone.app.multilingual.tests.test_sitemap.TestSitemap.test_portalroot_sitemap

Error Message:
'<loc>http://nohost/plone/es/assets/test-document</loc>' not found in '<?xml version="1.0" encoding="UTF-8"?>\n<urlset xmlns="http://www.sitemaps.org/schemas/sitemap/0.9" xmlns:xsi="http://www.w3.org/2001/XMLSchema-instance" xsi:schemaLocation="http://www.sitemaps.org/schemas/sitemap/0.9 http://www.sitemaps.org/schemas/sitemap/0.9/sitemap.xsd">\n<url>\n  <loc>http://nohost/plone</loc>\n  <lastmod>2017-08-04T05:19:55-07:00</lastmod>\n  \n  \n</url>\n<url>\n  <loc>http://nohost/plone/en</loc>\n  <lastmod>2017-08-04T05:21:10-07:00</lastmod>\n  \n  \n</url>\n<url>\n  <loc>http://nohost/plone/en/assets</loc>\n  <lastmod>2017-08-04T05:21:10-07:00</lastmod>\n  \n  \n</url>\n<url>\n  <loc>http://nohost/plone/ca</loc>\n  <lastmod>2017-08-04T05:21:10-07:00</lastmod>\n  \n  \n</url>\n<url>\n  <loc>http://nohost/plone/ca/assets</loc>\n  <lastmod>2017-08-04T05:20:01-07:00</lastmod>\n  \n  \n</url>\n<url>\n  <loc>http://nohost/plone/es</loc>\n  <lastmod>2017-08-04T05:21:10-07:00</lastmod>\n  \n  \n</url>\n<url>\n  <loc>http://nohost/plone/es/recursos</loc>\n  <lastmod>2017-08-04T05:20:01-07:00</lastmod>\n  \n  \n</url>\n<url>\n  <loc>http://nohost/plone/en/assets/test-document</loc>\n  <lastmod>2017-08-04T05:21:09-07:00</lastmod>\n  \n  \n</url>\n<url>\n  <loc>http://nohost/plone/ca/assets/test-document</loc>\n  <lastmod>2017-08-04T05:21:09-07:00</lastmod>\n  \n  \n</url>\n<url>\n  <loc>http://nohost/plone/es/recursos/test-document</loc>\n  <lastmod>2017-08-04T05:21:09-07:00</lastmod>\n  \n  \n</url>\n<url>\n  <loc>http://nohost/plone/ca/test-document</loc>\n  <lastmod>2017-08-04T05:21:10-07:00</lastmod>\n  \n  \n</url>\n<url>\n  <loc>http://nohost/plone/es/test-document</loc>\n  <lastmod>2017-08-04T05:21:10-07:00</lastmod>\n  \n  \n</url>\n<url>\n  <loc>http://nohost/plone/en/test-document</loc>\n  <lastmod>2017-08-04T05:21:10-07:00</lastmod>\n  \n  \n</url>\n</urlset>\n'

Stack Trace:
'<loc>http://nohost/plone/es/assets/test-document</loc>' not found in '<?xml version="1.0" encoding="UTF-8"?>\n<urlset xmlns="http://www.sitemaps.org/schemas/sitemap/0.9" xmlns:xsi="http://www.w3.org/2001/XMLSchema-instance" xsi:schemaLocation="http://www.sitemaps.org/schemas/sitemap/0.9 http://www.sitemaps.org/schemas/sitemap/0.9/sitemap.xsd">\n<url>\n  <loc>http://nohost/plone</loc>\n  <lastmod>2017-08-04T05:19:55-07:00</lastmod>\n  \n  \n</url>\n<url>\n  <loc>http://nohost/plone/en</loc>\n  <lastmod>2017-08-04T05:21:10-07:00</lastmod>\n  \n  \n</url>\n<url>\n  <loc>http://nohost/plone/en/assets</loc>\n  <lastmod>2017-08-04T05:21:10-07:00</lastmod>\n  \n  \n</url>\n<url>\n  <loc>http://nohost/plone/ca</loc>\n  <lastmod>2017-08-04T05:21:10-07:00</lastmod>\n  \n  \n</url>\n<url>\n  <loc>http://nohost/plone/ca/assets</loc>\n  <lastmod>2017-08-04T05:20:01-07:00</lastmod>\n  \n  \n</url>\n<url>\n  <loc>http://nohost/plone/es</loc>\n  <lastmod>2017-08-04T05:21:10-07:00</lastmod>\n  \n  \n</url>\n<url>\n  <loc>http://nohost/plone/es/recursos</loc>\n  <lastmod>2017-08-04T05:20:01-07:00</lastmod>\n  \n  \n</url>\n<url>\n  <loc>http://nohost/plone/en/assets/test-document</loc>\n  <lastmod>2017-08-04T05:21:09-07:00</lastmod>\n  \n  \n</url>\n<url>\n  <loc>http://nohost/plone/ca/assets/test-document</loc>\n  <lastmod>2017-08-04T05:21:09-07:00</lastmod>\n  \n  \n</url>\n<url>\n  <loc>http://nohost/plone/es/recursos/test-document</loc>\n  <lastmod>2017-08-04T05:21:09-07:00</lastmod>\n  \n  \n</url>\n<url>\n  <loc>http://nohost/plone/ca/test-document</loc>\n  <lastmod>2017-08-04T05:21:10-07:00</lastmod>\n  \n  \n</url>\n<url>\n  <loc>http://nohost/plone/es/test-document</loc>\n  <lastmod>2017-08-04T05:21:10-07:00</lastmod>\n  \n  \n</url>\n<url>\n  <loc>http://nohost/plone/en/test-document</loc>\n  <lastmod>2017-08-04T05:21:10-07:00</lastmod>\n  \n  \n</url>\n</urlset>\n'

  File "/usr/lib/python2.7/unittest/case.py", line 329, in run
    testMethod()
  File "/home/jenkins/workspace/plone-5.0-python-2.7/src/plone.app.multilingual/src/plone/app/multilingual/tests/test_sitemap.py", line 64, in test_portalroot_sitemap
    self.assertIn('<loc>http://nohost/plone/es/assets/test-document</loc>', xml)
  File "/usr/lib/python2.7/unittest/case.py", line 803, in assertIn
    self.fail(self._formatMessage(msg, standardMsg))
  File "/usr/lib/python2.7/unittest/case.py", line 410, in fail
    raise self.failureException(msg)


More information about the Testbot mailing list