[Testbot] Plone 4.3 - Python 2.7 - Build # 1904 - Failure!

jenkins at plone.org jenkins at plone.org
Wed Apr 19 09:14:38 UTC 2017


Plone 4.3 - Python 2.7 - Build # 1904 - Failure:

Check console output at http://jenkins.plone.org/job/plone-4.3-python-2.7/1904/ to view the results.

Changes:

[Paul Grunewald] [fc] Add Products.Archetypes to checkouts.cfg

[Paul Grunewald] [fc] Repository: Products.Archetypes Branch: refs/heads/1.9.x Date:







Test Results:

10 tests failed.
FAILED:  Products.CMFPlacefulWorkflow.tests.testCMFPlacefulWorkflow.Startup

Error Message:
File "/home/jenkins/.buildout/eggs/Zope2-2.13.26-py2.7.egg/Zope2/utilities/skel/etc/site.zcml", line 16.2-16.23

Stack Trace:
File "/home/jenkins/.buildout/eggs/Zope2-2.13.26-py2.7.egg/Zope2/utilities/skel/etc/site.zcml", line 16.2-16.23
    ZopeXMLConfigurationError: File "/home/jenkins/.buildout/eggs/Products.CMFEditions-2.2.23-py2.7.egg/Products/CMFEditions/configure.zcml", line 12.2-12.39
    IOError: [Errno 2] No such file or directory: '/home/jenkins/.buildout/eggs/Products.CMFUid-2.2.1-py2.7.egg/Products/CMFUid/configure.zcml'

  File "/home/jenkins/.buildout/eggs/Products.CMFPlacefulWorkflow-1.5.15-py2.7.egg/Products/CMFPlacefulWorkflow/tests/testCMFPlacefulWorkflow.py", line 28, in <module>
    from CMFPlacefulWorkflowTestCase import CMFPlacefulWorkflowTestCase
  File "/home/jenkins/.buildout/eggs/Products.CMFPlacefulWorkflow-1.5.15-py2.7.egg/Products/CMFPlacefulWorkflow/tests/CMFPlacefulWorkflowTestCase.py", line 89, in <module>
    app = ZopeTestCase.app()
  File "/home/jenkins/.buildout/eggs/Zope2-2.13.26-py2.7.egg/Testing/ZopeTestCase/base.py", line 30, in app
    app = Zope2.app()
  File "/home/jenkins/.buildout/eggs/Zope2-2.13.26-py2.7.egg/Zope2/__init__.py", line 51, in app
    startup()
  File "/home/jenkins/.buildout/eggs/Zope2-2.13.26-py2.7.egg/Zope2/__init__.py", line 47, in startup
    _startup()
  File "/home/jenkins/.buildout/eggs/Zope2-2.13.26-py2.7.egg/Zope2/App/startup.py", line 120, in startup
    load_zcml()
  File "/home/jenkins/.buildout/eggs/Zope2-2.13.26-py2.7.egg/Zope2/App/startup.py", line 52, in load_zcml
    load_site()
  File "/home/jenkins/.buildout/eggs/Zope2-2.13.26-py2.7.egg/Zope2/App/zcml.py", line 46, in load_site
    _context = xmlconfig.file(site_zcml)
  File "/home/jenkins/.buildout/eggs/zope.configuration-3.7.4-py2.7.egg/zope/configuration/xmlconfig.py", line 649, in file
    include(context, name, package)
  File "/home/jenkins/.buildout/eggs/zope.configuration-3.7.4-py2.7.egg/zope/configuration/xmlconfig.py", line 548, in include
    processxmlfile(f, context)
  File "/home/jenkins/.buildout/eggs/zope.configuration-3.7.4-py2.7.egg/zope/configuration/xmlconfig.py", line 380, in processxmlfile
    parser.parse(src)
  File "/usr/lib/python2.7/xml/sax/expatreader.py", line 110, in parse
    xmlreader.IncrementalParser.parse(self, source)
  File "/usr/lib/python2.7/xml/sax/xmlreader.py", line 123, in parse
    self.feed(buffer)
  File "/usr/lib/python2.7/xml/sax/expatreader.py", line 213, in feed
    self._parser.Parse(data, isFinal)
  File "/usr/lib/python2.7/xml/sax/expatreader.py", line 365, in end_element_ns
    self._cont_handler.endElementNS(pair, None)
  File "/home/jenkins/.buildout/eggs/zope.configuration-3.7.4-py2.7.egg/zope/configuration/xmlconfig.py", line 359, in endElementNS
    self.context.end()
  File "/home/jenkins/.buildout/eggs/zope.configuration-3.7.4-py2.7.egg/zope/configuration/config.py", line 558, in end
    self.stack.pop().finish()
  File "/home/jenkins/.buildout/eggs/zope.configuration-3.7.4-py2.7.egg/zope/configuration/config.py", line 706, in finish
    actions = self.handler(context, **args)
  File "/home/jenkins/.buildout/eggs/Zope2-2.13.26-py2.7.egg/OFS/metaconfigure.py", line 46, in loadProducts
    xmlconfig.include(_context, zcml, package=product)
  File "/home/jenkins/.buildout/eggs/zope.configuration-3.7.4-py2.7.egg/zope/configuration/xmlconfig.py", line 548, in include
    processxmlfile(f, context)
  File "/home/jenkins/.buildout/eggs/zope.configuration-3.7.4-py2.7.egg/zope/configuration/xmlconfig.py", line 380, in processxmlfile
    parser.parse(src)
  File "/usr/lib/python2.7/xml/sax/expatreader.py", line 110, in parse
    xmlreader.IncrementalParser.parse(self, source)
  File "/usr/lib/python2.7/xml/sax/xmlreader.py", line 123, in parse
    self.feed(buffer)
  File "/usr/lib/python2.7/xml/sax/expatreader.py", line 213, in feed
    self._parser.Parse(data, isFinal)
  File "/usr/lib/python2.7/xml/sax/expatreader.py", line 365, in end_element_ns
    self._cont_handler.endElementNS(pair, None)
  File "/home/jenkins/.buildout/eggs/zope.configuration-3.7.4-py2.7.egg/zope/configuration/xmlconfig.py", line 359, in endElementNS
    self.context.end()
  File "/home/jenkins/.buildout/eggs/zope.configuration-3.7.4-py2.7.egg/zope/configuration/config.py", line 558, in end
    self.stack.pop().finish()
  File "/home/jenkins/.buildout/eggs/zope.configuration-3.7.4-py2.7.egg/zope/configuration/config.py", line 706, in finish
    actions = self.handler(context, **args)
  File "/home/jenkins/.buildout/eggs/zope.configuration-3.7.4-py2.7.egg/zope/configuration/xmlconfig.py", line 541, in include
    f = openInOrPlain(path)
  File "/home/jenkins/.buildout/eggs/zope.configuration-3.7.4-py2.7.egg/zope/configuration/xmlconfig.py", line 429, in openInOrPlain
    fp = open(filename)


FAILED:  Products.CMFPlacefulWorkflow.tests.test_configlet.Startup

Error Message:
'NoneType' object is not callable

Stack Trace:
'NoneType' object is not callable

  File "/home/jenkins/.buildout/eggs/Products.CMFPlacefulWorkflow-1.5.15-py2.7.egg/Products/CMFPlacefulWorkflow/tests/test_configlet.py", line 27, in <module>
    from CMFPlacefulWorkflowTestCase import CMFPlacefulWorkflowFunctionalTestCase
  File "/home/jenkins/.buildout/eggs/Products.CMFPlacefulWorkflow-1.5.15-py2.7.egg/Products/CMFPlacefulWorkflow/tests/CMFPlacefulWorkflowTestCase.py", line 89, in <module>
    app = ZopeTestCase.app()
  File "/home/jenkins/.buildout/eggs/Zope2-2.13.26-py2.7.egg/Testing/ZopeTestCase/base.py", line 30, in app
    app = Zope2.app()
  File "/home/jenkins/.buildout/eggs/Zope2-2.13.26-py2.7.egg/Zope2/__init__.py", line 52, in app
    return bobo_application(*args, **kw)


FAILED:  Products.CMFPlacefulWorkflow.tests.test_exportimport.Startup

Error Message:
'NoneType' object is not callable

Stack Trace:
'NoneType' object is not callable

  File "/home/jenkins/.buildout/eggs/Products.CMFPlacefulWorkflow-1.5.15-py2.7.egg/Products/CMFPlacefulWorkflow/tests/test_exportimport.py", line 30, in <module>
    from CMFPlacefulWorkflowTestCase import CMFPlacefulWorkflowTestCase
  File "/home/jenkins/.buildout/eggs/Products.CMFPlacefulWorkflow-1.5.15-py2.7.egg/Products/CMFPlacefulWorkflow/tests/CMFPlacefulWorkflowTestCase.py", line 89, in <module>
    app = ZopeTestCase.app()
  File "/home/jenkins/.buildout/eggs/Zope2-2.13.26-py2.7.egg/Testing/ZopeTestCase/base.py", line 30, in app
    app = Zope2.app()
  File "/home/jenkins/.buildout/eggs/Zope2-2.13.26-py2.7.egg/Zope2/__init__.py", line 52, in app
    return bobo_application(*args, **kw)


FAILED:  Products.CMFPlacefulWorkflow.tests.test_policy_form.Startup

Error Message:
'NoneType' object is not callable

Stack Trace:
'NoneType' object is not callable

  File "/home/jenkins/.buildout/eggs/Products.CMFPlacefulWorkflow-1.5.15-py2.7.egg/Products/CMFPlacefulWorkflow/tests/test_policy_form.py", line 26, in <module>
    from CMFPlacefulWorkflowTestCase import CMFPlacefulWorkflowFunctionalTestCase
  File "/home/jenkins/.buildout/eggs/Products.CMFPlacefulWorkflow-1.5.15-py2.7.egg/Products/CMFPlacefulWorkflow/tests/CMFPlacefulWorkflowTestCase.py", line 89, in <module>
    app = ZopeTestCase.app()
  File "/home/jenkins/.buildout/eggs/Zope2-2.13.26-py2.7.egg/Testing/ZopeTestCase/base.py", line 30, in app
    app = Zope2.app()
  File "/home/jenkins/.buildout/eggs/Zope2-2.13.26-py2.7.egg/Zope2/__init__.py", line 52, in app
    return bobo_application(*args, **kw)


FAILED:  archetypes.referencebrowserwidget.tests.test_browser.Startup

Error Message:
File "/home/jenkins/.buildout/eggs/Zope2-2.13.26-py2.7.egg/Zope2/utilities/skel/etc/site.zcml", line 16.2-16.23

Stack Trace:
File "/home/jenkins/.buildout/eggs/Zope2-2.13.26-py2.7.egg/Zope2/utilities/skel/etc/site.zcml", line 16.2-16.23
    ZopeXMLConfigurationError: File "/home/jenkins/.buildout/eggs/Products.CMFEditions-2.2.23-py2.7.egg/Products/CMFEditions/configure.zcml", line 12.2-12.39
    IOError: [Errno 2] No such file or directory: '/home/jenkins/.buildout/eggs/Products.CMFUid-2.2.1-py2.7.egg/Products/CMFUid/configure.zcml'

  File "/home/jenkins/.buildout/eggs/archetypes.referencebrowserwidget-2.5.9-py2.7.egg/archetypes/referencebrowserwidget/tests/test_browser.py", line 4, in <module>
    from archetypes.referencebrowserwidget.tests.base import FunctionalTestCase
  File "/home/jenkins/.buildout/eggs/archetypes.referencebrowserwidget-2.5.9-py2.7.egg/archetypes/referencebrowserwidget/tests/base.py", line 21, in <module>
    app = ztc.app()
  File "/home/jenkins/.buildout/eggs/Zope2-2.13.26-py2.7.egg/Testing/ZopeTestCase/base.py", line 30, in app
    app = Zope2.app()
  File "/home/jenkins/.buildout/eggs/Zope2-2.13.26-py2.7.egg/Zope2/__init__.py", line 51, in app
    startup()
  File "/home/jenkins/.buildout/eggs/Zope2-2.13.26-py2.7.egg/Zope2/__init__.py", line 47, in startup
    _startup()
  File "/home/jenkins/.buildout/eggs/Zope2-2.13.26-py2.7.egg/Zope2/App/startup.py", line 120, in startup
    load_zcml()
  File "/home/jenkins/.buildout/eggs/Zope2-2.13.26-py2.7.egg/Zope2/App/startup.py", line 52, in load_zcml
    load_site()
  File "/home/jenkins/.buildout/eggs/Zope2-2.13.26-py2.7.egg/Zope2/App/zcml.py", line 46, in load_site
    _context = xmlconfig.file(site_zcml)
  File "/home/jenkins/.buildout/eggs/zope.configuration-3.7.4-py2.7.egg/zope/configuration/xmlconfig.py", line 649, in file
    include(context, name, package)
  File "/home/jenkins/.buildout/eggs/zope.configuration-3.7.4-py2.7.egg/zope/configuration/xmlconfig.py", line 548, in include
    processxmlfile(f, context)
  File "/home/jenkins/.buildout/eggs/zope.configuration-3.7.4-py2.7.egg/zope/configuration/xmlconfig.py", line 380, in processxmlfile
    parser.parse(src)
  File "/usr/lib/python2.7/xml/sax/expatreader.py", line 110, in parse
    xmlreader.IncrementalParser.parse(self, source)
  File "/usr/lib/python2.7/xml/sax/xmlreader.py", line 123, in parse
    self.feed(buffer)
  File "/usr/lib/python2.7/xml/sax/expatreader.py", line 213, in feed
    self._parser.Parse(data, isFinal)
  File "/usr/lib/python2.7/xml/sax/expatreader.py", line 365, in end_element_ns
    self._cont_handler.endElementNS(pair, None)
  File "/home/jenkins/.buildout/eggs/zope.configuration-3.7.4-py2.7.egg/zope/configuration/xmlconfig.py", line 359, in endElementNS
    self.context.end()
  File "/home/jenkins/.buildout/eggs/zope.configuration-3.7.4-py2.7.egg/zope/configuration/config.py", line 558, in end
    self.stack.pop().finish()
  File "/home/jenkins/.buildout/eggs/zope.configuration-3.7.4-py2.7.egg/zope/configuration/config.py", line 706, in finish
    actions = self.handler(context, **args)
  File "/home/jenkins/.buildout/eggs/Zope2-2.13.26-py2.7.egg/OFS/metaconfigure.py", line 46, in loadProducts
    xmlconfig.include(_context, zcml, package=product)
  File "/home/jenkins/.buildout/eggs/zope.configuration-3.7.4-py2.7.egg/zope/configuration/xmlconfig.py", line 548, in include
    processxmlfile(f, context)
  File "/home/jenkins/.buildout/eggs/zope.configuration-3.7.4-py2.7.egg/zope/configuration/xmlconfig.py", line 380, in processxmlfile
    parser.parse(src)
  File "/usr/lib/python2.7/xml/sax/expatreader.py", line 110, in parse
    xmlreader.IncrementalParser.parse(self, source)
  File "/usr/lib/python2.7/xml/sax/xmlreader.py", line 123, in parse
    self.feed(buffer)
  File "/usr/lib/python2.7/xml/sax/expatreader.py", line 213, in feed
    self._parser.Parse(data, isFinal)
  File "/usr/lib/python2.7/xml/sax/expatreader.py", line 365, in end_element_ns
    self._cont_handler.endElementNS(pair, None)
  File "/home/jenkins/.buildout/eggs/zope.configuration-3.7.4-py2.7.egg/zope/configuration/xmlconfig.py", line 359, in endElementNS
    self.context.end()
  File "/home/jenkins/.buildout/eggs/zope.configuration-3.7.4-py2.7.egg/zope/configuration/config.py", line 558, in end
    self.stack.pop().finish()
  File "/home/jenkins/.buildout/eggs/zope.configuration-3.7.4-py2.7.egg/zope/configuration/config.py", line 706, in finish
    actions = self.handler(context, **args)
  File "/home/jenkins/.buildout/eggs/zope.configuration-3.7.4-py2.7.egg/zope/configuration/xmlconfig.py", line 541, in include
    f = openInOrPlain(path)
  File "/home/jenkins/.buildout/eggs/zope.configuration-3.7.4-py2.7.egg/zope/configuration/xmlconfig.py", line 429, in openInOrPlain
    fp = open(filename)


FAILED:  archetypes.referencebrowserwidget.tests.test_product.Startup

Error Message:
cannot import name Batch

Stack Trace:
cannot import name Batch

  File "/home/jenkins/.buildout/eggs/archetypes.referencebrowserwidget-2.5.9-py2.7.egg/archetypes/referencebrowserwidget/tests/test_product.py", line 11, in <module>
    from Products.CMFPlone import Batch


FAILED:  archetypes.referencebrowserwidget.tests.test_utils.Startup

Error Message:
'NoneType' object is not callable

Stack Trace:
'NoneType' object is not callable

  File "/home/jenkins/.buildout/eggs/archetypes.referencebrowserwidget-2.5.9-py2.7.egg/archetypes/referencebrowserwidget/tests/test_utils.py", line 4, in <module>
    from archetypes.referencebrowserwidget.tests.base import TestCase
  File "/home/jenkins/.buildout/eggs/archetypes.referencebrowserwidget-2.5.9-py2.7.egg/archetypes/referencebrowserwidget/tests/base.py", line 21, in <module>
    app = ztc.app()
  File "/home/jenkins/.buildout/eggs/Zope2-2.13.26-py2.7.egg/Testing/ZopeTestCase/base.py", line 30, in app
    app = Zope2.app()
  File "/home/jenkins/.buildout/eggs/Zope2-2.13.26-py2.7.egg/Zope2/__init__.py", line 52, in app
    return bobo_application(*args, **kw)


FAILED:  plone.app.testing.helpers.rst

Error Message:
Failed doctest test for helpers.rst

Stack Trace:
Failed doctest test for helpers.rst
  File "/home/jenkins/workspace/plone-4.3-python-2.7/src/plone.app.testing/plone/app/testing/helpers.rst", line 0

----------------------------------------------------------------------
File "/home/jenkins/workspace/plone-4.3-python-2.7/src/plone.app.testing/plone/app/testing/helpers.rst", line 117, in helpers.rst
Failed example:
    runner.setup_layer(options, HELPER_DEMOS_INTEGRATION_TESTING, setupLayers)
Exception raised:
    Traceback (most recent call last):
      File "/usr/lib/python2.7/doctest.py", line 1315, in __run
        compileflags, 1) in test.globs
      File "<doctest helpers.rst[11]>", line 1, in <module>
        runner.setup_layer(options, HELPER_DEMOS_INTEGRATION_TESTING, setupLayers)
      File "/home/jenkins/.buildout/eggs/zope.testing-3.9.7-py2.7.egg/zope/testing/testrunner/runner.py", line 628, in setup_layer
        setup_layer(options, base, setup_layers)
      File "/home/jenkins/.buildout/eggs/zope.testing-3.9.7-py2.7.egg/zope/testing/testrunner/runner.py", line 628, in setup_layer
        setup_layer(options, base, setup_layers)
      File "/home/jenkins/.buildout/eggs/zope.testing-3.9.7-py2.7.egg/zope/testing/testrunner/runner.py", line 628, in setup_layer
        setup_layer(options, base, setup_layers)
      File "/home/jenkins/.buildout/eggs/zope.testing-3.9.7-py2.7.egg/zope/testing/testrunner/runner.py", line 633, in setup_layer
        layer.setUp()
      File "/home/jenkins/.buildout/eggs/plone.testing-4.1.2-py2.7.egg/plone/testing/z2.py", line 347, in setUp
        self.setUpDatabase()
      File "/home/jenkins/.buildout/eggs/plone.testing-4.1.2-py2.7.egg/plone/testing/z2.py", line 557, in setUpDatabase
        name='Startup')
      File "/home/jenkins/.buildout/eggs/plone.testing-4.1.2-py2.7.egg/plone/testing/zodb.py", line 26, in stackDemoStorage
        storage = DemoStorage(name=name, base=db.storage)
    AttributeError: 'DB' object has no attribute 'storage'


  File "/usr/lib/python2.7/unittest/case.py", line 329, in run
    testMethod()
  File "/usr/lib/python2.7/doctest.py", line 2226, in runTest
    raise self.failureException(self.format_failure(new.getvalue()))


FAILED:  plone.app.testing.layers.rst

Error Message:
Failed doctest test for layers.rst

Stack Trace:
Failed doctest test for layers.rst
  File "/home/jenkins/workspace/plone-4.3-python-2.7/src/plone.app.testing/plone/app/testing/layers.rst", line 0

----------------------------------------------------------------------
File "/home/jenkins/workspace/plone-4.3-python-2.7/src/plone.app.testing/plone/app/testing/layers.rst", line 46, in layers.rst
Failed example:
    runner.setup_layer(options, layers.PLONE_FIXTURE, setupLayers)
Exception raised:
    Traceback (most recent call last):
      File "/usr/lib/python2.7/doctest.py", line 1315, in __run
        compileflags, 1) in test.globs
      File "<doctest layers.rst[4]>", line 1, in <module>
        runner.setup_layer(options, layers.PLONE_FIXTURE, setupLayers)
      File "/home/jenkins/.buildout/eggs/zope.testing-3.9.7-py2.7.egg/zope/testing/testrunner/runner.py", line 628, in setup_layer
        setup_layer(options, base, setup_layers)
      File "/home/jenkins/.buildout/eggs/zope.testing-3.9.7-py2.7.egg/zope/testing/testrunner/runner.py", line 633, in setup_layer
        layer.setUp()
      File "/home/jenkins/.buildout/eggs/plone.testing-4.1.2-py2.7.egg/plone/testing/z2.py", line 347, in setUp
        self.setUpDatabase()
      File "/home/jenkins/.buildout/eggs/plone.testing-4.1.2-py2.7.egg/plone/testing/z2.py", line 557, in setUpDatabase
        name='Startup')
      File "/home/jenkins/.buildout/eggs/plone.testing-4.1.2-py2.7.egg/plone/testing/zodb.py", line 26, in stackDemoStorage
        storage = DemoStorage(name=name, base=db.storage)
    AttributeError: 'DB' object has no attribute 'storage'


  File "/usr/lib/python2.7/unittest/case.py", line 329, in run
    testMethod()
  File "/usr/lib/python2.7/doctest.py", line 2226, in runTest
    raise self.failureException(self.format_failure(new.getvalue()))


FAILED:  plone.testing.z2.rst

Error Message:
Failed doctest test for z2.rst

Stack Trace:
Failed doctest test for z2.rst
  File "/home/jenkins/.buildout/eggs/plone.testing-4.1.2-py2.7.egg/plone/testing/z2.rst", line 0

----------------------------------------------------------------------
File "/home/jenkins/.buildout/eggs/plone.testing-4.1.2-py2.7.egg/plone/testing/z2.rst", line 46, in z2.rst
Failed example:
    runner.setup_layer(options, z2.STARTUP, setupLayers)
Exception raised:
    Traceback (most recent call last):
      File "/usr/lib/python2.7/doctest.py", line 1315, in __run
        compileflags, 1) in test.globs
      File "<doctest z2.rst[10]>", line 1, in <module>
        runner.setup_layer(options, z2.STARTUP, setupLayers)
      File "/home/jenkins/.buildout/eggs/zope.testrunner-4.4.4-py2.7.egg/zope/testrunner/runner.py", line 713, in setup_layer
        layer.setUp()
      File "/home/jenkins/.buildout/eggs/plone.testing-4.1.2-py2.7.egg/plone/testing/z2.py", line 347, in setUp
        self.setUpDatabase()
      File "/home/jenkins/.buildout/eggs/plone.testing-4.1.2-py2.7.egg/plone/testing/z2.py", line 557, in setUpDatabase
        name='Startup')
      File "/home/jenkins/.buildout/eggs/plone.testing-4.1.2-py2.7.egg/plone/testing/zodb.py", line 26, in stackDemoStorage
        storage = DemoStorage(name=name, base=db.storage)
    AttributeError: 'DB' object has no attribute 'storage'


  File "/usr/lib/python2.7/unittest/case.py", line 329, in run
    testMethod()
  File "/usr/lib/python2.7/doctest.py", line 2226, in runTest
    raise self.failureException(self.format_failure(new.getvalue()))





More information about the Testbot mailing list