[Testbot] Plone 5.0 - Python 2.7 - Archetypes - Build # 5147 - Failure!

jenkins at plone.org jenkins at plone.org
Wed Oct 5 15:12:50 UTC 2016


Plone 5.0 - Python 2.7 - Archetypes - Build # 5147 - Failure:

Check console output at http://jenkins.plone.org/job/plone-5.0-python-2.7-at/5147/ to view the results.

Changes:

[Gil Forcada Codinachs] [fc] Repository: plone.app.contentmenu Branch: refs/heads/master Date:







Test Results:

3 tests failed.
FAILED:  Products.GenericSetup.tests.test_context.DirectoryImportContextTests.test_listDirectory_multiple

Error Message:
object of type 'NoneType' has no len()

Stack Trace:
object of type 'NoneType' has no len()

  File "/usr/lib/python2.7/unittest/case.py", line 329, in run
    testMethod()
  File "/home/jenkins/.buildout/eggs/Products.GenericSetup-1.8.4-py2.7.egg/Products/GenericSetup/tests/test_context.py", line 289, in test_listDirectory_multiple
    self.assertEqual(len(names), 2)


FAILED:  Products.GenericSetup.tests.test_tool.SetupToolTests.test_runAllImportStepsFromProfile_with_new_strategy

Error Message:
Lists differ: ['/tmp/STT_test'] != ['/tmp/STT_test3', '/tmp/STT_t...

Stack Trace:
Lists differ: ['/tmp/STT_test'] != ['/tmp/STT_test3', '/tmp/STT_t...

First differing element 0:
'/tmp/STT_test'
'/tmp/STT_test3'

Second list contains 1 additional elements.
First extra element 1:
'/tmp/STT_test'

- ['/tmp/STT_test']
+ ['/tmp/STT_test3', '/tmp/STT_test']

  File "/usr/lib/python2.7/unittest/case.py", line 329, in run
    testMethod()
  File "/home/jenkins/.buildout/eggs/Products.GenericSetup-1.8.4-py2.7.egg/Products/GenericSetup/tests/test_tool.py", line 663, in test_runAllImportStepsFromProfile_with_new_strategy
    [self._PROFILE_PATH3, self._PROFILE_PATH])
  File "/usr/lib/python2.7/unittest/case.py", line 513, in assertEqual
    assertion_func(first, second, msg=msg)
  File "/usr/lib/python2.7/unittest/case.py", line 742, in assertListEqual
    self.assertSequenceEqual(list1, list2, msg, seq_type=list)
  File "/usr/lib/python2.7/unittest/case.py", line 724, in assertSequenceEqual
    self.fail(msg)
  File "/usr/lib/python2.7/unittest/case.py", line 410, in fail
    raise self.failureException(msg)


FAILED:  Products.GenericSetup.tests.test_tool.SetupToolTests.test_runAllImportStepsFromProfile_with_reapply_strategy

Error Message:
[Errno 2] No such file or directory: '/tmp/STT_test/metadata.xml'

Stack Trace:
[Errno 2] No such file or directory: '/tmp/STT_test/metadata.xml'

  File "/usr/lib/python2.7/unittest/case.py", line 329, in run
    testMethod()
  File "/home/jenkins/.buildout/eggs/Products.GenericSetup-1.8.4-py2.7.egg/Products/GenericSetup/tests/test_tool.py", line 635, in test_runAllImportStepsFromProfile_with_reapply_strategy
    tool = self._setup_dependency_strategy_test_tool()
  File "/home/jenkins/.buildout/eggs/Products.GenericSetup-1.8.4-py2.7.egg/Products/GenericSetup/tests/test_tool.py", line 583, in _setup_dependency_strategy_test_tool
    profile_type=EXTENSION)
  File "/home/jenkins/.buildout/eggs/Products.GenericSetup-1.8.4-py2.7.egg/Products/GenericSetup/registry.py", line 733, in registerProfile
    metadata = ProfileMetadata(path, product=product)()
  File "/home/jenkins/.buildout/eggs/Products.GenericSetup-1.8.4-py2.7.egg/Products/GenericSetup/metadata.py", line 55, in __call__
    file = open( full_path, 'r' )





More information about the Testbot mailing list