[Testbot] Plone 5.0 - Python 2.7 - Build # 4331 - Still Failing!

jenkins at plone.org jenkins at plone.org
Fri Mar 18 22:14:16 UTC 2016


Plone 5.0 - Python 2.7 - Build # 4331 - Still Failing:

Check console output at http://jenkins.plone.org/job/plone-5.0-python-2.7/4331/ to view the results.

Changes:

[Johannes Raggam] [fc] Repository: mockup Branch: refs/heads/master Date:







Test Results:

33 tests failed.
FAILED:  plone.schemaeditor.tests.choice.txt

Error Message:
File "/home/jenkins/.buildout/eggs/plone.schemaeditor-2.0.9-py2.7.egg/plone/schemaeditor/tests/browser_testing.zcml", line 8.4-8.43

Stack Trace:
File "/home/jenkins/.buildout/eggs/plone.schemaeditor-2.0.9-py2.7.egg/plone/schemaeditor/tests/browser_testing.zcml", line 8.4-8.43
    ZopeXMLConfigurationError: File "/home/jenkins/.buildout/eggs/plone.schemaeditor-2.0.9-py2.7.egg/plone/schemaeditor/configure.zcml", line 8.4-8.39
    ZopeXMLConfigurationError: File "/home/jenkins/.buildout/eggs/plone.protect-3.0.18-py2.7.egg/plone/protect/configure.zcml", line 38.4-44.6
    ConfigurationError: ('Invalid value for', 'for', "ImportError: Couldn't import Products.CMFPlone.interfaces, No module named CMFPlone.interfaces")

  File "/usr/lib/python2.7/unittest/case.py", line 322, in run
    self.setUp()
  File "/usr/lib/python2.7/doctest.py", line 2194, in setUp
    self._dt_setUp(test)
  File "/home/jenkins/.buildout/eggs/Zope2-2.13.24-py2.7.egg/Testing/ZopeTestCase/zopedoctest/functional.py", line 262, in setUp
    kwsetUp(test_instance)
  File "/home/jenkins/.buildout/eggs/plone.schemaeditor-2.0.9-py2.7.egg/plone/schemaeditor/tests/tests.py", line 35, in setUp
    zcml.load_config('browser_testing.zcml', plone.schemaeditor.tests)
  File "/home/jenkins/.buildout/eggs/Zope2-2.13.24-py2.7.egg/Zope2/App/zcml.py", line 55, in load_config
    _context = xmlconfig.file(config, package, _context, execute=execute)
  File "/home/jenkins/.buildout/eggs/zope.configuration-3.7.4-py2.7.egg/zope/configuration/xmlconfig.py", line 649, in file
    include(context, name, package)
  File "/home/jenkins/.buildout/eggs/zope.configuration-3.7.4-py2.7.egg/zope/configuration/xmlconfig.py", line 548, in include
    processxmlfile(f, context)
  File "/home/jenkins/.buildout/eggs/zope.configuration-3.7.4-py2.7.egg/zope/configuration/xmlconfig.py", line 380, in processxmlfile
    parser.parse(src)
  File "/usr/lib/python2.7/xml/sax/expatreader.py", line 107, in parse
    xmlreader.IncrementalParser.parse(self, source)
  File "/usr/lib/python2.7/xml/sax/xmlreader.py", line 123, in parse
    self.feed(buffer)
  File "/usr/lib/python2.7/xml/sax/expatreader.py", line 210, in feed
    self._parser.Parse(data, isFinal)
  File "/usr/lib/python2.7/xml/sax/expatreader.py", line 352, in end_element_ns
    self._cont_handler.endElementNS(pair, None)
  File "/home/jenkins/.buildout/eggs/zope.configuration-3.7.4-py2.7.egg/zope/configuration/xmlconfig.py", line 359, in endElementNS
    self.context.end()
  File "/home/jenkins/.buildout/eggs/zope.configuration-3.7.4-py2.7.egg/zope/configuration/config.py", line 558, in end
    self.stack.pop().finish()
  File "/home/jenkins/.buildout/eggs/zope.configuration-3.7.4-py2.7.egg/zope/configuration/config.py", line 706, in finish
    actions = self.handler(context, **args)
  File "/home/jenkins/.buildout/eggs/zope.configuration-3.7.4-py2.7.egg/zope/configuration/xmlconfig.py", line 548, in include
    processxmlfile(f, context)
  File "/home/jenkins/.buildout/eggs/zope.configuration-3.7.4-py2.7.egg/zope/configuration/xmlconfig.py", line 380, in processxmlfile
    parser.parse(src)
  File "/usr/lib/python2.7/xml/sax/expatreader.py", line 107, in parse
    xmlreader.IncrementalParser.parse(self, source)
  File "/usr/lib/python2.7/xml/sax/xmlreader.py", line 123, in parse
    self.feed(buffer)
  File "/usr/lib/python2.7/xml/sax/expatreader.py", line 210, in feed
    self._parser.Parse(data, isFinal)
  File "/usr/lib/python2.7/xml/sax/expatreader.py", line 352, in end_element_ns
    self._cont_handler.endElementNS(pair, None)
  File "/home/jenkins/.buildout/eggs/zope.configuration-3.7.4-py2.7.egg/zope/configuration/xmlconfig.py", line 359, in endElementNS
    self.context.end()
  File "/home/jenkins/.buildout/eggs/zope.configuration-3.7.4-py2.7.egg/zope/configuration/config.py", line 558, in end
    self.stack.pop().finish()
  File "/home/jenkins/.buildout/eggs/zope.configuration-3.7.4-py2.7.egg/zope/configuration/config.py", line 706, in finish
    actions = self.handler(context, **args)
  File "/home/jenkins/.buildout/eggs/zope.configuration-3.7.4-py2.7.egg/zope/configuration/xmlconfig.py", line 548, in include
    processxmlfile(f, context)
  File "/home/jenkins/.buildout/eggs/zope.configuration-3.7.4-py2.7.egg/zope/configuration/xmlconfig.py", line 380, in processxmlfile
    parser.parse(src)
  File "/usr/lib/python2.7/xml/sax/expatreader.py", line 107, in parse
    xmlreader.IncrementalParser.parse(self, source)
  File "/usr/lib/python2.7/xml/sax/xmlreader.py", line 123, in parse
    self.feed(buffer)
  File "/usr/lib/python2.7/xml/sax/expatreader.py", line 210, in feed
    self._parser.Parse(data, isFinal)
  File "/usr/lib/python2.7/xml/sax/expatreader.py", line 352, in end_element_ns
    self._cont_handler.endElementNS(pair, None)
  File "/home/jenkins/.buildout/eggs/zope.configuration-3.7.4-py2.7.egg/zope/configuration/xmlconfig.py", line 359, in endElementNS
    self.context.end()
  File "/home/jenkins/.buildout/eggs/zope.configuration-3.7.4-py2.7.egg/zope/configuration/config.py", line 558, in end
    self.stack.pop().finish()
  File "/home/jenkins/.buildout/eggs/zope.configuration-3.7.4-py2.7.egg/zope/configuration/config.py", line 705, in finish
    args = toargs(context, *self.argdata)
  File "/home/jenkins/.buildout/eggs/zope.configuration-3.7.4-py2.7.egg/zope/configuration/config.py", line 1397, in toargs
    args[str(name)] = field.fromUnicode(s)
  File "/home/jenkins/.buildout/eggs/zope.configuration-3.7.4-py2.7.egg/zope/configuration/fields.py", line 139, in fromUnicode
    raise schema.ValidationError(v)


FAILED:  plone.schemaeditor.tests.editing.txt

Error Message:
File "/home/jenkins/.buildout/eggs/plone.schemaeditor-2.0.9-py2.7.egg/plone/schemaeditor/tests/browser_testing.zcml", line 8.4-8.43

Stack Trace:
File "/home/jenkins/.buildout/eggs/plone.schemaeditor-2.0.9-py2.7.egg/plone/schemaeditor/tests/browser_testing.zcml", line 8.4-8.43
    ZopeXMLConfigurationError: File "/home/jenkins/.buildout/eggs/plone.schemaeditor-2.0.9-py2.7.egg/plone/schemaeditor/configure.zcml", line 8.4-8.39
    ZopeXMLConfigurationError: File "/home/jenkins/.buildout/eggs/plone.protect-3.0.18-py2.7.egg/plone/protect/configure.zcml", line 38.4-44.6
    ConfigurationError: ('Invalid value for', 'for', "ImportError: Couldn't import Products.CMFPlone.interfaces, No module named CMFPlone.interfaces")

  File "/usr/lib/python2.7/unittest/case.py", line 322, in run
    self.setUp()
  File "/usr/lib/python2.7/doctest.py", line 2194, in setUp
    self._dt_setUp(test)
  File "/home/jenkins/.buildout/eggs/Zope2-2.13.24-py2.7.egg/Testing/ZopeTestCase/zopedoctest/functional.py", line 262, in setUp
    kwsetUp(test_instance)
  File "/home/jenkins/.buildout/eggs/plone.schemaeditor-2.0.9-py2.7.egg/plone/schemaeditor/tests/tests.py", line 35, in setUp
    zcml.load_config('browser_testing.zcml', plone.schemaeditor.tests)
  File "/home/jenkins/.buildout/eggs/Zope2-2.13.24-py2.7.egg/Zope2/App/zcml.py", line 55, in load_config
    _context = xmlconfig.file(config, package, _context, execute=execute)
  File "/home/jenkins/.buildout/eggs/zope.configuration-3.7.4-py2.7.egg/zope/configuration/xmlconfig.py", line 649, in file
    include(context, name, package)
  File "/home/jenkins/.buildout/eggs/zope.configuration-3.7.4-py2.7.egg/zope/configuration/xmlconfig.py", line 548, in include
    processxmlfile(f, context)
  File "/home/jenkins/.buildout/eggs/zope.configuration-3.7.4-py2.7.egg/zope/configuration/xmlconfig.py", line 380, in processxmlfile
    parser.parse(src)
  File "/usr/lib/python2.7/xml/sax/expatreader.py", line 107, in parse
    xmlreader.IncrementalParser.parse(self, source)
  File "/usr/lib/python2.7/xml/sax/xmlreader.py", line 123, in parse
    self.feed(buffer)
  File "/usr/lib/python2.7/xml/sax/expatreader.py", line 210, in feed
    self._parser.Parse(data, isFinal)
  File "/usr/lib/python2.7/xml/sax/expatreader.py", line 352, in end_element_ns
    self._cont_handler.endElementNS(pair, None)
  File "/home/jenkins/.buildout/eggs/zope.configuration-3.7.4-py2.7.egg/zope/configuration/xmlconfig.py", line 359, in endElementNS
    self.context.end()
  File "/home/jenkins/.buildout/eggs/zope.configuration-3.7.4-py2.7.egg/zope/configuration/config.py", line 558, in end
    self.stack.pop().finish()
  File "/home/jenkins/.buildout/eggs/zope.configuration-3.7.4-py2.7.egg/zope/configuration/config.py", line 706, in finish
    actions = self.handler(context, **args)
  File "/home/jenkins/.buildout/eggs/zope.configuration-3.7.4-py2.7.egg/zope/configuration/xmlconfig.py", line 548, in include
    processxmlfile(f, context)
  File "/home/jenkins/.buildout/eggs/zope.configuration-3.7.4-py2.7.egg/zope/configuration/xmlconfig.py", line 380, in processxmlfile
    parser.parse(src)
  File "/usr/lib/python2.7/xml/sax/expatreader.py", line 107, in parse
    xmlreader.IncrementalParser.parse(self, source)
  File "/usr/lib/python2.7/xml/sax/xmlreader.py", line 123, in parse
    self.feed(buffer)
  File "/usr/lib/python2.7/xml/sax/expatreader.py", line 210, in feed
    self._parser.Parse(data, isFinal)
  File "/usr/lib/python2.7/xml/sax/expatreader.py", line 352, in end_element_ns
    self._cont_handler.endElementNS(pair, None)
  File "/home/jenkins/.buildout/eggs/zope.configuration-3.7.4-py2.7.egg/zope/configuration/xmlconfig.py", line 359, in endElementNS
    self.context.end()
  File "/home/jenkins/.buildout/eggs/zope.configuration-3.7.4-py2.7.egg/zope/configuration/config.py", line 558, in end
    self.stack.pop().finish()
  File "/home/jenkins/.buildout/eggs/zope.configuration-3.7.4-py2.7.egg/zope/configuration/config.py", line 706, in finish
    actions = self.handler(context, **args)
  File "/home/jenkins/.buildout/eggs/zope.configuration-3.7.4-py2.7.egg/zope/configuration/xmlconfig.py", line 548, in include
    processxmlfile(f, context)
  File "/home/jenkins/.buildout/eggs/zope.configuration-3.7.4-py2.7.egg/zope/configuration/xmlconfig.py", line 380, in processxmlfile
    parser.parse(src)
  File "/usr/lib/python2.7/xml/sax/expatreader.py", line 107, in parse
    xmlreader.IncrementalParser.parse(self, source)
  File "/usr/lib/python2.7/xml/sax/xmlreader.py", line 123, in parse
    self.feed(buffer)
  File "/usr/lib/python2.7/xml/sax/expatreader.py", line 210, in feed
    self._parser.Parse(data, isFinal)
  File "/usr/lib/python2.7/xml/sax/expatreader.py", line 352, in end_element_ns
    self._cont_handler.endElementNS(pair, None)
  File "/home/jenkins/.buildout/eggs/zope.configuration-3.7.4-py2.7.egg/zope/configuration/xmlconfig.py", line 359, in endElementNS
    self.context.end()
  File "/home/jenkins/.buildout/eggs/zope.configuration-3.7.4-py2.7.egg/zope/configuration/config.py", line 558, in end
    self.stack.pop().finish()
  File "/home/jenkins/.buildout/eggs/zope.configuration-3.7.4-py2.7.egg/zope/configuration/config.py", line 705, in finish
    args = toargs(context, *self.argdata)
  File "/home/jenkins/.buildout/eggs/zope.configuration-3.7.4-py2.7.egg/zope/configuration/config.py", line 1397, in toargs
    args[str(name)] = field.fromUnicode(s)
  File "/home/jenkins/.buildout/eggs/zope.configuration-3.7.4-py2.7.egg/zope/configuration/fields.py", line 139, in fromUnicode
    raise schema.ValidationError(v)


FAILED:  plone.schemaeditor.tests.extending.txt

Error Message:
File "/home/jenkins/.buildout/eggs/plone.schemaeditor-2.0.9-py2.7.egg/plone/schemaeditor/tests/browser_testing.zcml", line 8.4-8.43

Stack Trace:
File "/home/jenkins/.buildout/eggs/plone.schemaeditor-2.0.9-py2.7.egg/plone/schemaeditor/tests/browser_testing.zcml", line 8.4-8.43
    ZopeXMLConfigurationError: File "/home/jenkins/.buildout/eggs/plone.schemaeditor-2.0.9-py2.7.egg/plone/schemaeditor/configure.zcml", line 8.4-8.39
    ZopeXMLConfigurationError: File "/home/jenkins/.buildout/eggs/plone.protect-3.0.18-py2.7.egg/plone/protect/configure.zcml", line 38.4-44.6
    ConfigurationError: ('Invalid value for', 'for', "ImportError: Couldn't import Products.CMFPlone.interfaces, No module named CMFPlone.interfaces")

  File "/usr/lib/python2.7/unittest/case.py", line 322, in run
    self.setUp()
  File "/usr/lib/python2.7/doctest.py", line 2194, in setUp
    self._dt_setUp(test)
  File "/home/jenkins/.buildout/eggs/Zope2-2.13.24-py2.7.egg/Testing/ZopeTestCase/zopedoctest/functional.py", line 262, in setUp
    kwsetUp(test_instance)
  File "/home/jenkins/.buildout/eggs/plone.schemaeditor-2.0.9-py2.7.egg/plone/schemaeditor/tests/tests.py", line 35, in setUp
    zcml.load_config('browser_testing.zcml', plone.schemaeditor.tests)
  File "/home/jenkins/.buildout/eggs/Zope2-2.13.24-py2.7.egg/Zope2/App/zcml.py", line 55, in load_config
    _context = xmlconfig.file(config, package, _context, execute=execute)
  File "/home/jenkins/.buildout/eggs/zope.configuration-3.7.4-py2.7.egg/zope/configuration/xmlconfig.py", line 649, in file
    include(context, name, package)
  File "/home/jenkins/.buildout/eggs/zope.configuration-3.7.4-py2.7.egg/zope/configuration/xmlconfig.py", line 548, in include
    processxmlfile(f, context)
  File "/home/jenkins/.buildout/eggs/zope.configuration-3.7.4-py2.7.egg/zope/configuration/xmlconfig.py", line 380, in processxmlfile
    parser.parse(src)
  File "/usr/lib/python2.7/xml/sax/expatreader.py", line 107, in parse
    xmlreader.IncrementalParser.parse(self, source)
  File "/usr/lib/python2.7/xml/sax/xmlreader.py", line 123, in parse
    self.feed(buffer)
  File "/usr/lib/python2.7/xml/sax/expatreader.py", line 210, in feed
    self._parser.Parse(data, isFinal)
  File "/usr/lib/python2.7/xml/sax/expatreader.py", line 352, in end_element_ns
    self._cont_handler.endElementNS(pair, None)
  File "/home/jenkins/.buildout/eggs/zope.configuration-3.7.4-py2.7.egg/zope/configuration/xmlconfig.py", line 359, in endElementNS
    self.context.end()
  File "/home/jenkins/.buildout/eggs/zope.configuration-3.7.4-py2.7.egg/zope/configuration/config.py", line 558, in end
    self.stack.pop().finish()
  File "/home/jenkins/.buildout/eggs/zope.configuration-3.7.4-py2.7.egg/zope/configuration/config.py", line 706, in finish
    actions = self.handler(context, **args)
  File "/home/jenkins/.buildout/eggs/zope.configuration-3.7.4-py2.7.egg/zope/configuration/xmlconfig.py", line 548, in include
    processxmlfile(f, context)
  File "/home/jenkins/.buildout/eggs/zope.configuration-3.7.4-py2.7.egg/zope/configuration/xmlconfig.py", line 380, in processxmlfile
    parser.parse(src)
  File "/usr/lib/python2.7/xml/sax/expatreader.py", line 107, in parse
    xmlreader.IncrementalParser.parse(self, source)
  File "/usr/lib/python2.7/xml/sax/xmlreader.py", line 123, in parse
    self.feed(buffer)
  File "/usr/lib/python2.7/xml/sax/expatreader.py", line 210, in feed
    self._parser.Parse(data, isFinal)
  File "/usr/lib/python2.7/xml/sax/expatreader.py", line 352, in end_element_ns
    self._cont_handler.endElementNS(pair, None)
  File "/home/jenkins/.buildout/eggs/zope.configuration-3.7.4-py2.7.egg/zope/configuration/xmlconfig.py", line 359, in endElementNS
    self.context.end()
  File "/home/jenkins/.buildout/eggs/zope.configuration-3.7.4-py2.7.egg/zope/configuration/config.py", line 558, in end
    self.stack.pop().finish()
  File "/home/jenkins/.buildout/eggs/zope.configuration-3.7.4-py2.7.egg/zope/configuration/config.py", line 706, in finish
    actions = self.handler(context, **args)
  File "/home/jenkins/.buildout/eggs/zope.configuration-3.7.4-py2.7.egg/zope/configuration/xmlconfig.py", line 548, in include
    processxmlfile(f, context)
  File "/home/jenkins/.buildout/eggs/zope.configuration-3.7.4-py2.7.egg/zope/configuration/xmlconfig.py", line 380, in processxmlfile
    parser.parse(src)
  File "/usr/lib/python2.7/xml/sax/expatreader.py", line 107, in parse
    xmlreader.IncrementalParser.parse(self, source)
  File "/usr/lib/python2.7/xml/sax/xmlreader.py", line 123, in parse
    self.feed(buffer)
  File "/usr/lib/python2.7/xml/sax/expatreader.py", line 210, in feed
    self._parser.Parse(data, isFinal)
  File "/usr/lib/python2.7/xml/sax/expatreader.py", line 352, in end_element_ns
    self._cont_handler.endElementNS(pair, None)
  File "/home/jenkins/.buildout/eggs/zope.configuration-3.7.4-py2.7.egg/zope/configuration/xmlconfig.py", line 359, in endElementNS
    self.context.end()
  File "/home/jenkins/.buildout/eggs/zope.configuration-3.7.4-py2.7.egg/zope/configuration/config.py", line 558, in end
    self.stack.pop().finish()
  File "/home/jenkins/.buildout/eggs/zope.configuration-3.7.4-py2.7.egg/zope/configuration/config.py", line 705, in finish
    args = toargs(context, *self.argdata)
  File "/home/jenkins/.buildout/eggs/zope.configuration-3.7.4-py2.7.egg/zope/configuration/config.py", line 1397, in toargs
    args[str(name)] = field.fromUnicode(s)
  File "/home/jenkins/.buildout/eggs/zope.configuration-3.7.4-py2.7.egg/zope/configuration/fields.py", line 139, in fromUnicode
    raise schema.ValidationError(v)


FAILED:  plone.schemaeditor.tests.field_schemata.txt

Error Message:
File "/home/jenkins/.buildout/eggs/plone.schemaeditor-2.0.9-py2.7.egg/plone/schemaeditor/tests/browser_testing.zcml", line 8.4-8.43

Stack Trace:
File "/home/jenkins/.buildout/eggs/plone.schemaeditor-2.0.9-py2.7.egg/plone/schemaeditor/tests/browser_testing.zcml", line 8.4-8.43
    ZopeXMLConfigurationError: File "/home/jenkins/.buildout/eggs/plone.schemaeditor-2.0.9-py2.7.egg/plone/schemaeditor/configure.zcml", line 8.4-8.39
    ZopeXMLConfigurationError: File "/home/jenkins/.buildout/eggs/plone.protect-3.0.18-py2.7.egg/plone/protect/configure.zcml", line 38.4-44.6
    ConfigurationError: ('Invalid value for', 'for', "ImportError: Couldn't import Products.CMFPlone.interfaces, No module named CMFPlone.interfaces")

  File "/usr/lib/python2.7/unittest/case.py", line 322, in run
    self.setUp()
  File "/usr/lib/python2.7/doctest.py", line 2194, in setUp
    self._dt_setUp(test)
  File "/home/jenkins/.buildout/eggs/Zope2-2.13.24-py2.7.egg/Testing/ZopeTestCase/zopedoctest/functional.py", line 262, in setUp
    kwsetUp(test_instance)
  File "/home/jenkins/.buildout/eggs/plone.schemaeditor-2.0.9-py2.7.egg/plone/schemaeditor/tests/tests.py", line 35, in setUp
    zcml.load_config('browser_testing.zcml', plone.schemaeditor.tests)
  File "/home/jenkins/.buildout/eggs/Zope2-2.13.24-py2.7.egg/Zope2/App/zcml.py", line 55, in load_config
    _context = xmlconfig.file(config, package, _context, execute=execute)
  File "/home/jenkins/.buildout/eggs/zope.configuration-3.7.4-py2.7.egg/zope/configuration/xmlconfig.py", line 649, in file
    include(context, name, package)
  File "/home/jenkins/.buildout/eggs/zope.configuration-3.7.4-py2.7.egg/zope/configuration/xmlconfig.py", line 548, in include
    processxmlfile(f, context)
  File "/home/jenkins/.buildout/eggs/zope.configuration-3.7.4-py2.7.egg/zope/configuration/xmlconfig.py", line 380, in processxmlfile
    parser.parse(src)
  File "/usr/lib/python2.7/xml/sax/expatreader.py", line 107, in parse
    xmlreader.IncrementalParser.parse(self, source)
  File "/usr/lib/python2.7/xml/sax/xmlreader.py", line 123, in parse
    self.feed(buffer)
  File "/usr/lib/python2.7/xml/sax/expatreader.py", line 210, in feed
    self._parser.Parse(data, isFinal)
  File "/usr/lib/python2.7/xml/sax/expatreader.py", line 352, in end_element_ns
    self._cont_handler.endElementNS(pair, None)
  File "/home/jenkins/.buildout/eggs/zope.configuration-3.7.4-py2.7.egg/zope/configuration/xmlconfig.py", line 359, in endElementNS
    self.context.end()
  File "/home/jenkins/.buildout/eggs/zope.configuration-3.7.4-py2.7.egg/zope/configuration/config.py", line 558, in end
    self.stack.pop().finish()
  File "/home/jenkins/.buildout/eggs/zope.configuration-3.7.4-py2.7.egg/zope/configuration/config.py", line 706, in finish
    actions = self.handler(context, **args)
  File "/home/jenkins/.buildout/eggs/zope.configuration-3.7.4-py2.7.egg/zope/configuration/xmlconfig.py", line 548, in include
    processxmlfile(f, context)
  File "/home/jenkins/.buildout/eggs/zope.configuration-3.7.4-py2.7.egg/zope/configuration/xmlconfig.py", line 380, in processxmlfile
    parser.parse(src)
  File "/usr/lib/python2.7/xml/sax/expatreader.py", line 107, in parse
    xmlreader.IncrementalParser.parse(self, source)
  File "/usr/lib/python2.7/xml/sax/xmlreader.py", line 123, in parse
    self.feed(buffer)
  File "/usr/lib/python2.7/xml/sax/expatreader.py", line 210, in feed
    self._parser.Parse(data, isFinal)
  File "/usr/lib/python2.7/xml/sax/expatreader.py", line 352, in end_element_ns
    self._cont_handler.endElementNS(pair, None)
  File "/home/jenkins/.buildout/eggs/zope.configuration-3.7.4-py2.7.egg/zope/configuration/xmlconfig.py", line 359, in endElementNS
    self.context.end()
  File "/home/jenkins/.buildout/eggs/zope.configuration-3.7.4-py2.7.egg/zope/configuration/config.py", line 558, in end
    self.stack.pop().finish()
  File "/home/jenkins/.buildout/eggs/zope.configuration-3.7.4-py2.7.egg/zope/configuration/config.py", line 706, in finish
    actions = self.handler(context, **args)
  File "/home/jenkins/.buildout/eggs/zope.configuration-3.7.4-py2.7.egg/zope/configuration/xmlconfig.py", line 548, in include
    processxmlfile(f, context)
  File "/home/jenkins/.buildout/eggs/zope.configuration-3.7.4-py2.7.egg/zope/configuration/xmlconfig.py", line 380, in processxmlfile
    parser.parse(src)
  File "/usr/lib/python2.7/xml/sax/expatreader.py", line 107, in parse
    xmlreader.IncrementalParser.parse(self, source)
  File "/usr/lib/python2.7/xml/sax/xmlreader.py", line 123, in parse
    self.feed(buffer)
  File "/usr/lib/python2.7/xml/sax/expatreader.py", line 210, in feed
    self._parser.Parse(data, isFinal)
  File "/usr/lib/python2.7/xml/sax/expatreader.py", line 352, in end_element_ns
    self._cont_handler.endElementNS(pair, None)
  File "/home/jenkins/.buildout/eggs/zope.configuration-3.7.4-py2.7.egg/zope/configuration/xmlconfig.py", line 359, in endElementNS
    self.context.end()
  File "/home/jenkins/.buildout/eggs/zope.configuration-3.7.4-py2.7.egg/zope/configuration/config.py", line 558, in end
    self.stack.pop().finish()
  File "/home/jenkins/.buildout/eggs/zope.configuration-3.7.4-py2.7.egg/zope/configuration/config.py", line 705, in finish
    args = toargs(context, *self.argdata)
  File "/home/jenkins/.buildout/eggs/zope.configuration-3.7.4-py2.7.egg/zope/configuration/config.py", line 1397, in toargs
    args[str(name)] = field.fromUnicode(s)
  File "/home/jenkins/.buildout/eggs/zope.configuration-3.7.4-py2.7.egg/zope/configuration/fields.py", line 139, in fromUnicode
    raise schema.ValidationError(v)


FAILED:  plone.schemaeditor.tests.minmax.txt

Error Message:
File "/home/jenkins/.buildout/eggs/plone.schemaeditor-2.0.9-py2.7.egg/plone/schemaeditor/tests/browser_testing.zcml", line 8.4-8.43

Stack Trace:
File "/home/jenkins/.buildout/eggs/plone.schemaeditor-2.0.9-py2.7.egg/plone/schemaeditor/tests/browser_testing.zcml", line 8.4-8.43
    ZopeXMLConfigurationError: File "/home/jenkins/.buildout/eggs/plone.schemaeditor-2.0.9-py2.7.egg/plone/schemaeditor/configure.zcml", line 8.4-8.39
    ZopeXMLConfigurationError: File "/home/jenkins/.buildout/eggs/plone.protect-3.0.18-py2.7.egg/plone/protect/configure.zcml", line 38.4-44.6
    ConfigurationError: ('Invalid value for', 'for', "ImportError: Couldn't import Products.CMFPlone.interfaces, No module named CMFPlone.interfaces")

  File "/usr/lib/python2.7/unittest/case.py", line 322, in run
    self.setUp()
  File "/usr/lib/python2.7/doctest.py", line 2194, in setUp
    self._dt_setUp(test)
  File "/home/jenkins/.buildout/eggs/Zope2-2.13.24-py2.7.egg/Testing/ZopeTestCase/zopedoctest/functional.py", line 262, in setUp
    kwsetUp(test_instance)
  File "/home/jenkins/.buildout/eggs/plone.schemaeditor-2.0.9-py2.7.egg/plone/schemaeditor/tests/tests.py", line 35, in setUp
    zcml.load_config('browser_testing.zcml', plone.schemaeditor.tests)
  File "/home/jenkins/.buildout/eggs/Zope2-2.13.24-py2.7.egg/Zope2/App/zcml.py", line 55, in load_config
    _context = xmlconfig.file(config, package, _context, execute=execute)
  File "/home/jenkins/.buildout/eggs/zope.configuration-3.7.4-py2.7.egg/zope/configuration/xmlconfig.py", line 649, in file
    include(context, name, package)
  File "/home/jenkins/.buildout/eggs/zope.configuration-3.7.4-py2.7.egg/zope/configuration/xmlconfig.py", line 548, in include
    processxmlfile(f, context)
  File "/home/jenkins/.buildout/eggs/zope.configuration-3.7.4-py2.7.egg/zope/configuration/xmlconfig.py", line 380, in processxmlfile
    parser.parse(src)
  File "/usr/lib/python2.7/xml/sax/expatreader.py", line 107, in parse
    xmlreader.IncrementalParser.parse(self, source)
  File "/usr/lib/python2.7/xml/sax/xmlreader.py", line 123, in parse
    self.feed(buffer)
  File "/usr/lib/python2.7/xml/sax/expatreader.py", line 210, in feed
    self._parser.Parse(data, isFinal)
  File "/usr/lib/python2.7/xml/sax/expatreader.py", line 352, in end_element_ns
    self._cont_handler.endElementNS(pair, None)
  File "/home/jenkins/.buildout/eggs/zope.configuration-3.7.4-py2.7.egg/zope/configuration/xmlconfig.py", line 359, in endElementNS
    self.context.end()
  File "/home/jenkins/.buildout/eggs/zope.configuration-3.7.4-py2.7.egg/zope/configuration/config.py", line 558, in end
    self.stack.pop().finish()
  File "/home/jenkins/.buildout/eggs/zope.configuration-3.7.4-py2.7.egg/zope/configuration/config.py", line 706, in finish
    actions = self.handler(context, **args)
  File "/home/jenkins/.buildout/eggs/zope.configuration-3.7.4-py2.7.egg/zope/configuration/xmlconfig.py", line 548, in include
    processxmlfile(f, context)
  File "/home/jenkins/.buildout/eggs/zope.configuration-3.7.4-py2.7.egg/zope/configuration/xmlconfig.py", line 380, in processxmlfile
    parser.parse(src)
  File "/usr/lib/python2.7/xml/sax/expatreader.py", line 107, in parse
    xmlreader.IncrementalParser.parse(self, source)
  File "/usr/lib/python2.7/xml/sax/xmlreader.py", line 123, in parse
    self.feed(buffer)
  File "/usr/lib/python2.7/xml/sax/expatreader.py", line 210, in feed
    self._parser.Parse(data, isFinal)
  File "/usr/lib/python2.7/xml/sax/expatreader.py", line 352, in end_element_ns
    self._cont_handler.endElementNS(pair, None)
  File "/home/jenkins/.buildout/eggs/zope.configuration-3.7.4-py2.7.egg/zope/configuration/xmlconfig.py", line 359, in endElementNS
    self.context.end()
  File "/home/jenkins/.buildout/eggs/zope.configuration-3.7.4-py2.7.egg/zope/configuration/config.py", line 558, in end
    self.stack.pop().finish()
  File "/home/jenkins/.buildout/eggs/zope.configuration-3.7.4-py2.7.egg/zope/configuration/config.py", line 706, in finish
    actions = self.handler(context, **args)
  File "/home/jenkins/.buildout/eggs/zope.configuration-3.7.4-py2.7.egg/zope/configuration/xmlconfig.py", line 548, in include
    processxmlfile(f, context)
  File "/home/jenkins/.buildout/eggs/zope.configuration-3.7.4-py2.7.egg/zope/configuration/xmlconfig.py", line 380, in processxmlfile
    parser.parse(src)
  File "/usr/lib/python2.7/xml/sax/expatreader.py", line 107, in parse
    xmlreader.IncrementalParser.parse(self, source)
  File "/usr/lib/python2.7/xml/sax/xmlreader.py", line 123, in parse
    self.feed(buffer)
  File "/usr/lib/python2.7/xml/sax/expatreader.py", line 210, in feed
    self._parser.Parse(data, isFinal)
  File "/usr/lib/python2.7/xml/sax/expatreader.py", line 352, in end_element_ns
    self._cont_handler.endElementNS(pair, None)
  File "/home/jenkins/.buildout/eggs/zope.configuration-3.7.4-py2.7.egg/zope/configuration/xmlconfig.py", line 359, in endElementNS
    self.context.end()
  File "/home/jenkins/.buildout/eggs/zope.configuration-3.7.4-py2.7.egg/zope/configuration/config.py", line 558, in end
    self.stack.pop().finish()
  File "/home/jenkins/.buildout/eggs/zope.configuration-3.7.4-py2.7.egg/zope/configuration/config.py", line 705, in finish
    args = toargs(context, *self.argdata)
  File "/home/jenkins/.buildout/eggs/zope.configuration-3.7.4-py2.7.egg/zope/configuration/config.py", line 1397, in toargs
    args[str(name)] = field.fromUnicode(s)
  File "/home/jenkins/.buildout/eggs/zope.configuration-3.7.4-py2.7.egg/zope/configuration/fields.py", line 139, in fromUnicode
    raise schema.ValidationError(v)


FAILED:  plone.app.folder.tests.test_integration.Startup

Error Message:
No module named CMFPlone.utils

Stack Trace:
No module named CMFPlone.utils

  File "/home/jenkins/.buildout/eggs/plone.app.folder-1.2.0-py2.7.egg/plone/app/folder/tests/test_integration.py", line 2, in <module>
    from plone.app.folder.tests.base import IntegrationTestCase
  File "/home/jenkins/.buildout/eggs/plone.app.folder-1.2.0-py2.7.egg/plone/app/folder/tests/base.py", line 2, in <module>
    from plone.app.testing.bbb import PloneTestCase
  File "/home/jenkins/.buildout/eggs/plone.app.testing-5.0.1-py2.7.egg/plone/app/testing/bbb.py", line 7, in <module>
    from Products.CMFPlone.utils import _createObjectByType


FAILED:  plone.app.folder.tests.test_migration.Startup

Error Message:
No module named CMFPlone.log

Stack Trace:
No module named CMFPlone.log

  File "/home/jenkins/.buildout/eggs/plone.app.folder-1.2.0-py2.7.egg/plone/app/folder/tests/test_migration.py", line 4, in <module>
    from Products.ATContentTypes.content.document import ATDocument
  File "/home/jenkins/.buildout/eggs/Products.ATContentTypes-2.2.11-py2.7.egg/Products/ATContentTypes/__init__.py", line 33, in <module>
    import Products.ATContentTypes.content  # noqa
  File "/home/jenkins/.buildout/eggs/Products.ATContentTypes-2.2.11-py2.7.egg/Products/ATContentTypes/content/__init__.py", line 2, in <module>
    import Products.ATContentTypes.content.link  # noqa
  File "/home/jenkins/.buildout/eggs/Products.ATContentTypes-2.2.11-py2.7.egg/Products/ATContentTypes/content/link.py", line 3, in <module>
    from Products.Archetypes.atapi import Schema
  File "/home/jenkins/.buildout/eggs/Products.Archetypes-1.10.13-py2.7.egg/Products/Archetypes/atapi.py", line 33, in <module>
    from Products.Archetypes.BaseContent import BaseContent
  File "/home/jenkins/.buildout/eggs/Products.Archetypes-1.10.13-py2.7.egg/Products/Archetypes/BaseContent.py", line 3, in <module>
    from Products.Archetypes.ExtensibleMetadata import ExtensibleMetadata
  File "/home/jenkins/.buildout/eggs/Products.Archetypes-1.10.13-py2.7.egg/Products/Archetypes/ExtensibleMetadata.py", line 27, in <module>
    from Products.CMFPlone.log import log_deprecated


FAILED:  plone.app.folder.tests.test_nextprevious.Startup

Error Message:
No module named CMFPlone.utils

Stack Trace:
No module named CMFPlone.utils

  File "/home/jenkins/.buildout/eggs/plone.app.folder-1.2.0-py2.7.egg/plone/app/folder/tests/test_nextprevious.py", line 3, in <module>
    from plone.app.folder.tests.base import IntegrationTestCase
  File "/home/jenkins/.buildout/eggs/plone.app.folder-1.2.0-py2.7.egg/plone/app/folder/tests/base.py", line 2, in <module>
    from plone.app.testing.bbb import PloneTestCase
  File "/home/jenkins/.buildout/eggs/plone.app.testing-5.0.1-py2.7.egg/plone/app/testing/bbb.py", line 7, in <module>
    from Products.CMFPlone.utils import _createObjectByType


FAILED:  plone.app.folder.tests.test_nogopip.Startup

Error Message:
No module named CMFPlone.utils

Stack Trace:
No module named CMFPlone.utils

  File "/home/jenkins/.buildout/eggs/plone.app.folder-1.2.0-py2.7.egg/plone/app/folder/tests/test_nogopip.py", line 1, in <module>
    from plone.app.folder.tests.base import IntegrationTestCase
  File "/home/jenkins/.buildout/eggs/plone.app.folder-1.2.0-py2.7.egg/plone/app/folder/tests/base.py", line 2, in <module>
    from plone.app.testing.bbb import PloneTestCase
  File "/home/jenkins/.buildout/eggs/plone.app.testing-5.0.1-py2.7.egg/plone/app/testing/bbb.py", line 7, in <module>
    from Products.CMFPlone.utils import _createObjectByType


FAILED:  plone.app.folder.tests.test_partialordering_integration.Startup

Error Message:
No module named CMFPlone.log

Stack Trace:
No module named CMFPlone.log

  File "/home/jenkins/.buildout/eggs/plone.app.folder-1.2.0-py2.7.egg/plone/app/folder/tests/test_partialordering_integration.py", line 2, in <module>
    from Products.ATContentTypes.content.document import ATDocument
  File "/home/jenkins/.buildout/eggs/Products.ATContentTypes-2.2.11-py2.7.egg/Products/ATContentTypes/__init__.py", line 33, in <module>
    import Products.ATContentTypes.content  # noqa
  File "/home/jenkins/.buildout/eggs/Products.ATContentTypes-2.2.11-py2.7.egg/Products/ATContentTypes/content/__init__.py", line 2, in <module>
    import Products.ATContentTypes.content.link  # noqa
  File "/home/jenkins/.buildout/eggs/Products.ATContentTypes-2.2.11-py2.7.egg/Products/ATContentTypes/content/link.py", line 3, in <module>
    from Products.Archetypes.atapi import Schema
  File "/home/jenkins/.buildout/eggs/Products.Archetypes-1.10.13-py2.7.egg/Products/Archetypes/atapi.py", line 33, in <module>
    from Products.Archetypes.BaseContent import BaseContent
  File "/home/jenkins/.buildout/eggs/Products.Archetypes-1.10.13-py2.7.egg/Products/Archetypes/BaseContent.py", line 3, in <module>
    from Products.Archetypes.ExtensibleMetadata import ExtensibleMetadata
  File "/home/jenkins/.buildout/eggs/Products.Archetypes-1.10.13-py2.7.egg/Products/Archetypes/ExtensibleMetadata.py", line 27, in <module>
    from Products.CMFPlone.log import log_deprecated


FAILED:  plone.app.folder.tests.test_unorderedordering_integration.Startup

Error Message:
No module named CMFPlone.utils

Stack Trace:
No module named CMFPlone.utils

  File "/home/jenkins/.buildout/eggs/plone.app.folder-1.2.0-py2.7.egg/plone/app/folder/tests/test_unorderedordering_integration.py", line 2, in <module>
    from plone.app.folder.tests.base import IntegrationTestCase
  File "/home/jenkins/.buildout/eggs/plone.app.folder-1.2.0-py2.7.egg/plone/app/folder/tests/base.py", line 2, in <module>
    from plone.app.testing.bbb import PloneTestCase
  File "/home/jenkins/.buildout/eggs/plone.app.testing-5.0.1-py2.7.egg/plone/app/testing/bbb.py", line 7, in <module>
    from Products.CMFPlone.utils import _createObjectByType


FAILED:  plone.app.multilingual.tests.test_alternates.Startup

Error Message:
No module named CMFPlone.interfaces

Stack Trace:
No module named CMFPlone.interfaces

  File "/home/jenkins/workspace/plone-5.0-python-2.7/src/plone.app.multilingual/src/plone/app/multilingual/tests/test_alternates.py", line 2, in <module>
    from plone.app.multilingual import api
  File "/home/jenkins/workspace/plone-5.0-python-2.7/src/plone.app.multilingual/src/plone/app/multilingual/api.py", line 2, in <module>
    from plone.app.multilingual.interfaces import ITG
  File "/home/jenkins/workspace/plone-5.0-python-2.7/src/plone.app.multilingual/src/plone/app/multilingual/interfaces.py", line 8, in <module>
    from Products.CMFPlone.interfaces import ILanguageSchema


FAILED:  plone.app.multilingual.tests.test_api.Startup

Error Message:
No module named CMFPlone.interfaces

Stack Trace:
No module named CMFPlone.interfaces

  File "/home/jenkins/workspace/plone-5.0-python-2.7/src/plone.app.multilingual/src/plone/app/multilingual/tests/test_api.py", line 4, in <module>
    from plone.app.multilingual import api
  File "/home/jenkins/workspace/plone-5.0-python-2.7/src/plone.app.multilingual/src/plone/app/multilingual/api.py", line 2, in <module>
    from plone.app.multilingual.interfaces import ITG
  File "/home/jenkins/workspace/plone-5.0-python-2.7/src/plone.app.multilingual/src/plone/app/multilingual/interfaces.py", line 8, in <module>
    from Products.CMFPlone.interfaces import ILanguageSchema


FAILED:  plone.app.multilingual.tests.test_catalog.Startup

Error Message:
No module named CMFPlone.interfaces

Stack Trace:
No module named CMFPlone.interfaces

  File "/home/jenkins/workspace/plone-5.0-python-2.7/src/plone.app.multilingual/src/plone/app/multilingual/tests/test_catalog.py", line 3, in <module>
    from plone.app.multilingual.interfaces import LANGUAGE_INDEPENDENT
  File "/home/jenkins/workspace/plone-5.0-python-2.7/src/plone.app.multilingual/src/plone/app/multilingual/interfaces.py", line 8, in <module>
    from Products.CMFPlone.interfaces import ILanguageSchema


FAILED:  plone.app.multilingual.tests.test_directives.Startup

Error Message:
No module named CMFPlone.interfaces

Stack Trace:
No module named CMFPlone.interfaces

  File "/home/jenkins/workspace/plone-5.0-python-2.7/src/plone.app.multilingual/src/plone/app/multilingual/tests/test_directives.py", line 2, in <module>
    from plone.app.multilingual.dx.directives import languageindependent
  File "/home/jenkins/workspace/plone-5.0-python-2.7/src/plone.app.multilingual/src/plone/app/multilingual/dx/directives.py", line 2, in <module>
    from plone.app.multilingual.dx.interfaces import ILanguageIndependentField
  File "/home/jenkins/workspace/plone-5.0-python-2.7/src/plone.app.multilingual/src/plone/app/multilingual/dx/interfaces.py", line 2, in <module>
    from plone.app.multilingual.interfaces import ITranslatable
  File "/home/jenkins/workspace/plone-5.0-python-2.7/src/plone.app.multilingual/src/plone/app/multilingual/interfaces.py", line 8, in <module>
    from Products.CMFPlone.interfaces import ILanguageSchema


FAILED:  plone.app.multilingual.tests.test_form.Startup

Error Message:
No module named CMFPlone.utils

Stack Trace:
No module named CMFPlone.utils

  File "/home/jenkins/workspace/plone-5.0-python-2.7/src/plone.app.multilingual/src/plone/app/multilingual/tests/test_form.py", line 2, in <module>
    from plone.app.multilingual.testing import PAM_FUNCTIONAL_TESTING
  File "/home/jenkins/workspace/plone-5.0-python-2.7/src/plone.app.multilingual/src/plone/app/multilingual/testing.py", line 5, in <module>
    from plone.app.contenttypes.testing import PLONE_APP_CONTENTTYPES_FIXTURE
  File "/home/jenkins/workspace/plone-5.0-python-2.7/src/plone.app.contenttypes/plone/app/contenttypes/testing.py", line 4, in <module>
    from plone.app.event.testing import PAEvent_FIXTURE
  File "/home/jenkins/workspace/plone-5.0-python-2.7/src/plone.app.event/plone/app/event/testing.py", line 1, in <module>
    from Products.CMFPlone.utils import getFSVersionTuple


FAILED:  plone.app.multilingual.tests.test_helper_views.Startup

Error Message:
No module named CMFPlone.interfaces

Stack Trace:
No module named CMFPlone.interfaces

  File "/home/jenkins/workspace/plone-5.0-python-2.7/src/plone.app.multilingual/src/plone/app/multilingual/tests/test_helper_views.py", line 2, in <module>
    from plone.app.multilingual import api
  File "/home/jenkins/workspace/plone-5.0-python-2.7/src/plone.app.multilingual/src/plone/app/multilingual/api.py", line 2, in <module>
    from plone.app.multilingual.interfaces import ITG
  File "/home/jenkins/workspace/plone-5.0-python-2.7/src/plone.app.multilingual/src/plone/app/multilingual/interfaces.py", line 8, in <module>
    from Products.CMFPlone.interfaces import ILanguageSchema


FAILED:  plone.app.multilingual.tests.test_lif.Startup

Error Message:
No module named CMFPlone.interfaces

Stack Trace:
No module named CMFPlone.interfaces

  File "/home/jenkins/workspace/plone-5.0-python-2.7/src/plone.app.multilingual/src/plone/app/multilingual/tests/test_lif.py", line 3, in <module>
    from plone.app.multilingual import api
  File "/home/jenkins/workspace/plone-5.0-python-2.7/src/plone.app.multilingual/src/plone/app/multilingual/api.py", line 2, in <module>
    from plone.app.multilingual.interfaces import ITG
  File "/home/jenkins/workspace/plone-5.0-python-2.7/src/plone.app.multilingual/src/plone/app/multilingual/interfaces.py", line 8, in <module>
    from Products.CMFPlone.interfaces import ILanguageSchema


FAILED:  plone.app.multilingual.tests.test_lrf.Startup

Error Message:
No module named CMFPlone.interfaces

Stack Trace:
No module named CMFPlone.interfaces

  File "/home/jenkins/workspace/plone-5.0-python-2.7/src/plone.app.multilingual/src/plone/app/multilingual/tests/test_lrf.py", line 3, in <module>
    from plone.app.multilingual.browser.utils import is_language_independent
  File "/home/jenkins/workspace/plone-5.0-python-2.7/src/plone.app.multilingual/src/plone/app/multilingual/browser/utils.py", line 9, in <module>
    from plone.app.multilingual.browser.selector import LanguageSelectorViewlet
  File "/home/jenkins/workspace/plone-5.0-python-2.7/src/plone.app.multilingual/src/plone/app/multilingual/browser/selector.py", line 4, in <module>
    from plone.app.multilingual.interfaces import ITG
  File "/home/jenkins/workspace/plone-5.0-python-2.7/src/plone.app.multilingual/src/plone/app/multilingual/interfaces.py", line 8, in <module>
    from Products.CMFPlone.interfaces import ILanguageSchema


FAILED:  plone.app.multilingual.tests.test_menu.Startup

Error Message:
No module named CMFPlone.utils

Stack Trace:
No module named CMFPlone.utils

  File "/home/jenkins/workspace/plone-5.0-python-2.7/src/plone.app.multilingual/src/plone/app/multilingual/tests/test_menu.py", line 2, in <module>
    from plone.app.multilingual.testing import PAM_FUNCTIONAL_TESTING
  File "/home/jenkins/workspace/plone-5.0-python-2.7/src/plone.app.multilingual/src/plone/app/multilingual/testing.py", line 5, in <module>
    from plone.app.contenttypes.testing import PLONE_APP_CONTENTTYPES_FIXTURE
  File "/home/jenkins/workspace/plone-5.0-python-2.7/src/plone.app.contenttypes/plone/app/contenttypes/testing.py", line 4, in <module>
    from plone.app.event.testing import PAEvent_FIXTURE
  File "/home/jenkins/workspace/plone-5.0-python-2.7/src/plone.app.event/plone/app/event/testing.py", line 1, in <module>
    from Products.CMFPlone.utils import getFSVersionTuple


FAILED:  plone.app.multilingual.tests.test_robot.Startup

Error Message:
No module named CMFPlone.utils

Stack Trace:
No module named CMFPlone.utils

  File "/home/jenkins/workspace/plone-5.0-python-2.7/src/plone.app.multilingual/src/plone/app/multilingual/tests/test_robot.py", line 2, in <module>
    from plone.app.multilingual.testing import PAM_ROBOT_TESTING
  File "/home/jenkins/workspace/plone-5.0-python-2.7/src/plone.app.multilingual/src/plone/app/multilingual/testing.py", line 5, in <module>
    from plone.app.contenttypes.testing import PLONE_APP_CONTENTTYPES_FIXTURE
  File "/home/jenkins/workspace/plone-5.0-python-2.7/src/plone.app.contenttypes/plone/app/contenttypes/testing.py", line 4, in <module>
    from plone.app.event.testing import PAEvent_FIXTURE
  File "/home/jenkins/workspace/plone-5.0-python-2.7/src/plone.app.event/plone/app/event/testing.py", line 1, in <module>
    from Products.CMFPlone.utils import getFSVersionTuple


FAILED:  plone.app.multilingual.tests.test_selector.Startup

Error Message:
No module named CMFPlone.interfaces

Stack Trace:
No module named CMFPlone.interfaces

  File "/home/jenkins/workspace/plone-5.0-python-2.7/src/plone.app.multilingual/src/plone/app/multilingual/tests/test_selector.py", line 4, in <module>
    from plone.app.multilingual import api
  File "/home/jenkins/workspace/plone-5.0-python-2.7/src/plone.app.multilingual/src/plone/app/multilingual/api.py", line 2, in <module>
    from plone.app.multilingual.interfaces import ITG
  File "/home/jenkins/workspace/plone-5.0-python-2.7/src/plone.app.multilingual/src/plone/app/multilingual/interfaces.py", line 8, in <module>
    from Products.CMFPlone.interfaces import ILanguageSchema


FAILED:  plone.app.multilingual.tests.test_setup.Startup

Error Message:
No module named CMFPlone.utils

Stack Trace:
No module named CMFPlone.utils

  File "/home/jenkins/workspace/plone-5.0-python-2.7/src/plone.app.multilingual/src/plone/app/multilingual/tests/test_setup.py", line 3, in <module>
    from plone.app.multilingual.browser.setup import SetupMultilingualSite
  File "/home/jenkins/workspace/plone-5.0-python-2.7/src/plone.app.multilingual/src/plone/app/multilingual/browser/setup.py", line 3, in <module>
    from Products.CMFPlone.utils import _createObjectByType


FAILED:  plone.app.multilingual.tests.test_subscribers.Startup

Error Message:
No module named CMFPlone.interfaces

Stack Trace:
No module named CMFPlone.interfaces

  File "/home/jenkins/workspace/plone-5.0-python-2.7/src/plone.app.multilingual/src/plone/app/multilingual/tests/test_subscribers.py", line 4, in <module>
    from Products.CMFPlone.interfaces import ILanguage


FAILED:  plone.app.multilingual.tests.test_vocabularies.Startup

Error Message:
No module named CMFPlone.interfaces

Stack Trace:
No module named CMFPlone.interfaces

  File "/home/jenkins/workspace/plone-5.0-python-2.7/src/plone.app.multilingual/src/plone/app/multilingual/tests/test_vocabularies.py", line 3, in <module>
    from plone.app.multilingual import api
  File "/home/jenkins/workspace/plone-5.0-python-2.7/src/plone.app.multilingual/src/plone/app/multilingual/api.py", line 2, in <module>
    from plone.app.multilingual.interfaces import ITG
  File "/home/jenkins/workspace/plone-5.0-python-2.7/src/plone.app.multilingual/src/plone/app/multilingual/interfaces.py", line 8, in <module>
    from Products.CMFPlone.interfaces import ILanguageSchema


FAILED:  plone.app.versioningbehavior.tests.test_IntegrationTests.Startup

Error Message:
No module named CMFPlone.utils

Stack Trace:
No module named CMFPlone.utils

  File "/home/jenkins/.buildout/eggs/plone.app.versioningbehavior-1.2.7-py2.7.egg/plone/app/versioningbehavior/tests/test_IntegrationTests.py", line 4, in <module>
    from Products.CMFEditions.tests import test_IntegrationTests
  File "/home/jenkins/.buildout/eggs/Products.CMFEditions-2.2.19-py2.7.egg/Products/CMFEditions/tests/test_IntegrationTests.py", line 36, in <module>
    from Products.CMFEditions.tests.base import CMFEditionsBaseTestCase
  File "/home/jenkins/.buildout/eggs/Products.CMFEditions-2.2.19-py2.7.egg/Products/CMFEditions/tests/base.py", line 1, in <module>
    from plone.app.testing.bbb import PloneTestCase
  File "/home/jenkins/.buildout/eggs/plone.app.testing-5.0.1-py2.7.egg/plone/app/testing/bbb.py", line 7, in <module>
    from Products.CMFPlone.utils import _createObjectByType


FAILED:  plone.app.versioningbehavior.tests.test_functional.Startup

Error Message:
No module named CMFPlone.utils

Stack Trace:
No module named CMFPlone.utils

  File "/home/jenkins/.buildout/eggs/plone.app.versioningbehavior-1.2.7-py2.7.egg/plone/app/versioningbehavior/tests/test_functional.py", line 6, in <module>
    from plone.app.versioningbehavior.testing import TEST_CONTENT_TYPE_ID
  File "/home/jenkins/.buildout/eggs/plone.app.versioningbehavior-1.2.7-py2.7.egg/plone/app/versioningbehavior/testing.py", line 8, in <module>
    from Products.CMFDiffTool.TextDiff import TextDiff
  File "/home/jenkins/.buildout/eggs/Products.CMFDiffTool-3.0.4-py2.7.egg/Products/CMFDiffTool/__init__.py", line 8, in <module>
    from Products.CMFDiffTool import CMFDiffTool  # NOQA
  File "/home/jenkins/.buildout/eggs/Products.CMFDiffTool-3.0.4-py2.7.egg/Products/CMFDiffTool/CMFDiffTool.py", line 15, in <module>
    from Products.CMFPlone.utils import safe_hasattr


FAILED:  plone.app.versioningbehavior.tests.test_modifiers.Startup

Error Message:
No module named CMFPlone.utils

Stack Trace:
No module named CMFPlone.utils

  File "/home/jenkins/.buildout/eggs/plone.app.versioningbehavior-1.2.7-py2.7.egg/plone/app/versioningbehavior/tests/test_modifiers.py", line 10, in <module>
    from Products.CMFEditions.tests.base import CMFEditionsBaseTestCase
  File "/home/jenkins/.buildout/eggs/Products.CMFEditions-2.2.19-py2.7.egg/Products/CMFEditions/tests/base.py", line 1, in <module>
    from plone.app.testing.bbb import PloneTestCase
  File "/home/jenkins/.buildout/eggs/plone.app.testing-5.0.1-py2.7.egg/plone/app/testing/bbb.py", line 7, in <module>
    from Products.CMFPlone.utils import _createObjectByType


FAILED:  plone.app.versioningbehavior.tests.tests.Startup

Error Message:
No module named CMFPlone.utils

Stack Trace:
No module named CMFPlone.utils

  File "/home/jenkins/.buildout/eggs/plone.app.versioningbehavior-1.2.7-py2.7.egg/plone/app/versioningbehavior/tests/tests.py", line 2, in <module>
    from plone.app.versioningbehavior.testing import VERSIONING_FUNCTIONAL_TESTING
  File "/home/jenkins/.buildout/eggs/plone.app.versioningbehavior-1.2.7-py2.7.egg/plone/app/versioningbehavior/testing.py", line 8, in <module>
    from Products.CMFDiffTool.TextDiff import TextDiff
  File "/home/jenkins/.buildout/eggs/Products.CMFDiffTool-3.0.4-py2.7.egg/Products/CMFDiffTool/__init__.py", line 8, in <module>
    from Products.CMFDiffTool import CMFDiffTool  # NOQA
  File "/home/jenkins/.buildout/eggs/Products.CMFDiffTool-3.0.4-py2.7.egg/Products/CMFDiffTool/CMFDiffTool.py", line 15, in <module>
    from Products.CMFPlone.utils import safe_hasattr


FAILED:  plone.app.widgets.tests.test_robot.Startup

Error Message:
No module named CMFPlone.utils

Stack Trace:
No module named CMFPlone.utils

  File "/home/jenkins/.buildout/eggs/plone.app.widgets-2.0.4-py2.7.egg/plone/app/widgets/tests/test_robot.py", line 1, in <module>
    from plone.app.widgets.testing import PLONEAPPWIDGETS_DX_ROBOT_TESTING
  File "/home/jenkins/.buildout/eggs/plone.app.widgets-2.0.4-py2.7.egg/plone/app/widgets/testing.py", line 5, in <module>
    from plone.app.robotframework.testing import REMOTE_LIBRARY_BUNDLE_FIXTURE
  File "/home/jenkins/.buildout/eggs/plone.app.robotframework-0.9.15-py2.7.egg/plone/app/robotframework/__init__.py", line 17, in <module>
    from plone.app.robotframework.content import Content
  File "/home/jenkins/.buildout/eggs/plone.app.robotframework-0.9.15-py2.7.egg/plone/app/robotframework/content.py", line 21, in <module>
    from plone.app.textfield.value import RichTextValue
  File "/home/jenkins/.buildout/eggs/plone.app.textfield-1.2.6-py2.7.egg/plone/app/textfield/__init__.py", line 2, in <module>
    from plone.app.textfield.value import RichTextValue
  File "/home/jenkins/.buildout/eggs/plone.app.textfield-1.2.6-py2.7.egg/plone/app/textfield/value.py", line 1, in <module>
    from Products.CMFPlone.utils import safe_unicode


FAILED:  plone.locking.tests.Startup

Error Message:
No module named CMFPlone.utils

Stack Trace:
No module named CMFPlone.utils

  File "/home/jenkins/.buildout/eggs/plone.locking-2.1.1-py2.7.egg/plone/locking/tests.py", line 7, in <module>
    from plone.app.testing.bbb import PTC_FUNCTIONAL_TESTING
  File "/home/jenkins/.buildout/eggs/plone.app.testing-5.0.1-py2.7.egg/plone/app/testing/bbb.py", line 7, in <module>
    from Products.CMFPlone.utils import _createObjectByType


FAILED:  plone.schemaeditor.tests.test_robot.Startup

Error Message:
No module named CMFPlone.utils

Stack Trace:
No module named CMFPlone.utils

  File "/home/jenkins/.buildout/eggs/plone.schemaeditor-2.0.9-py2.7.egg/plone/schemaeditor/tests/test_robot.py", line 3, in <module>
    from plone.schemaeditor.testing import ACCEPTANCE
  File "/home/jenkins/.buildout/eggs/plone.schemaeditor-2.0.9-py2.7.egg/plone/schemaeditor/testing.py", line 4, in <module>
    from plone.app.robotframework.testing import AUTOLOGIN_LIBRARY_FIXTURE
  File "/home/jenkins/.buildout/eggs/plone.app.robotframework-0.9.15-py2.7.egg/plone/app/robotframework/__init__.py", line 17, in <module>
    from plone.app.robotframework.content import Content
  File "/home/jenkins/.buildout/eggs/plone.app.robotframework-0.9.15-py2.7.egg/plone/app/robotframework/content.py", line 21, in <module>
    from plone.app.textfield.value import RichTextValue
  File "/home/jenkins/.buildout/eggs/plone.app.textfield-1.2.6-py2.7.egg/plone/app/textfield/__init__.py", line 2, in <module>
    from plone.app.textfield.value import RichTextValue
  File "/home/jenkins/.buildout/eggs/plone.app.textfield-1.2.6-py2.7.egg/plone/app/textfield/value.py", line 1, in <module>
    from Products.CMFPlone.utils import safe_unicode


FAILED:  plone.session.tests.testPAS.TestSessionPlugin.testCookieHTTPOnly

Error Message:
File "/home/jenkins/.buildout/eggs/plone.session-3.5.6-py2.7.egg/plone/session/configure.zcml", line 11.2-11.37

Stack Trace:
File "/home/jenkins/.buildout/eggs/plone.session-3.5.6-py2.7.egg/plone/session/configure.zcml", line 11.2-11.37
    ZopeXMLConfigurationError: File "/home/jenkins/.buildout/eggs/plone.protect-3.0.18-py2.7.egg/plone/protect/configure.zcml", line 38.4-44.6
    ConfigurationError: ('Invalid value for', 'for', "ImportError: Couldn't import Products.CMFPlone.interfaces, No module named CMFPlone.interfaces")

  File "/usr/lib/python2.7/unittest/case.py", line 322, in run
    self.setUp()
  File "/home/jenkins/.buildout/eggs/Zope2-2.13.24-py2.7.egg/Testing/ZopeTestCase/base.py", line 91, in setUp
    self.afterSetUp()
  File "/home/jenkins/.buildout/eggs/plone.session-3.5.6-py2.7.egg/plone/session/tests/sessioncase.py", line 33, in afterSetUp
    zcml.load_config('configure.zcml', plone.session)
  File "/home/jenkins/.buildout/eggs/Zope2-2.13.24-py2.7.egg/Zope2/App/zcml.py", line 55, in load_config
    _context = xmlconfig.file(config, package, _context, execute=execute)
  File "/home/jenkins/.buildout/eggs/zope.configuration-3.7.4-py2.7.egg/zope/configuration/xmlconfig.py", line 649, in file
    include(context, name, package)
  File "/home/jenkins/.buildout/eggs/zope.configuration-3.7.4-py2.7.egg/zope/configuration/xmlconfig.py", line 548, in include
    processxmlfile(f, context)
  File "/home/jenkins/.buildout/eggs/zope.configuration-3.7.4-py2.7.egg/zope/configuration/xmlconfig.py", line 380, in processxmlfile
    parser.parse(src)
  File "/usr/lib/python2.7/xml/sax/expatreader.py", line 107, in parse
    xmlreader.IncrementalParser.parse(self, source)
  File "/usr/lib/python2.7/xml/sax/xmlreader.py", line 123, in parse
    self.feed(buffer)
  File "/usr/lib/python2.7/xml/sax/expatreader.py", line 210, in feed
    self._parser.Parse(data, isFinal)
  File "/usr/lib/python2.7/xml/sax/expatreader.py", line 352, in end_element_ns
    self._cont_handler.endElementNS(pair, None)
  File "/home/jenkins/.buildout/eggs/zope.configuration-3.7.4-py2.7.egg/zope/configuration/xmlconfig.py", line 359, in endElementNS
    self.context.end()
  File "/home/jenkins/.buildout/eggs/zope.configuration-3.7.4-py2.7.egg/zope/configuration/config.py", line 558, in end
    self.stack.pop().finish()
  File "/home/jenkins/.buildout/eggs/zope.configuration-3.7.4-py2.7.egg/zope/configuration/config.py", line 706, in finish
    actions = self.handler(context, **args)
  File "/home/jenkins/.buildout/eggs/zope.configuration-3.7.4-py2.7.egg/zope/configuration/xmlconfig.py", line 548, in include
    processxmlfile(f, context)
  File "/home/jenkins/.buildout/eggs/zope.configuration-3.7.4-py2.7.egg/zope/configuration/xmlconfig.py", line 380, in processxmlfile
    parser.parse(src)
  File "/usr/lib/python2.7/xml/sax/expatreader.py", line 107, in parse
    xmlreader.IncrementalParser.parse(self, source)
  File "/usr/lib/python2.7/xml/sax/xmlreader.py", line 123, in parse
    self.feed(buffer)
  File "/usr/lib/python2.7/xml/sax/expatreader.py", line 210, in feed
    self._parser.Parse(data, isFinal)
  File "/usr/lib/python2.7/xml/sax/expatreader.py", line 352, in end_element_ns
    self._cont_handler.endElementNS(pair, None)
  File "/home/jenkins/.buildout/eggs/zope.configuration-3.7.4-py2.7.egg/zope/configuration/xmlconfig.py", line 359, in endElementNS
    self.context.end()
  File "/home/jenkins/.buildout/eggs/zope.configuration-3.7.4-py2.7.egg/zope/configuration/config.py", line 558, in end
    self.stack.pop().finish()
  File "/home/jenkins/.buildout/eggs/zope.configuration-3.7.4-py2.7.egg/zope/configuration/config.py", line 705, in finish
    args = toargs(context, *self.argdata)
  File "/home/jenkins/.buildout/eggs/zope.configuration-3.7.4-py2.7.egg/zope/configuration/config.py", line 1397, in toargs
    args[str(name)] = field.fromUnicode(s)
  File "/home/jenkins/.buildout/eggs/zope.configuration-3.7.4-py2.7.egg/zope/configuration/fields.py", line 139, in fromUnicode
    raise schema.ValidationError(v)





More information about the Testbot mailing list