[Testbot] Plone 5.0 - Python 2.7 - Archetypes - Build # 4446 - Failure!

jenkins at plone.org jenkins at plone.org
Fri Mar 18 16:29:38 UTC 2016


Plone 5.0 - Python 2.7 - Archetypes - Build # 4446 - Failure:

Check console output at http://jenkins.plone.org/job/plone-5.0-python-2.7-at/4446/ to view the results.

Changes:

[Johannes Raggam] [fc] Repository: mockup Branch: refs/heads/master Date:







Test Results:

49 tests failed.
FAILED:  Products.CMFDynamicViewFTI.tests.test_browserdefault.Startup

Error Message:
No module named CMFPlone.utils

Stack Trace:
No module named CMFPlone.utils

  File "/home/jenkins/.buildout/eggs/Products.CMFDynamicViewFTI-4.1.3-py2.7.egg/Products/CMFDynamicViewFTI/tests/test_browserdefault.py", line 6, in <module>
    from Products.CMFDynamicViewFTI.tests import CMFDVFTITestCase
  File "/home/jenkins/.buildout/eggs/Products.CMFDynamicViewFTI-4.1.3-py2.7.egg/Products/CMFDynamicViewFTI/tests/CMFDVFTITestCase.py", line 6, in <module>
    from plone.app.testing import bbb
  File "/home/jenkins/.buildout/eggs/plone.app.testing-5.0.1-py2.7.egg/plone/app/testing/bbb.py", line 7, in <module>
    from Products.CMFPlone.utils import _createObjectByType


FAILED:  Products.CMFDynamicViewFTI.tests.test_fti.Startup

Error Message:
No module named CMFPlone.log

Stack Trace:
No module named CMFPlone.log

  File "/home/jenkins/.buildout/eggs/Products.CMFDynamicViewFTI-4.1.3-py2.7.egg/Products/CMFDynamicViewFTI/tests/test_fti.py", line 4, in <module>
    from Products.Archetypes.atapi import StringField
  File "/home/jenkins/.buildout/eggs/Products.Archetypes-1.10.13-py2.7.egg/Products/Archetypes/atapi.py", line 33, in <module>
    from Products.Archetypes.BaseContent import BaseContent
  File "/home/jenkins/.buildout/eggs/Products.Archetypes-1.10.13-py2.7.egg/Products/Archetypes/BaseContent.py", line 3, in <module>
    from Products.Archetypes.ExtensibleMetadata import ExtensibleMetadata
  File "/home/jenkins/.buildout/eggs/Products.Archetypes-1.10.13-py2.7.egg/Products/Archetypes/ExtensibleMetadata.py", line 27, in <module>
    from Products.CMFPlone.log import log_deprecated


FAILED:  Products.CMFEditions.tests.test_ATContentTypes.Startup

Error Message:
No module named CMFPlone.utils

Stack Trace:
No module named CMFPlone.utils

  File "/home/jenkins/.buildout/eggs/Products.CMFEditions-2.2.19-py2.7.egg/Products/CMFEditions/tests/test_ATContentTypes.py", line 28, in <module>
    from Products.CMFEditions.tests.base import CMFEditionsBaseTestCase
  File "/home/jenkins/.buildout/eggs/Products.CMFEditions-2.2.19-py2.7.egg/Products/CMFEditions/tests/base.py", line 1, in <module>
    from plone.app.testing.bbb import PloneTestCase
  File "/home/jenkins/.buildout/eggs/plone.app.testing-5.0.1-py2.7.egg/plone/app/testing/bbb.py", line 7, in <module>
    from Products.CMFPlone.utils import _createObjectByType


FAILED:  Products.CMFEditions.tests.test_ATReferences.Startup

Error Message:
No module named CMFPlone.utils

Stack Trace:
No module named CMFPlone.utils

  File "/home/jenkins/.buildout/eggs/Products.CMFEditions-2.2.19-py2.7.egg/Products/CMFEditions/tests/test_ATReferences.py", line 4, in <module>
    from Products.CMFEditions.tests.base import CMFEditionsBaseTestCase
  File "/home/jenkins/.buildout/eggs/Products.CMFEditions-2.2.19-py2.7.egg/Products/CMFEditions/tests/base.py", line 1, in <module>
    from plone.app.testing.bbb import PloneTestCase
  File "/home/jenkins/.buildout/eggs/plone.app.testing-5.0.1-py2.7.egg/plone/app/testing/bbb.py", line 7, in <module>
    from Products.CMFPlone.utils import _createObjectByType


FAILED:  Products.CMFEditions.tests.test_ArchivistTool.Startup

Error Message:
No module named CMFPlone.utils

Stack Trace:
No module named CMFPlone.utils

  File "/home/jenkins/.buildout/eggs/Products.CMFEditions-2.2.19-py2.7.egg/Products/CMFEditions/tests/test_ArchivistTool.py", line 27, in <module>
    from Products.CMFEditions.tests.base import CMFEditionsBaseTestCase
  File "/home/jenkins/.buildout/eggs/Products.CMFEditions-2.2.19-py2.7.egg/Products/CMFEditions/tests/base.py", line 1, in <module>
    from plone.app.testing.bbb import PloneTestCase
  File "/home/jenkins/.buildout/eggs/plone.app.testing-5.0.1-py2.7.egg/plone/app/testing/bbb.py", line 7, in <module>
    from Products.CMFPlone.utils import _createObjectByType


FAILED:  Products.CMFEditions.tests.test_ContentTypes.Startup

Error Message:
No module named CMFPlone.utils

Stack Trace:
No module named CMFPlone.utils

  File "/home/jenkins/.buildout/eggs/Products.CMFEditions-2.2.19-py2.7.egg/Products/CMFEditions/tests/test_ContentTypes.py", line 4, in <module>
    from Products.CMFEditions.tests.base import CMFEditionsBaseTestCase
  File "/home/jenkins/.buildout/eggs/Products.CMFEditions-2.2.19-py2.7.egg/Products/CMFEditions/tests/base.py", line 1, in <module>
    from plone.app.testing.bbb import PloneTestCase
  File "/home/jenkins/.buildout/eggs/plone.app.testing-5.0.1-py2.7.egg/plone/app/testing/bbb.py", line 7, in <module>
    from Products.CMFPlone.utils import _createObjectByType


FAILED:  Products.CMFEditions.tests.test_CopyModifyMergeRepositoryTool.Startup

Error Message:
No module named CMFPlone.utils

Stack Trace:
No module named CMFPlone.utils

  File "/home/jenkins/.buildout/eggs/Products.CMFEditions-2.2.19-py2.7.egg/Products/CMFEditions/tests/test_CopyModifyMergeRepositoryTool.py", line 27, in <module>
    from Products.CMFEditions.tests.base import CMFEditionsBaseTestCase
  File "/home/jenkins/.buildout/eggs/Products.CMFEditions-2.2.19-py2.7.egg/Products/CMFEditions/tests/base.py", line 1, in <module>
    from plone.app.testing.bbb import PloneTestCase
  File "/home/jenkins/.buildout/eggs/plone.app.testing-5.0.1-py2.7.egg/plone/app/testing/bbb.py", line 7, in <module>
    from Products.CMFPlone.utils import _createObjectByType


FAILED:  Products.CMFEditions.tests.test_IntegrationTests.Startup

Error Message:
No module named CMFPlone.utils

Stack Trace:
No module named CMFPlone.utils

  File "/home/jenkins/.buildout/eggs/Products.CMFEditions-2.2.19-py2.7.egg/Products/CMFEditions/tests/test_IntegrationTests.py", line 36, in <module>
    from Products.CMFEditions.tests.base import CMFEditionsBaseTestCase
  File "/home/jenkins/.buildout/eggs/Products.CMFEditions-2.2.19-py2.7.egg/Products/CMFEditions/tests/base.py", line 1, in <module>
    from plone.app.testing.bbb import PloneTestCase
  File "/home/jenkins/.buildout/eggs/plone.app.testing-5.0.1-py2.7.egg/plone/app/testing/bbb.py", line 7, in <module>
    from Products.CMFPlone.utils import _createObjectByType


FAILED:  Products.CMFEditions.tests.test_KeepLastNVersionsTool.Startup

Error Message:
No module named CMFPlone.utils

Stack Trace:
No module named CMFPlone.utils

  File "/home/jenkins/.buildout/eggs/Products.CMFEditions-2.2.19-py2.7.egg/Products/CMFEditions/tests/test_KeepLastNVersionsTool.py", line 26, in <module>
    from Products.CMFEditions.tests.base import CMFEditionsBaseTestCase
  File "/home/jenkins/.buildout/eggs/Products.CMFEditions-2.2.19-py2.7.egg/Products/CMFEditions/tests/base.py", line 1, in <module>
    from plone.app.testing.bbb import PloneTestCase
  File "/home/jenkins/.buildout/eggs/plone.app.testing-5.0.1-py2.7.egg/plone/app/testing/bbb.py", line 7, in <module>
    from Products.CMFPlone.utils import _createObjectByType


FAILED:  Products.CMFEditions.tests.test_ModifierRegistryTool.Startup

Error Message:
No module named CMFPlone.utils

Stack Trace:
No module named CMFPlone.utils

  File "/home/jenkins/.buildout/eggs/Products.CMFEditions-2.2.19-py2.7.egg/Products/CMFEditions/tests/test_ModifierRegistryTool.py", line 26, in <module>
    from Products.CMFEditions.tests.base import CMFEditionsBaseTestCase
  File "/home/jenkins/.buildout/eggs/Products.CMFEditions-2.2.19-py2.7.egg/Products/CMFEditions/tests/base.py", line 1, in <module>
    from plone.app.testing.bbb import PloneTestCase
  File "/home/jenkins/.buildout/eggs/plone.app.testing-5.0.1-py2.7.egg/plone/app/testing/bbb.py", line 7, in <module>
    from Products.CMFPlone.utils import _createObjectByType


FAILED:  Products.CMFEditions.tests.test_ZVCStorageTool.Startup

Error Message:
No module named CMFPlone.utils

Stack Trace:
No module named CMFPlone.utils

  File "/home/jenkins/.buildout/eggs/Products.CMFEditions-2.2.19-py2.7.egg/Products/CMFEditions/tests/test_ZVCStorageTool.py", line 27, in <module>
    from Products.CMFEditions.tests.base import CMFEditionsBaseTestCase
  File "/home/jenkins/.buildout/eggs/Products.CMFEditions-2.2.19-py2.7.egg/Products/CMFEditions/tests/base.py", line 1, in <module>
    from plone.app.testing.bbb import PloneTestCase
  File "/home/jenkins/.buildout/eggs/plone.app.testing-5.0.1-py2.7.egg/plone/app/testing/bbb.py", line 7, in <module>
    from Products.CMFPlone.utils import _createObjectByType


FAILED:  Products.CMFEditions.tests.test_doctests.Startup

Error Message:
No module named CMFPlone.utils

Stack Trace:
No module named CMFPlone.utils

  File "/home/jenkins/.buildout/eggs/Products.CMFEditions-2.2.19-py2.7.egg/Products/CMFEditions/tests/test_doctests.py", line 4, in <module>
    from plone.app.testing.bbb import PTC_FUNCTIONAL_TESTING
  File "/home/jenkins/.buildout/eggs/plone.app.testing-5.0.1-py2.7.egg/plone/app/testing/bbb.py", line 7, in <module>
    from Products.CMFPlone.utils import _createObjectByType


FAILED:  Products.CMFEditions.tests.test_versions_history_form.Startup

Error Message:
No module named CMFPlone.utils

Stack Trace:
No module named CMFPlone.utils

  File "/home/jenkins/.buildout/eggs/Products.CMFEditions-2.2.19-py2.7.egg/Products/CMFEditions/tests/test_versions_history_form.py", line 25, in <module>
    from Products.CMFEditions.tests.base import CMFEditionsBaseTestCase
  File "/home/jenkins/.buildout/eggs/Products.CMFEditions-2.2.19-py2.7.egg/Products/CMFEditions/tests/base.py", line 1, in <module>
    from plone.app.testing.bbb import PloneTestCase
  File "/home/jenkins/.buildout/eggs/plone.app.testing-5.0.1-py2.7.egg/plone/app/testing/bbb.py", line 7, in <module>
    from Products.CMFPlone.utils import _createObjectByType


FAILED:  Products.CMFPlacefulWorkflow.tests.testCMFPlacefulWorkflow.Startup

Error Message:
No module named CMFPlone.utils

Stack Trace:
No module named CMFPlone.utils

  File "/home/jenkins/.buildout/eggs/Products.CMFPlacefulWorkflow-1.6.5-py2.7.egg/Products/CMFPlacefulWorkflow/tests/testCMFPlacefulWorkflow.py", line 22, in <module>
    from CMFPlacefulWorkflowTestCase import CMFPlacefulWorkflowTestCase
  File "/home/jenkins/.buildout/eggs/Products.CMFPlacefulWorkflow-1.6.5-py2.7.egg/Products/CMFPlacefulWorkflow/tests/CMFPlacefulWorkflowTestCase.py", line 26, in <module>
    from plone.app.testing.bbb import PloneTestCase
  File "/home/jenkins/.buildout/eggs/plone.app.testing-5.0.1-py2.7.egg/plone/app/testing/bbb.py", line 7, in <module>
    from Products.CMFPlone.utils import _createObjectByType


FAILED:  Products.CMFPlacefulWorkflow.tests.test_configlet.Startup

Error Message:
No module named CMFPlone.utils

Stack Trace:
No module named CMFPlone.utils

  File "/home/jenkins/.buildout/eggs/Products.CMFPlacefulWorkflow-1.6.5-py2.7.egg/Products/CMFPlacefulWorkflow/tests/test_configlet.py", line 22, in <module>
    from CMFPlacefulWorkflowTestCase import CMFPlacefulWorkflowFunctionalTestCase
  File "/home/jenkins/.buildout/eggs/Products.CMFPlacefulWorkflow-1.6.5-py2.7.egg/Products/CMFPlacefulWorkflow/tests/CMFPlacefulWorkflowTestCase.py", line 26, in <module>
    from plone.app.testing.bbb import PloneTestCase
  File "/home/jenkins/.buildout/eggs/plone.app.testing-5.0.1-py2.7.egg/plone/app/testing/bbb.py", line 7, in <module>
    from Products.CMFPlone.utils import _createObjectByType


FAILED:  Products.CMFPlacefulWorkflow.tests.test_doctests.Startup

Error Message:
No module named CMFPlone.utils

Stack Trace:
No module named CMFPlone.utils

  File "/home/jenkins/.buildout/eggs/Products.CMFPlacefulWorkflow-1.6.5-py2.7.egg/Products/CMFPlacefulWorkflow/tests/test_doctests.py", line 22, in <module>
    from CMFPlacefulWorkflowTestCase import PWF_LAYER
  File "/home/jenkins/.buildout/eggs/Products.CMFPlacefulWorkflow-1.6.5-py2.7.egg/Products/CMFPlacefulWorkflow/tests/CMFPlacefulWorkflowTestCase.py", line 26, in <module>
    from plone.app.testing.bbb import PloneTestCase
  File "/home/jenkins/.buildout/eggs/plone.app.testing-5.0.1-py2.7.egg/plone/app/testing/bbb.py", line 7, in <module>
    from Products.CMFPlone.utils import _createObjectByType


FAILED:  Products.MimetypesRegistry.tests.test_encoding.Startup

Error Message:
No module named CMFPlone.utils

Stack Trace:
No module named CMFPlone.utils

  File "/home/jenkins/.buildout/eggs/Products.MimetypesRegistry-2.0.8-py2.7.egg/Products/MimetypesRegistry/tests/test_encoding.py", line 2, in <module>
    from plone.app.testing.bbb import PloneTestCase as ATSiteTestCase
  File "/home/jenkins/.buildout/eggs/plone.app.testing-5.0.1-py2.7.egg/plone/app/testing/bbb.py", line 7, in <module>
    from Products.CMFPlone.utils import _createObjectByType


FAILED:  Products.MimetypesRegistry.tests.test_magic.Startup

Error Message:
No module named CMFPlone.utils

Stack Trace:
No module named CMFPlone.utils

  File "/home/jenkins/.buildout/eggs/Products.MimetypesRegistry-2.0.8-py2.7.egg/Products/MimetypesRegistry/tests/test_magic.py", line 4, in <module>
    from plone.app.testing.bbb import PloneTestCase as ATSiteTestCase
  File "/home/jenkins/.buildout/eggs/plone.app.testing-5.0.1-py2.7.egg/plone/app/testing/bbb.py", line 7, in <module>
    from Products.CMFPlone.utils import _createObjectByType


FAILED:  Products.MimetypesRegistry.tests.test_mimetypes.Startup

Error Message:
No module named CMFPlone.utils

Stack Trace:
No module named CMFPlone.utils

  File "/home/jenkins/.buildout/eggs/Products.MimetypesRegistry-2.0.8-py2.7.egg/Products/MimetypesRegistry/tests/test_mimetypes.py", line 6, in <module>
    from plone.app.testing.bbb import PloneTestCase as ATSiteTestCase
  File "/home/jenkins/.buildout/eggs/plone.app.testing-5.0.1-py2.7.egg/plone/app/testing/bbb.py", line 7, in <module>
    from Products.CMFPlone.utils import _createObjectByType


FAILED:  Products.PortalTransforms.tests.test_engine.Startup

Error Message:
No module named CMFPlone.utils

Stack Trace:
No module named CMFPlone.utils

  File "/home/jenkins/.buildout/eggs/Products.PortalTransforms-2.2.0-py2.7.egg/Products/PortalTransforms/tests/test_engine.py", line 2, in <module>
    from Products.Archetypes.tests.atsitetestcase import ATSiteTestCase
  File "/home/jenkins/.buildout/eggs/Products.Archetypes-1.10.13-py2.7.egg/Products/Archetypes/tests/atsitetestcase.py", line 1, in <module>
    from Products.Archetypes.tests.attestcase import ATTestCase as ATSiteTestCase
  File "/home/jenkins/.buildout/eggs/Products.Archetypes-1.10.13-py2.7.egg/Products/Archetypes/tests/attestcase.py", line 1, in <module>
    from plone.app.testing import bbb
  File "/home/jenkins/.buildout/eggs/plone.app.testing-5.0.1-py2.7.egg/plone/app/testing/bbb.py", line 7, in <module>
    from Products.CMFPlone.utils import _createObjectByType


FAILED:  Products.PortalTransforms.tests.test_graph.Startup

Error Message:
No module named CMFPlone.utils

Stack Trace:
No module named CMFPlone.utils

  File "/home/jenkins/.buildout/eggs/Products.PortalTransforms-2.2.0-py2.7.egg/Products/PortalTransforms/tests/test_graph.py", line 2, in <module>
    from Products.Archetypes.tests.atsitetestcase import ATSiteTestCase
  File "/home/jenkins/.buildout/eggs/Products.Archetypes-1.10.13-py2.7.egg/Products/Archetypes/tests/atsitetestcase.py", line 1, in <module>
    from Products.Archetypes.tests.attestcase import ATTestCase as ATSiteTestCase
  File "/home/jenkins/.buildout/eggs/Products.Archetypes-1.10.13-py2.7.egg/Products/Archetypes/tests/attestcase.py", line 1, in <module>
    from plone.app.testing import bbb
  File "/home/jenkins/.buildout/eggs/plone.app.testing-5.0.1-py2.7.egg/plone/app/testing/bbb.py", line 7, in <module>
    from Products.CMFPlone.utils import _createObjectByType


FAILED:  Products.PortalTransforms.tests.test_intelligenttext.Startup

Error Message:
No module named CMFPlone.utils

Stack Trace:
No module named CMFPlone.utils

  File "/home/jenkins/.buildout/eggs/Products.PortalTransforms-2.2.0-py2.7.egg/Products/PortalTransforms/tests/test_intelligenttext.py", line 2, in <module>
    from Products.Archetypes.tests.atsitetestcase import ATSiteTestCase
  File "/home/jenkins/.buildout/eggs/Products.Archetypes-1.10.13-py2.7.egg/Products/Archetypes/tests/atsitetestcase.py", line 1, in <module>
    from Products.Archetypes.tests.attestcase import ATTestCase as ATSiteTestCase
  File "/home/jenkins/.buildout/eggs/Products.Archetypes-1.10.13-py2.7.egg/Products/Archetypes/tests/attestcase.py", line 1, in <module>
    from plone.app.testing import bbb
  File "/home/jenkins/.buildout/eggs/plone.app.testing-5.0.1-py2.7.egg/plone/app/testing/bbb.py", line 7, in <module>
    from Products.CMFPlone.utils import _createObjectByType


FAILED:  Products.PortalTransforms.tests.test_transforms.Startup

Error Message:
No module named CMFPlone.utils

Stack Trace:
No module named CMFPlone.utils

  File "/home/jenkins/.buildout/eggs/Products.PortalTransforms-2.2.0-py2.7.egg/Products/PortalTransforms/tests/test_transforms.py", line 3, in <module>
    from Products.Archetypes.tests.atsitetestcase import ATSiteTestCase
  File "/home/jenkins/.buildout/eggs/Products.Archetypes-1.10.13-py2.7.egg/Products/Archetypes/tests/atsitetestcase.py", line 1, in <module>
    from Products.Archetypes.tests.attestcase import ATTestCase as ATSiteTestCase
  File "/home/jenkins/.buildout/eggs/Products.Archetypes-1.10.13-py2.7.egg/Products/Archetypes/tests/attestcase.py", line 1, in <module>
    from plone.app.testing import bbb
  File "/home/jenkins/.buildout/eggs/plone.app.testing-5.0.1-py2.7.egg/plone/app/testing/bbb.py", line 7, in <module>
    from Products.CMFPlone.utils import _createObjectByType


FAILED:  Products.PortalTransforms.tests.test_xss.Startup

Error Message:
No module named CMFPlone.utils

Stack Trace:
No module named CMFPlone.utils

  File "/home/jenkins/.buildout/eggs/Products.PortalTransforms-2.2.0-py2.7.egg/Products/PortalTransforms/tests/test_xss.py", line 2, in <module>
    from Products.Archetypes.tests.atsitetestcase import ATSiteTestCase
  File "/home/jenkins/.buildout/eggs/Products.Archetypes-1.10.13-py2.7.egg/Products/Archetypes/tests/atsitetestcase.py", line 1, in <module>
    from Products.Archetypes.tests.attestcase import ATTestCase as ATSiteTestCase
  File "/home/jenkins/.buildout/eggs/Products.Archetypes-1.10.13-py2.7.egg/Products/Archetypes/tests/attestcase.py", line 1, in <module>
    from plone.app.testing import bbb
  File "/home/jenkins/.buildout/eggs/plone.app.testing-5.0.1-py2.7.egg/plone/app/testing/bbb.py", line 7, in <module>
    from Products.CMFPlone.utils import _createObjectByType


FAILED:  Products.contentmigration.tests.testATFieldMigration.Startup

Error Message:
No module named CMFPlone.utils

Stack Trace:
No module named CMFPlone.utils

  File "/home/jenkins/.buildout/eggs/Products.contentmigration-2.1.11-py2.7.egg/Products/contentmigration/tests/testATFieldMigration.py", line 1, in <module>
    from Products.contentmigration.tests.cmtc import ContentMigratorTestCase
  File "/home/jenkins/.buildout/eggs/Products.contentmigration-2.1.11-py2.7.egg/Products/contentmigration/tests/cmtc.py", line 3, in <module>
    from Products.contentmigration.tests.layer import TestLayer
  File "/home/jenkins/.buildout/eggs/Products.contentmigration-2.1.11-py2.7.egg/Products/contentmigration/tests/layer.py", line 1, in <module>
    from plone.app.testing import bbb
  File "/home/jenkins/.buildout/eggs/plone.app.testing-5.0.1-py2.7.egg/plone/app/testing/bbb.py", line 7, in <module>
    from Products.CMFPlone.utils import _createObjectByType


FAILED:  Products.contentmigration.tests.test_doctests.Startup

Error Message:
No module named CMFPlone.utils

Stack Trace:
No module named CMFPlone.utils

  File "/home/jenkins/.buildout/eggs/Products.contentmigration-2.1.11-py2.7.egg/Products/contentmigration/tests/test_doctests.py", line 11, in <module>
    from Products.contentmigration.tests.layer import TestLayer
  File "/home/jenkins/.buildout/eggs/Products.contentmigration-2.1.11-py2.7.egg/Products/contentmigration/tests/layer.py", line 1, in <module>
    from plone.app.testing import bbb
  File "/home/jenkins/.buildout/eggs/plone.app.testing-5.0.1-py2.7.egg/plone/app/testing/bbb.py", line 7, in <module>
    from Products.CMFPlone.utils import _createObjectByType


FAILED:  Products.validation.tests.test_validation.Startup

Error Message:
No module named CMFPlone.utils

Stack Trace:
No module named CMFPlone.utils

  File "/home/jenkins/.buildout/eggs/Products.validation-2.0.1-py2.7.egg/Products/validation/tests/test_validation.py", line 3, in <module>
    from Products.Archetypes.tests.atsitetestcase import ATSiteTestCase
  File "/home/jenkins/.buildout/eggs/Products.Archetypes-1.10.13-py2.7.egg/Products/Archetypes/tests/atsitetestcase.py", line 1, in <module>
    from Products.Archetypes.tests.attestcase import ATTestCase as ATSiteTestCase
  File "/home/jenkins/.buildout/eggs/Products.Archetypes-1.10.13-py2.7.egg/Products/Archetypes/tests/attestcase.py", line 1, in <module>
    from plone.app.testing import bbb
  File "/home/jenkins/.buildout/eggs/plone.app.testing-5.0.1-py2.7.egg/plone/app/testing/bbb.py", line 7, in <module>
    from Products.CMFPlone.utils import _createObjectByType


FAILED:  archetypes.multilingual.tests.test_doctests.Startup

Error Message:
No module named CMFPlone.utils

Stack Trace:
No module named CMFPlone.utils

  File "/home/jenkins/.buildout/eggs/archetypes.multilingual-3.0.2-py2.7.egg/archetypes/multilingual/tests/test_doctests.py", line 2, in <module>
    from archetypes.multilingual.testing import \
  File "/home/jenkins/.buildout/eggs/archetypes.multilingual-3.0.2-py2.7.egg/archetypes/multilingual/testing.py", line 7, in <module>
    from plone.app.multilingual.testing import PLONE_APP_MULTILINGUAL_FIXTURE
  File "/home/jenkins/workspace/plone-5.0-python-2.7-at/src/plone.app.multilingual/src/plone/app/multilingual/testing.py", line 5, in <module>
    from plone.app.contenttypes.testing import PLONE_APP_CONTENTTYPES_FIXTURE
  File "/home/jenkins/workspace/plone-5.0-python-2.7-at/src/plone.app.contenttypes/plone/app/contenttypes/testing.py", line 4, in <module>
    from plone.app.event.testing import PAEvent_FIXTURE
  File "/home/jenkins/workspace/plone-5.0-python-2.7-at/src/plone.app.event/plone/app/event/testing.py", line 1, in <module>
    from Products.CMFPlone.utils import getFSVersionTuple


FAILED:  archetypes.multilingual.tests.test_language_inheritance.Startup

Error Message:
No module named CMFPlone.utils

Stack Trace:
No module named CMFPlone.utils

  File "/home/jenkins/.buildout/eggs/archetypes.multilingual-3.0.2-py2.7.egg/archetypes/multilingual/tests/test_language_inheritance.py", line 3, in <module>
    from Products.CMFPlone.utils import _createObjectByType


FAILED:  archetypes.multilingual.tests.test_monkey.Startup

Error Message:
No module named CMFPlone.utils

Stack Trace:
No module named CMFPlone.utils

  File "/home/jenkins/.buildout/eggs/archetypes.multilingual-3.0.2-py2.7.egg/archetypes/multilingual/tests/test_monkey.py", line 3, in <module>
    from archetypes.multilingual.testing import \
  File "/home/jenkins/.buildout/eggs/archetypes.multilingual-3.0.2-py2.7.egg/archetypes/multilingual/testing.py", line 7, in <module>
    from plone.app.multilingual.testing import PLONE_APP_MULTILINGUAL_FIXTURE
  File "/home/jenkins/workspace/plone-5.0-python-2.7-at/src/plone.app.multilingual/src/plone/app/multilingual/testing.py", line 5, in <module>
    from plone.app.contenttypes.testing import PLONE_APP_CONTENTTYPES_FIXTURE
  File "/home/jenkins/workspace/plone-5.0-python-2.7-at/src/plone.app.contenttypes/plone/app/contenttypes/testing.py", line 4, in <module>
    from plone.app.event.testing import PAEvent_FIXTURE
  File "/home/jenkins/workspace/plone-5.0-python-2.7-at/src/plone.app.event/plone/app/event/testing.py", line 1, in <module>
    from Products.CMFPlone.utils import getFSVersionTuple


FAILED:  archetypes.schemaextender.tests.testAccessor.Startup

Error Message:
No module named CMFPlone.log

Stack Trace:
No module named CMFPlone.log

  File "/home/jenkins/.buildout/eggs/archetypes.schemaextender-2.1.5-py2.7.egg/archetypes/schemaextender/tests/testAccessor.py", line 3, in <module>
    from Products.Archetypes.atapi import ComputedField, StringField, StringWidget
  File "/home/jenkins/.buildout/eggs/Products.Archetypes-1.10.13-py2.7.egg/Products/Archetypes/atapi.py", line 33, in <module>
    from Products.Archetypes.BaseContent import BaseContent
  File "/home/jenkins/.buildout/eggs/Products.Archetypes-1.10.13-py2.7.egg/Products/Archetypes/BaseContent.py", line 3, in <module>
    from Products.Archetypes.ExtensibleMetadata import ExtensibleMetadata
  File "/home/jenkins/.buildout/eggs/Products.Archetypes-1.10.13-py2.7.egg/Products/Archetypes/ExtensibleMetadata.py", line 27, in <module>
    from Products.CMFPlone.log import log_deprecated


FAILED:  archetypes.schemaextender.tests.testIntegration.Startup

Error Message:
No module named CMFPlone.utils

Stack Trace:
No module named CMFPlone.utils

  File "/home/jenkins/.buildout/eggs/archetypes.schemaextender-2.1.5-py2.7.egg/archetypes/schemaextender/tests/testIntegration.py", line 6, in <module>
    from plone.app.testing.bbb import PTC_FUNCTIONAL_TESTING
  File "/home/jenkins/.buildout/eggs/plone.app.testing-5.0.1-py2.7.egg/plone/app/testing/bbb.py", line 7, in <module>
    from Products.CMFPlone.utils import _createObjectByType


FAILED:  archetypes.schemaextender.tests.testOrdering.Startup

Error Message:
No module named CMFPlone.log

Stack Trace:
No module named CMFPlone.log

  File "/home/jenkins/.buildout/eggs/archetypes.schemaextender-2.1.5-py2.7.egg/archetypes/schemaextender/tests/testOrdering.py", line 2, in <module>
    from Products.Archetypes.public import Schema
  File "/home/jenkins/.buildout/eggs/Products.Archetypes-1.10.13-py2.7.egg/Products/Archetypes/public.py", line 5, in <module>
    from Products.Archetypes.atapi import *
  File "/home/jenkins/.buildout/eggs/Products.Archetypes-1.10.13-py2.7.egg/Products/Archetypes/atapi.py", line 33, in <module>
    from Products.Archetypes.BaseContent import BaseContent
  File "/home/jenkins/.buildout/eggs/Products.Archetypes-1.10.13-py2.7.egg/Products/Archetypes/BaseContent.py", line 3, in <module>
    from Products.Archetypes.ExtensibleMetadata import ExtensibleMetadata
  File "/home/jenkins/.buildout/eggs/Products.Archetypes-1.10.13-py2.7.egg/Products/Archetypes/ExtensibleMetadata.py", line 27, in <module>
    from Products.CMFPlone.log import log_deprecated


FAILED:  archetypes.schemaextender.tests.testSchemaFactory.Startup

Error Message:
No module named CMFPlone.utils

Stack Trace:
No module named CMFPlone.utils

  File "/home/jenkins/.buildout/eggs/archetypes.schemaextender-2.1.5-py2.7.egg/archetypes/schemaextender/tests/testSchemaFactory.py", line 3, in <module>
    from archetypes.schemaextender.tests.base import TestCase
  File "/home/jenkins/.buildout/eggs/archetypes.schemaextender-2.1.5-py2.7.egg/archetypes/schemaextender/tests/base.py", line 7, in <module>
    from plone.app.testing.bbb import PloneTestCase
  File "/home/jenkins/.buildout/eggs/plone.app.testing-5.0.1-py2.7.egg/plone/app/testing/bbb.py", line 7, in <module>
    from Products.CMFPlone.utils import _createObjectByType


FAILED:  plone.app.blob.tests.test_adapters.Startup

Error Message:
No module named CMFPlone.log

Stack Trace:
No module named CMFPlone.log

  File "/home/jenkins/.buildout/eggs/plone.app.blob-1.6.1-py2.7.egg/plone/app/blob/tests/test_adapters.py", line 4, in <module>
    from Products.ATContentTypes.content.image import ATImage
  File "/home/jenkins/.buildout/eggs/Products.ATContentTypes-2.2.11-py2.7.egg/Products/ATContentTypes/__init__.py", line 33, in <module>
    import Products.ATContentTypes.content  # noqa
  File "/home/jenkins/.buildout/eggs/Products.ATContentTypes-2.2.11-py2.7.egg/Products/ATContentTypes/content/__init__.py", line 2, in <module>
    import Products.ATContentTypes.content.link  # noqa
  File "/home/jenkins/.buildout/eggs/Products.ATContentTypes-2.2.11-py2.7.egg/Products/ATContentTypes/content/link.py", line 3, in <module>
    from Products.Archetypes.atapi import Schema
  File "/home/jenkins/.buildout/eggs/Products.Archetypes-1.10.13-py2.7.egg/Products/Archetypes/atapi.py", line 33, in <module>
    from Products.Archetypes.BaseContent import BaseContent
  File "/home/jenkins/.buildout/eggs/Products.Archetypes-1.10.13-py2.7.egg/Products/Archetypes/BaseContent.py", line 3, in <module>
    from Products.Archetypes.ExtensibleMetadata import ExtensibleMetadata
  File "/home/jenkins/.buildout/eggs/Products.Archetypes-1.10.13-py2.7.egg/Products/Archetypes/ExtensibleMetadata.py", line 27, in <module>
    from Products.CMFPlone.log import log_deprecated


FAILED:  plone.app.blob.tests.test_base_fields.Startup

Error Message:
No module named CMFPlone.utils

Stack Trace:
No module named CMFPlone.utils

  File "/home/jenkins/.buildout/eggs/plone.app.blob-1.6.1-py2.7.egg/plone/app/blob/tests/test_base_fields.py", line 1, in <module>
    from plone.app.blob.tests.base import ReplacementTestCase
  File "/home/jenkins/.buildout/eggs/plone.app.blob-1.6.1-py2.7.egg/plone/app/blob/tests/base.py", line 1, in <module>
    from plone.app.testing.bbb import PloneTestCase
  File "/home/jenkins/.buildout/eggs/plone.app.testing-5.0.1-py2.7.egg/plone/app/testing/bbb.py", line 7, in <module>
    from Products.CMFPlone.utils import _createObjectByType


FAILED:  plone.app.blob.tests.test_doctests.Startup

Error Message:
No module named CMFPlone.utils

Stack Trace:
No module named CMFPlone.utils

  File "/home/jenkins/.buildout/eggs/plone.app.blob-1.6.1-py2.7.egg/plone/app/blob/tests/test_doctests.py", line 4, in <module>
    from plone.app.blob.tests.layer import BlobLayer, BlobReplacementLayer, BlobLinguaLayer
  File "/home/jenkins/.buildout/eggs/plone.app.blob-1.6.1-py2.7.egg/plone/app/blob/tests/layer.py", line 3, in <module>
    from plone.app.testing.bbb import PloneTestCaseFixture
  File "/home/jenkins/.buildout/eggs/plone.app.testing-5.0.1-py2.7.egg/plone/app/testing/bbb.py", line 7, in <module>
    from Products.CMFPlone.utils import _createObjectByType


FAILED:  plone.app.blob.tests.test_integration.Startup

Error Message:
No module named CMFPlone.utils

Stack Trace:
No module named CMFPlone.utils

  File "/home/jenkins/.buildout/eggs/plone.app.blob-1.6.1-py2.7.egg/plone/app/blob/tests/test_integration.py", line 1, in <module>
    from plone.app.blob.tests.base import BlobTestCase, BlobFunctionalTestCase
  File "/home/jenkins/.buildout/eggs/plone.app.blob-1.6.1-py2.7.egg/plone/app/blob/tests/base.py", line 1, in <module>
    from plone.app.testing.bbb import PloneTestCase
  File "/home/jenkins/.buildout/eggs/plone.app.testing-5.0.1-py2.7.egg/plone/app/testing/bbb.py", line 7, in <module>
    from Products.CMFPlone.utils import _createObjectByType


FAILED:  plone.app.blob.tests.test_linguaplone.Startup

Error Message:
No module named CMFPlone.utils

Stack Trace:
No module named CMFPlone.utils

  File "/home/jenkins/.buildout/eggs/plone.app.blob-1.6.1-py2.7.egg/plone/app/blob/tests/test_linguaplone.py", line 2, in <module>
    from plone.app.blob.tests.base import BlobLinguaTestCase
  File "/home/jenkins/.buildout/eggs/plone.app.blob-1.6.1-py2.7.egg/plone/app/blob/tests/base.py", line 1, in <module>
    from plone.app.testing.bbb import PloneTestCase
  File "/home/jenkins/.buildout/eggs/plone.app.testing-5.0.1-py2.7.egg/plone/app/testing/bbb.py", line 7, in <module>
    from Products.CMFPlone.utils import _createObjectByType


FAILED:  plone.app.blob.tests.test_maintenance.Startup

Error Message:
No module named CMFPlone.utils

Stack Trace:
No module named CMFPlone.utils

  File "/home/jenkins/.buildout/eggs/plone.app.blob-1.6.1-py2.7.egg/plone/app/blob/tests/test_maintenance.py", line 1, in <module>
    from plone.app.blob.tests.base import ReplacementTestCase   # import first!
  File "/home/jenkins/.buildout/eggs/plone.app.blob-1.6.1-py2.7.egg/plone/app/blob/tests/base.py", line 1, in <module>
    from plone.app.testing.bbb import PloneTestCase
  File "/home/jenkins/.buildout/eggs/plone.app.testing-5.0.1-py2.7.egg/plone/app/testing/bbb.py", line 7, in <module>
    from Products.CMFPlone.utils import _createObjectByType


FAILED:  plone.app.blob.tests.test_replacements.Startup

Error Message:
No module named CMFPlone.utils

Stack Trace:
No module named CMFPlone.utils

  File "/home/jenkins/.buildout/eggs/plone.app.blob-1.6.1-py2.7.egg/plone/app/blob/tests/test_replacements.py", line 1, in <module>
    from plone.app.blob.tests.base import ReplacementTestCase   # import first!
  File "/home/jenkins/.buildout/eggs/plone.app.blob-1.6.1-py2.7.egg/plone/app/blob/tests/base.py", line 1, in <module>
    from plone.app.testing.bbb import PloneTestCase
  File "/home/jenkins/.buildout/eggs/plone.app.testing-5.0.1-py2.7.egg/plone/app/testing/bbb.py", line 7, in <module>
    from Products.CMFPlone.utils import _createObjectByType


FAILED:  plone.app.blob.tests.test_scaling.Startup

Error Message:
No module named CMFPlone.utils

Stack Trace:
No module named CMFPlone.utils

  File "/home/jenkins/.buildout/eggs/plone.app.blob-1.6.1-py2.7.egg/plone/app/blob/tests/test_scaling.py", line 1, in <module>
    from plone.app.blob.tests.base import ReplacementTestCase
  File "/home/jenkins/.buildout/eggs/plone.app.blob-1.6.1-py2.7.egg/plone/app/blob/tests/base.py", line 1, in <module>
    from plone.app.testing.bbb import PloneTestCase
  File "/home/jenkins/.buildout/eggs/plone.app.testing-5.0.1-py2.7.egg/plone/app/testing/bbb.py", line 7, in <module>
    from Products.CMFPlone.utils import _createObjectByType


FAILED:  plone.app.blob.tests.test_webdav.Startup

Error Message:
No module named CMFPlone.utils

Stack Trace:
No module named CMFPlone.utils

  File "/home/jenkins/.buildout/eggs/plone.app.blob-1.6.1-py2.7.egg/plone/app/blob/tests/test_webdav.py", line 1, in <module>
    from plone.app.blob.tests.base import ReplacementTestCase
  File "/home/jenkins/.buildout/eggs/plone.app.blob-1.6.1-py2.7.egg/plone/app/blob/tests/base.py", line 1, in <module>
    from plone.app.testing.bbb import PloneTestCase
  File "/home/jenkins/.buildout/eggs/plone.app.testing-5.0.1-py2.7.egg/plone/app/testing/bbb.py", line 7, in <module>
    from Products.CMFPlone.utils import _createObjectByType


FAILED:  plone.app.imaging.tests.test_doctests.Startup

Error Message:
No module named CMFPlone.interfaces.controlpanel

Stack Trace:
No module named CMFPlone.interfaces.controlpanel

  File "/home/jenkins/.buildout/eggs/plone.app.imaging-2.0.3-py2.7.egg/plone/app/imaging/tests/test_doctests.py", line 4, in <module>
    from plone.app.imaging import testing
  File "/home/jenkins/.buildout/eggs/plone.app.imaging-2.0.3-py2.7.egg/plone/app/imaging/testing.py", line 1, in <module>
    from plone.app.imaging.monkey import unpatchImageField
  File "/home/jenkins/.buildout/eggs/plone.app.imaging-2.0.3-py2.7.egg/plone/app/imaging/monkey.py", line 5, in <module>
    from plone.app.imaging.utils import getAllowedSizes, getQuality
  File "/home/jenkins/.buildout/eggs/plone.app.imaging-2.0.3-py2.7.egg/plone/app/imaging/utils.py", line 4, in <module>
    from Products.CMFPlone.interfaces.controlpanel import IImagingSchema


FAILED:  plone.app.imaging.tests.test_new_scaling.Startup

Error Message:
No module named CMFPlone.utils

Stack Trace:
No module named CMFPlone.utils

  File "/home/jenkins/.buildout/eggs/plone.app.imaging-2.0.3-py2.7.egg/plone/app/imaging/tests/test_new_scaling.py", line 1, in <module>
    from plone.app.imaging.tests.base import ImagingTestCase
  File "/home/jenkins/.buildout/eggs/plone.app.imaging-2.0.3-py2.7.egg/plone/app/imaging/tests/base.py", line 1, in <module>
    from plone.app.testing.bbb import PloneTestCase
  File "/home/jenkins/.buildout/eggs/plone.app.testing-5.0.1-py2.7.egg/plone/app/testing/bbb.py", line 7, in <module>
    from Products.CMFPlone.utils import _createObjectByType


FAILED:  plone.app.imaging.tests.test_properties.Startup

Error Message:
No module named CMFPlone.utils

Stack Trace:
No module named CMFPlone.utils

  File "/home/jenkins/.buildout/eggs/plone.app.imaging-2.0.3-py2.7.egg/plone/app/imaging/tests/test_properties.py", line 1, in <module>
    from plone.app.imaging.tests.base import ImagingTestCase
  File "/home/jenkins/.buildout/eggs/plone.app.imaging-2.0.3-py2.7.egg/plone/app/imaging/tests/base.py", line 1, in <module>
    from plone.app.testing.bbb import PloneTestCase
  File "/home/jenkins/.buildout/eggs/plone.app.testing-5.0.1-py2.7.egg/plone/app/testing/bbb.py", line 7, in <module>
    from Products.CMFPlone.utils import _createObjectByType


FAILED:  plone.app.imaging.tests.test_scaling.Startup

Error Message:
No module named CMFPlone.utils

Stack Trace:
No module named CMFPlone.utils

  File "/home/jenkins/.buildout/eggs/plone.app.imaging-2.0.3-py2.7.egg/plone/app/imaging/tests/test_scaling.py", line 1, in <module>
    from plone.app.imaging.tests.base import ImagingTestCase
  File "/home/jenkins/.buildout/eggs/plone.app.imaging-2.0.3-py2.7.egg/plone/app/imaging/tests/base.py", line 1, in <module>
    from plone.app.testing.bbb import PloneTestCase
  File "/home/jenkins/.buildout/eggs/plone.app.testing-5.0.1-py2.7.egg/plone/app/testing/bbb.py", line 7, in <module>
    from Products.CMFPlone.utils import _createObjectByType


FAILED:  plone.app.imaging.tests.test_setup.Startup

Error Message:
No module named CMFPlone.log

Stack Trace:
No module named CMFPlone.log

  File "/home/jenkins/.buildout/eggs/plone.app.imaging-2.0.3-py2.7.egg/plone/app/imaging/tests/test_setup.py", line 3, in <module>
    from Products.ATContentTypes.content.image import ATImageSchema, ATImage
  File "/home/jenkins/.buildout/eggs/Products.ATContentTypes-2.2.11-py2.7.egg/Products/ATContentTypes/__init__.py", line 33, in <module>
    import Products.ATContentTypes.content  # noqa
  File "/home/jenkins/.buildout/eggs/Products.ATContentTypes-2.2.11-py2.7.egg/Products/ATContentTypes/content/__init__.py", line 2, in <module>
    import Products.ATContentTypes.content.link  # noqa
  File "/home/jenkins/.buildout/eggs/Products.ATContentTypes-2.2.11-py2.7.egg/Products/ATContentTypes/content/link.py", line 3, in <module>
    from Products.Archetypes.atapi import Schema
  File "/home/jenkins/.buildout/eggs/Products.Archetypes-1.10.13-py2.7.egg/Products/Archetypes/atapi.py", line 33, in <module>
    from Products.Archetypes.BaseContent import BaseContent
  File "/home/jenkins/.buildout/eggs/Products.Archetypes-1.10.13-py2.7.egg/Products/Archetypes/BaseContent.py", line 3, in <module>
    from Products.Archetypes.ExtensibleMetadata import ExtensibleMetadata
  File "/home/jenkins/.buildout/eggs/Products.Archetypes-1.10.13-py2.7.egg/Products/Archetypes/ExtensibleMetadata.py", line 27, in <module>
    from Products.CMFPlone.log import log_deprecated


FAILED:  plone.app.imaging.tests.test_traverse.Startup

Error Message:
No module named CMFPlone.log

Stack Trace:
No module named CMFPlone.log

  File "/home/jenkins/.buildout/eggs/plone.app.imaging-2.0.3-py2.7.egg/plone/app/imaging/tests/test_traverse.py", line 9, in <module>
    from Products.Archetypes.atapi import ImageField
  File "/home/jenkins/.buildout/eggs/Products.Archetypes-1.10.13-py2.7.egg/Products/Archetypes/atapi.py", line 33, in <module>
    from Products.Archetypes.BaseContent import BaseContent
  File "/home/jenkins/.buildout/eggs/Products.Archetypes-1.10.13-py2.7.egg/Products/Archetypes/BaseContent.py", line 3, in <module>
    from Products.Archetypes.ExtensibleMetadata import ExtensibleMetadata
  File "/home/jenkins/.buildout/eggs/Products.Archetypes-1.10.13-py2.7.egg/Products/Archetypes/ExtensibleMetadata.py", line 27, in <module>
    from Products.CMFPlone.log import log_deprecated





More information about the Testbot mailing list