[Testbot] Plone 5.1 - Python 2.7 - Build # 15 - Failure!

jenkins at plone.org jenkins at plone.org
Wed Mar 9 17:54:13 UTC 2016


Plone 5.1 - Python 2.7 - Build # 15 - Failure:

Check console output at http://jenkins.plone.org/job/plone-5.1-python-2.7/15/ to view the results.

Changes:

[Jens W. Klein] [fc] Repository: Products.CMFPlone Branch: refs/heads/master Date:







Test Results:

3 tests failed.
FAILED:  Products.CMFPlone.tests.testMigrationTool.TestMigrationTool.testDoUpgrades

Error Message:
Tuples differ: ('5014',) != (u'5101',)

Stack Trace:
Tuples differ: ('5014',) != (u'5101',)

First differing element 0:
5014
5101

- ('5014',)
?      -

+ (u'5101',)
?  +  +


  File "/usr/lib/python2.7/unittest/case.py", line 331, in run
    testMethod()
  File "/home/jenkins/workspace/plone-5.1-python-2.7/src/Products.CMFPlone/Products/CMFPlone/tests/testMigrationTool.py", line 59, in testDoUpgrades
    self.assertEqual(last, current)
  File "/usr/lib/python2.7/unittest/case.py", line 515, in assertEqual
    assertion_func(first, second, msg=msg)
  File "/usr/lib/python2.7/unittest/case.py", line 755, in assertTupleEqual
    self.assertSequenceEqual(tuple1, tuple2, msg, seq_type=tuple)
  File "/usr/lib/python2.7/unittest/case.py", line 726, in assertSequenceEqual
    self.fail(msg)
  File "/usr/lib/python2.7/unittest/case.py", line 412, in fail
    raise self.failureException(msg)


FAILED:  plone.app.upgrade.tests.test_upgrade.TestUpgrade.testDoUpgrades

Error Message:
Tuples differ: ('5014',) != (u'5101',)

Stack Trace:
Tuples differ: ('5014',) != (u'5101',)

First differing element 0:
5014
5101

- ('5014',)
?      -

+ (u'5101',)
?  +  +


  File "/usr/lib/python2.7/unittest/case.py", line 331, in run
    testMethod()
  File "/home/jenkins/workspace/plone-5.1-python-2.7/src/plone.app.upgrade/plone/app/upgrade/tests/test_upgrade.py", line 62, in testDoUpgrades
    self.assertEqual(last, current)
  File "/usr/lib/python2.7/unittest/case.py", line 515, in assertEqual
    assertion_func(first, second, msg=msg)
  File "/usr/lib/python2.7/unittest/case.py", line 755, in assertTupleEqual
    self.assertSequenceEqual(tuple1, tuple2, msg, seq_type=tuple)
  File "/usr/lib/python2.7/unittest/case.py", line 726, in assertSequenceEqual
    self.fail(msg)
  File "/usr/lib/python2.7/unittest/case.py", line 412, in fail
    raise self.failureException(msg)


FAILED:  plone.app.upgrade.v50.tests.TestFunctionalMigrations.testFullyUpgraded

Error Message:
True is not false

Stack Trace:
True is not false

  File "/usr/lib/python2.7/unittest/case.py", line 331, in run
    testMethod()
  File "/home/jenkins/workspace/plone-5.1-python-2.7/src/plone.app.upgrade/plone/app/upgrade/v50/tests.py", line 105, in testFullyUpgraded
    self.assertFalse(self.portal.portal_migration.needUpgrading())
  File "/usr/lib/python2.7/unittest/case.py", line 418, in assertFalse
    raise self.failureException(msg)





More information about the Testbot mailing list