[Testbot] Plone 5.0 - Python 2.7 - Archetypes - Build # 4997 - Failure!

jenkins at plone.org jenkins at plone.org
Thu Aug 25 20:43:31 UTC 2016


Plone 5.0 - Python 2.7 - Archetypes - Build # 4997 - Failure:

Check console output at http://jenkins.plone.org/job/plone-5.0-python-2.7-at/4997/ to view the results.

Changes:

[Maurits van Rees] No longer exclude z3c.form from the tests.







Test Results:

3 tests failed.
FAILED:  Products.GenericSetup.tests.test_tool.SetupToolTests.test_runAllImportStepsFromProfile_with_base_profile

Error Message:
{} != {u'other:foo': (u'1', u'0')}

Stack Trace:
{} != {u'other:foo': (u'1', u'0')}
- {}
+ {u'other:foo': (u'1', u'0')}

  File "/usr/lib/python2.7/unittest/case.py", line 329, in run
    testMethod()
  File "/home/jenkins/.buildout/eggs/Products.GenericSetup-1.8.3-py2.7.egg/Products/GenericSetup/tests/test_tool.py", line 790, in test_runAllImportStepsFromProfile_with_base_profile
    {u'other:foo': (u'1', u'0')})
  File "/usr/lib/python2.7/unittest/case.py", line 513, in assertEqual
    assertion_func(first, second, msg=msg)
  File "/usr/lib/python2.7/unittest/case.py", line 835, in assertDictEqual
    self.fail(self._formatMessage(msg, standardMsg))
  File "/usr/lib/python2.7/unittest/case.py", line 410, in fail
    raise self.failureException(msg)


FAILED:  Products.GenericSetup.tests.test_tool.SetupToolTests.test_runAllImportStepsFromProfile_with_depends

Error Message:
Lists differ: ['/tmp/STT_test'] != ['/tmp/STT_test2', '/tmp/STT_t...

Stack Trace:
Lists differ: ['/tmp/STT_test'] != ['/tmp/STT_test2', '/tmp/STT_t...

First differing element 0:
'/tmp/STT_test'
'/tmp/STT_test2'

Second list contains 1 additional elements.
First extra element 1:
'/tmp/STT_test'

- ['/tmp/STT_test']
+ ['/tmp/STT_test2', '/tmp/STT_test']

  File "/usr/lib/python2.7/unittest/case.py", line 329, in run
    testMethod()
  File "/home/jenkins/.buildout/eggs/Products.GenericSetup-1.8.3-py2.7.egg/Products/GenericSetup/tests/test_tool.py", line 564, in test_runAllImportStepsFromProfile_with_depends
    self.assertEqual(_imported, [self._PROFILE_PATH2, self._PROFILE_PATH])
  File "/usr/lib/python2.7/unittest/case.py", line 513, in assertEqual
    assertion_func(first, second, msg=msg)
  File "/usr/lib/python2.7/unittest/case.py", line 742, in assertListEqual
    self.assertSequenceEqual(list1, list2, msg, seq_type=list)
  File "/usr/lib/python2.7/unittest/case.py", line 724, in assertSequenceEqual
    self.fail(msg)
  File "/usr/lib/python2.7/unittest/case.py", line 410, in fail
    raise self.failureException(msg)


FAILED:  Products.GenericSetup.tests.test_tool.SetupToolTests.test_runAllImportStepsFromProfile_with_reapply_strategy

Error Message:
Lists differ: ['/tmp/STT_test'] != ['/tmp/STT_test2', '/tmp/STT_t...

Stack Trace:
Lists differ: ['/tmp/STT_test'] != ['/tmp/STT_test2', '/tmp/STT_t...

First differing element 0:
'/tmp/STT_test'
'/tmp/STT_test2'

Second list contains 2 additional elements.
First extra element 1:
'/tmp/STT_test3'

- ['/tmp/STT_test']
+ ['/tmp/STT_test2', '/tmp/STT_test3', '/tmp/STT_test']

  File "/usr/lib/python2.7/unittest/case.py", line 329, in run
    testMethod()
  File "/home/jenkins/.buildout/eggs/Products.GenericSetup-1.8.3-py2.7.egg/Products/GenericSetup/tests/test_tool.py", line 644, in test_runAllImportStepsFromProfile_with_reapply_strategy
    self._PROFILE_PATH])
  File "/usr/lib/python2.7/unittest/case.py", line 513, in assertEqual
    assertion_func(first, second, msg=msg)
  File "/usr/lib/python2.7/unittest/case.py", line 742, in assertListEqual
    self.assertSequenceEqual(list1, list2, msg, seq_type=list)
  File "/usr/lib/python2.7/unittest/case.py", line 724, in assertSequenceEqual
    self.fail(msg)
  File "/usr/lib/python2.7/unittest/case.py", line 410, in fail
    raise self.failureException(msg)





More information about the Testbot mailing list