[Testbot] Plone 5.0 - Python 2.7 - Build # 4857 - Failure!

jenkins at plone.org jenkins at plone.org
Sat Aug 20 00:58:14 UTC 2016


Plone 5.0 - Python 2.7 - Build # 4857 - Failure:

Check console output at http://jenkins.plone.org/job/plone-5.0-python-2.7/4857/ to view the results.

Changes:

[Eric Steele] plone.protect = 3.0.19

[Eric Steele] z3c.form = 3.2.10

[Eric Steele] Products.DCWorkflow = 2.2.5

[Eric Steele] Products.PortalTransforms = 2.2.1

[Eric Steele] Remove portaltransforms from checkouts [ci skip]"







Test Results:

11 tests failed.
FAILED:  Products.CMFPlone.controlpanel.tests.test_controlpanel_browser_syndication.SyndicationControlPanelFunctionalTest.test_create_collection

Error Message:
'instancemethod' object is not iterable

Stack Trace:
'instancemethod' object is not iterable

  File "/home/jenkins/.buildout/eggs/unittest2-0.5.1-py2.7.egg/unittest2/case.py", line 340, in run
    testMethod()
  File "/home/jenkins/workspace/plone-5.0-python-2.7/src/Products.CMFPlone/Products/CMFPlone/controlpanel/tests/test_controlpanel_browser_syndication.py", line 102, in test_create_collection
    "%s/@@syndication-controlpanel" % self.portal_url)
  File "/home/jenkins/.buildout/eggs/zope.testbrowser-3.11.1-py2.7.egg/zope/testbrowser/browser.py", line 240, in open
    self.mech_browser.open(url, data)
  File "/home/jenkins/.buildout/eggs/mechanize-0.2.5-py2.7.egg/mechanize/_mechanize.py", line 203, in open
    return self._mech_open(url, data, timeout=timeout)
  File "/home/jenkins/.buildout/eggs/mechanize-0.2.5-py2.7.egg/mechanize/_mechanize.py", line 230, in _mech_open
    response = UserAgentBase.open(self, request, data)
  File "/home/jenkins/.buildout/eggs/mechanize-0.2.5-py2.7.egg/mechanize/_opener.py", line 193, in open
    response = urlopen(self, req, data)
  File "/home/jenkins/.buildout/eggs/mechanize-0.2.5-py2.7.egg/mechanize/_urllib2_fork.py", line 344, in _open
    '_open', req)
  File "/home/jenkins/.buildout/eggs/mechanize-0.2.5-py2.7.egg/mechanize/_urllib2_fork.py", line 332, in _call_chain
    result = func(*args)
  File "/home/jenkins/.buildout/eggs/plone.testing-4.1.1-py2.7.egg/plone/testing/_z2_testbrowser.py", line 82, in http_open
    return self.do_open(connectionFactory, req)
  File "/usr/lib/python2.7/urllib2.py", line 1195, in do_open
    h.request(req.get_method(), req.get_selector(), req.data, headers)
  File "/home/jenkins/.buildout/eggs/zope.testbrowser-3.11.1-py2.7.egg/zope/testbrowser/testing.py", line 76, in request
    self.response = self.caller(request_string, handle_errors)
  File "/home/jenkins/.buildout/eggs/plone.testing-4.1.1-py2.7.egg/plone/testing/_z2_testbrowser.py", line 144, in wrapped_func
    return func(*args, **kw)
  File "/home/jenkins/.buildout/eggs/plone.testing-4.1.1-py2.7.egg/plone/testing/_z2_testbrowser.py", line 246, in __call__
    debug=not handle_errors,
  File "/home/jenkins/.buildout/eggs/Zope2-2.13.24-py2.7.egg/ZPublisher/Test.py", line 202, in publish_module
    response = publish(request, module_name, after_list, debug=debug)
  File "/home/jenkins/.buildout/eggs/Zope2-2.13.24-py2.7.egg/ZPublisher/Publish.py", line 138, in publish
    request, bind=1)
  File "/home/jenkins/.buildout/eggs/Zope2-2.13.24-py2.7.egg/ZPublisher/mapply.py", line 77, in mapply
    if debug is not None: return debug(object,args,context)
  File "/home/jenkins/.buildout/eggs/Zope2-2.13.24-py2.7.egg/ZPublisher/Publish.py", line 48, in call_object
    result=apply(object,args) # Type s<cr> to step into published object.
  File "/home/jenkins/.buildout/eggs/plone.z3cform-0.8.1-py2.7.egg/plone/z3cform/layout.py", line 66, in __call__
    self.update()
  File "/home/jenkins/.buildout/eggs/plone.z3cform-0.8.1-py2.7.egg/plone/z3cform/layout.py", line 50, in update
    self.form_instance.update()
  File "/home/jenkins/workspace/plone-5.0-python-2.7/src/Products.CMFPlone/Products/CMFPlone/controlpanel/browser/syndication.py", line 59, in update
    self.widgets['show_syndication_button'], show_settings_btn)
  File "/home/jenkins/workspace/plone-5.0-python-2.7/src/Products.CMFPlone/Products/CMFPlone/controlpanel/browser/syndication.py", line 43, in forceCheckboxValue
    for item in widget.items:


FAILED:  Products.CMFPlone.controlpanel.tests.test_controlpanel_browser_syndication.SyndicationControlPanelFunctionalTest.test_syndication_controlpanel_backlink

Error Message:
'instancemethod' object is not iterable

Stack Trace:
'instancemethod' object is not iterable

  File "/home/jenkins/.buildout/eggs/unittest2-0.5.1-py2.7.egg/unittest2/case.py", line 340, in run
    testMethod()
  File "/home/jenkins/workspace/plone-5.0-python-2.7/src/Products.CMFPlone/Products/CMFPlone/controlpanel/tests/test_controlpanel_browser_syndication.py", line 32, in test_syndication_controlpanel_backlink
    "%s/@@syndication-controlpanel" % self.portal_url)
  File "/home/jenkins/.buildout/eggs/zope.testbrowser-3.11.1-py2.7.egg/zope/testbrowser/browser.py", line 240, in open
    self.mech_browser.open(url, data)
  File "/home/jenkins/.buildout/eggs/mechanize-0.2.5-py2.7.egg/mechanize/_mechanize.py", line 203, in open
    return self._mech_open(url, data, timeout=timeout)
  File "/home/jenkins/.buildout/eggs/mechanize-0.2.5-py2.7.egg/mechanize/_mechanize.py", line 230, in _mech_open
    response = UserAgentBase.open(self, request, data)
  File "/home/jenkins/.buildout/eggs/mechanize-0.2.5-py2.7.egg/mechanize/_opener.py", line 193, in open
    response = urlopen(self, req, data)
  File "/home/jenkins/.buildout/eggs/mechanize-0.2.5-py2.7.egg/mechanize/_urllib2_fork.py", line 344, in _open
    '_open', req)
  File "/home/jenkins/.buildout/eggs/mechanize-0.2.5-py2.7.egg/mechanize/_urllib2_fork.py", line 332, in _call_chain
    result = func(*args)
  File "/home/jenkins/.buildout/eggs/plone.testing-4.1.1-py2.7.egg/plone/testing/_z2_testbrowser.py", line 82, in http_open
    return self.do_open(connectionFactory, req)
  File "/usr/lib/python2.7/urllib2.py", line 1195, in do_open
    h.request(req.get_method(), req.get_selector(), req.data, headers)
  File "/home/jenkins/.buildout/eggs/zope.testbrowser-3.11.1-py2.7.egg/zope/testbrowser/testing.py", line 76, in request
    self.response = self.caller(request_string, handle_errors)
  File "/home/jenkins/.buildout/eggs/plone.testing-4.1.1-py2.7.egg/plone/testing/_z2_testbrowser.py", line 144, in wrapped_func
    return func(*args, **kw)
  File "/home/jenkins/.buildout/eggs/plone.testing-4.1.1-py2.7.egg/plone/testing/_z2_testbrowser.py", line 246, in __call__
    debug=not handle_errors,
  File "/home/jenkins/.buildout/eggs/Zope2-2.13.24-py2.7.egg/ZPublisher/Test.py", line 202, in publish_module
    response = publish(request, module_name, after_list, debug=debug)
  File "/home/jenkins/.buildout/eggs/Zope2-2.13.24-py2.7.egg/ZPublisher/Publish.py", line 138, in publish
    request, bind=1)
  File "/home/jenkins/.buildout/eggs/Zope2-2.13.24-py2.7.egg/ZPublisher/mapply.py", line 77, in mapply
    if debug is not None: return debug(object,args,context)
  File "/home/jenkins/.buildout/eggs/Zope2-2.13.24-py2.7.egg/ZPublisher/Publish.py", line 48, in call_object
    result=apply(object,args) # Type s<cr> to step into published object.
  File "/home/jenkins/.buildout/eggs/plone.z3cform-0.8.1-py2.7.egg/plone/z3cform/layout.py", line 66, in __call__
    self.update()
  File "/home/jenkins/.buildout/eggs/plone.z3cform-0.8.1-py2.7.egg/plone/z3cform/layout.py", line 50, in update
    self.form_instance.update()
  File "/home/jenkins/workspace/plone-5.0-python-2.7/src/Products.CMFPlone/Products/CMFPlone/controlpanel/browser/syndication.py", line 59, in update
    self.widgets['show_syndication_button'], show_settings_btn)
  File "/home/jenkins/workspace/plone-5.0-python-2.7/src/Products.CMFPlone/Products/CMFPlone/controlpanel/browser/syndication.py", line 43, in forceCheckboxValue
    for item in widget.items:


FAILED:  Products.CMFPlone.controlpanel.tests.test_controlpanel_browser_syndication.SyndicationControlPanelFunctionalTest.test_syndication_controlpanel_enabled

Error Message:
'instancemethod' object is not iterable

Stack Trace:
'instancemethod' object is not iterable

  File "/home/jenkins/.buildout/eggs/unittest2-0.5.1-py2.7.egg/unittest2/case.py", line 340, in run
    testMethod()
  File "/home/jenkins/workspace/plone-5.0-python-2.7/src/Products.CMFPlone/Products/CMFPlone/controlpanel/tests/test_controlpanel_browser_syndication.py", line 51, in test_syndication_controlpanel_enabled
    "%s/@@syndication-controlpanel" % self.portal_url)
  File "/home/jenkins/.buildout/eggs/zope.testbrowser-3.11.1-py2.7.egg/zope/testbrowser/browser.py", line 240, in open
    self.mech_browser.open(url, data)
  File "/home/jenkins/.buildout/eggs/mechanize-0.2.5-py2.7.egg/mechanize/_mechanize.py", line 203, in open
    return self._mech_open(url, data, timeout=timeout)
  File "/home/jenkins/.buildout/eggs/mechanize-0.2.5-py2.7.egg/mechanize/_mechanize.py", line 230, in _mech_open
    response = UserAgentBase.open(self, request, data)
  File "/home/jenkins/.buildout/eggs/mechanize-0.2.5-py2.7.egg/mechanize/_opener.py", line 193, in open
    response = urlopen(self, req, data)
  File "/home/jenkins/.buildout/eggs/mechanize-0.2.5-py2.7.egg/mechanize/_urllib2_fork.py", line 344, in _open
    '_open', req)
  File "/home/jenkins/.buildout/eggs/mechanize-0.2.5-py2.7.egg/mechanize/_urllib2_fork.py", line 332, in _call_chain
    result = func(*args)
  File "/home/jenkins/.buildout/eggs/plone.testing-4.1.1-py2.7.egg/plone/testing/_z2_testbrowser.py", line 82, in http_open
    return self.do_open(connectionFactory, req)
  File "/usr/lib/python2.7/urllib2.py", line 1195, in do_open
    h.request(req.get_method(), req.get_selector(), req.data, headers)
  File "/home/jenkins/.buildout/eggs/zope.testbrowser-3.11.1-py2.7.egg/zope/testbrowser/testing.py", line 76, in request
    self.response = self.caller(request_string, handle_errors)
  File "/home/jenkins/.buildout/eggs/plone.testing-4.1.1-py2.7.egg/plone/testing/_z2_testbrowser.py", line 144, in wrapped_func
    return func(*args, **kw)
  File "/home/jenkins/.buildout/eggs/plone.testing-4.1.1-py2.7.egg/plone/testing/_z2_testbrowser.py", line 246, in __call__
    debug=not handle_errors,
  File "/home/jenkins/.buildout/eggs/Zope2-2.13.24-py2.7.egg/ZPublisher/Test.py", line 202, in publish_module
    response = publish(request, module_name, after_list, debug=debug)
  File "/home/jenkins/.buildout/eggs/Zope2-2.13.24-py2.7.egg/ZPublisher/Publish.py", line 138, in publish
    request, bind=1)
  File "/home/jenkins/.buildout/eggs/Zope2-2.13.24-py2.7.egg/ZPublisher/mapply.py", line 77, in mapply
    if debug is not None: return debug(object,args,context)
  File "/home/jenkins/.buildout/eggs/Zope2-2.13.24-py2.7.egg/ZPublisher/Publish.py", line 48, in call_object
    result=apply(object,args) # Type s<cr> to step into published object.
  File "/home/jenkins/.buildout/eggs/plone.z3cform-0.8.1-py2.7.egg/plone/z3cform/layout.py", line 66, in __call__
    self.update()
  File "/home/jenkins/.buildout/eggs/plone.z3cform-0.8.1-py2.7.egg/plone/z3cform/layout.py", line 50, in update
    self.form_instance.update()
  File "/home/jenkins/workspace/plone-5.0-python-2.7/src/Products.CMFPlone/Products/CMFPlone/controlpanel/browser/syndication.py", line 59, in update
    self.widgets['show_syndication_button'], show_settings_btn)
  File "/home/jenkins/workspace/plone-5.0-python-2.7/src/Products.CMFPlone/Products/CMFPlone/controlpanel/browser/syndication.py", line 43, in forceCheckboxValue
    for item in widget.items:


FAILED:  Products.CMFPlone.controlpanel.tests.test_controlpanel_browser_syndication.SyndicationControlPanelFunctionalTest.test_syndication_controlpanel_link

Error Message:
'instancemethod' object is not iterable

Stack Trace:
'instancemethod' object is not iterable

  File "/home/jenkins/.buildout/eggs/unittest2-0.5.1-py2.7.egg/unittest2/case.py", line 340, in run
    testMethod()
  File "/home/jenkins/workspace/plone-5.0-python-2.7/src/Products.CMFPlone/Products/CMFPlone/controlpanel/tests/test_controlpanel_browser_syndication.py", line 28, in test_syndication_controlpanel_link
    self.browser.getLink('Syndication').click()
  File "/home/jenkins/.buildout/eggs/zope.testbrowser-3.11.1-py2.7.egg/zope/testbrowser/browser.py", line 445, in click
    self.browser.mech_browser.follow_link(self.mech_link)
  File "/home/jenkins/.buildout/eggs/mechanize-0.2.5-py2.7.egg/mechanize/_mechanize.py", line 569, in follow_link
    return self.open(self.click_link(link, **kwds))
  File "/home/jenkins/.buildout/eggs/mechanize-0.2.5-py2.7.egg/mechanize/_mechanize.py", line 203, in open
    return self._mech_open(url, data, timeout=timeout)
  File "/home/jenkins/.buildout/eggs/mechanize-0.2.5-py2.7.egg/mechanize/_mechanize.py", line 230, in _mech_open
    response = UserAgentBase.open(self, request, data)
  File "/home/jenkins/.buildout/eggs/mechanize-0.2.5-py2.7.egg/mechanize/_opener.py", line 193, in open
    response = urlopen(self, req, data)
  File "/home/jenkins/.buildout/eggs/mechanize-0.2.5-py2.7.egg/mechanize/_urllib2_fork.py", line 344, in _open
    '_open', req)
  File "/home/jenkins/.buildout/eggs/mechanize-0.2.5-py2.7.egg/mechanize/_urllib2_fork.py", line 332, in _call_chain
    result = func(*args)
  File "/home/jenkins/.buildout/eggs/plone.testing-4.1.1-py2.7.egg/plone/testing/_z2_testbrowser.py", line 82, in http_open
    return self.do_open(connectionFactory, req)
  File "/usr/lib/python2.7/urllib2.py", line 1195, in do_open
    h.request(req.get_method(), req.get_selector(), req.data, headers)
  File "/home/jenkins/.buildout/eggs/zope.testbrowser-3.11.1-py2.7.egg/zope/testbrowser/testing.py", line 76, in request
    self.response = self.caller(request_string, handle_errors)
  File "/home/jenkins/.buildout/eggs/plone.testing-4.1.1-py2.7.egg/plone/testing/_z2_testbrowser.py", line 144, in wrapped_func
    return func(*args, **kw)
  File "/home/jenkins/.buildout/eggs/plone.testing-4.1.1-py2.7.egg/plone/testing/_z2_testbrowser.py", line 246, in __call__
    debug=not handle_errors,
  File "/home/jenkins/.buildout/eggs/Zope2-2.13.24-py2.7.egg/ZPublisher/Test.py", line 202, in publish_module
    response = publish(request, module_name, after_list, debug=debug)
  File "/home/jenkins/.buildout/eggs/Zope2-2.13.24-py2.7.egg/ZPublisher/Publish.py", line 138, in publish
    request, bind=1)
  File "/home/jenkins/.buildout/eggs/Zope2-2.13.24-py2.7.egg/ZPublisher/mapply.py", line 77, in mapply
    if debug is not None: return debug(object,args,context)
  File "/home/jenkins/.buildout/eggs/Zope2-2.13.24-py2.7.egg/ZPublisher/Publish.py", line 48, in call_object
    result=apply(object,args) # Type s<cr> to step into published object.
  File "/home/jenkins/.buildout/eggs/plone.z3cform-0.8.1-py2.7.egg/plone/z3cform/layout.py", line 66, in __call__
    self.update()
  File "/home/jenkins/.buildout/eggs/plone.z3cform-0.8.1-py2.7.egg/plone/z3cform/layout.py", line 50, in update
    self.form_instance.update()
  File "/home/jenkins/workspace/plone-5.0-python-2.7/src/Products.CMFPlone/Products/CMFPlone/controlpanel/browser/syndication.py", line 59, in update
    self.widgets['show_syndication_button'], show_settings_btn)
  File "/home/jenkins/workspace/plone-5.0-python-2.7/src/Products.CMFPlone/Products/CMFPlone/controlpanel/browser/syndication.py", line 43, in forceCheckboxValue
    for item in widget.items:


FAILED:  Products.CMFPlone.controlpanel.tests.test_controlpanel_browser_syndication.SyndicationControlPanelFunctionalTest.test_syndication_controlpanel_sidebar

Error Message:
'instancemethod' object is not iterable

Stack Trace:
'instancemethod' object is not iterable

  File "/home/jenkins/.buildout/eggs/unittest2-0.5.1-py2.7.egg/unittest2/case.py", line 340, in run
    testMethod()
  File "/home/jenkins/workspace/plone-5.0-python-2.7/src/Products.CMFPlone/Products/CMFPlone/controlpanel/tests/test_controlpanel_browser_syndication.py", line 37, in test_syndication_controlpanel_sidebar
    "%s/@@syndication-controlpanel" % self.portal_url)
  File "/home/jenkins/.buildout/eggs/zope.testbrowser-3.11.1-py2.7.egg/zope/testbrowser/browser.py", line 240, in open
    self.mech_browser.open(url, data)
  File "/home/jenkins/.buildout/eggs/mechanize-0.2.5-py2.7.egg/mechanize/_mechanize.py", line 203, in open
    return self._mech_open(url, data, timeout=timeout)
  File "/home/jenkins/.buildout/eggs/mechanize-0.2.5-py2.7.egg/mechanize/_mechanize.py", line 230, in _mech_open
    response = UserAgentBase.open(self, request, data)
  File "/home/jenkins/.buildout/eggs/mechanize-0.2.5-py2.7.egg/mechanize/_opener.py", line 193, in open
    response = urlopen(self, req, data)
  File "/home/jenkins/.buildout/eggs/mechanize-0.2.5-py2.7.egg/mechanize/_urllib2_fork.py", line 344, in _open
    '_open', req)
  File "/home/jenkins/.buildout/eggs/mechanize-0.2.5-py2.7.egg/mechanize/_urllib2_fork.py", line 332, in _call_chain
    result = func(*args)
  File "/home/jenkins/.buildout/eggs/plone.testing-4.1.1-py2.7.egg/plone/testing/_z2_testbrowser.py", line 82, in http_open
    return self.do_open(connectionFactory, req)
  File "/usr/lib/python2.7/urllib2.py", line 1195, in do_open
    h.request(req.get_method(), req.get_selector(), req.data, headers)
  File "/home/jenkins/.buildout/eggs/zope.testbrowser-3.11.1-py2.7.egg/zope/testbrowser/testing.py", line 76, in request
    self.response = self.caller(request_string, handle_errors)
  File "/home/jenkins/.buildout/eggs/plone.testing-4.1.1-py2.7.egg/plone/testing/_z2_testbrowser.py", line 144, in wrapped_func
    return func(*args, **kw)
  File "/home/jenkins/.buildout/eggs/plone.testing-4.1.1-py2.7.egg/plone/testing/_z2_testbrowser.py", line 246, in __call__
    debug=not handle_errors,
  File "/home/jenkins/.buildout/eggs/Zope2-2.13.24-py2.7.egg/ZPublisher/Test.py", line 202, in publish_module
    response = publish(request, module_name, after_list, debug=debug)
  File "/home/jenkins/.buildout/eggs/Zope2-2.13.24-py2.7.egg/ZPublisher/Publish.py", line 138, in publish
    request, bind=1)
  File "/home/jenkins/.buildout/eggs/Zope2-2.13.24-py2.7.egg/ZPublisher/mapply.py", line 77, in mapply
    if debug is not None: return debug(object,args,context)
  File "/home/jenkins/.buildout/eggs/Zope2-2.13.24-py2.7.egg/ZPublisher/Publish.py", line 48, in call_object
    result=apply(object,args) # Type s<cr> to step into published object.
  File "/home/jenkins/.buildout/eggs/plone.z3cform-0.8.1-py2.7.egg/plone/z3cform/layout.py", line 66, in __call__
    self.update()
  File "/home/jenkins/.buildout/eggs/plone.z3cform-0.8.1-py2.7.egg/plone/z3cform/layout.py", line 50, in update
    self.form_instance.update()
  File "/home/jenkins/workspace/plone-5.0-python-2.7/src/Products.CMFPlone/Products/CMFPlone/controlpanel/browser/syndication.py", line 59, in update
    self.widgets['show_syndication_button'], show_settings_btn)
  File "/home/jenkins/workspace/plone-5.0-python-2.7/src/Products.CMFPlone/Products/CMFPlone/controlpanel/browser/syndication.py", line 43, in forceCheckboxValue
    for item in widget.items:


FAILED:  Products.CMFPlone.controlpanel.tests.test_controlpanel_browser_syndication.SyndicationControlPanelFunctionalTest.test_syndication_controlpanel_view

Error Message:
'instancemethod' object is not iterable

Stack Trace:
'instancemethod' object is not iterable

  File "/home/jenkins/.buildout/eggs/unittest2-0.5.1-py2.7.egg/unittest2/case.py", line 340, in run
    testMethod()
  File "/home/jenkins/workspace/plone-5.0-python-2.7/src/Products.CMFPlone/Products/CMFPlone/controlpanel/tests/test_controlpanel_browser_syndication.py", line 47, in test_syndication_controlpanel_view
    self.assertTrue(view())
  File "/home/jenkins/.buildout/eggs/plone.z3cform-0.8.1-py2.7.egg/plone/z3cform/layout.py", line 66, in __call__
    self.update()
  File "/home/jenkins/.buildout/eggs/plone.z3cform-0.8.1-py2.7.egg/plone/z3cform/layout.py", line 50, in update
    self.form_instance.update()
  File "/home/jenkins/workspace/plone-5.0-python-2.7/src/Products.CMFPlone/Products/CMFPlone/controlpanel/browser/syndication.py", line 59, in update
    self.widgets['show_syndication_button'], show_settings_btn)
  File "/home/jenkins/workspace/plone-5.0-python-2.7/src/Products.CMFPlone/Products/CMFPlone/controlpanel/browser/syndication.py", line 43, in forceCheckboxValue
    for item in widget.items:


FAILED:  plone.app.contenttypes.tests.test_migration.MigrationFunctionalTests.test_atct_migration_form

Error Message:
object of type 'instancemethod' has no len()

Stack Trace:
object of type 'instancemethod' has no len()

  File "/home/jenkins/.buildout/eggs/unittest2-0.5.1-py2.7.egg/unittest2/case.py", line 340, in run
    testMethod()
  File "/home/jenkins/.buildout/eggs/plone.app.contenttypes-1.2.17-py2.7.egg/plone/app/contenttypes/tests/test_migration.py", line 2117, in test_atct_migration_form
    self.browser.getControl('Install').click()
  File "/home/jenkins/.buildout/eggs/zope.testbrowser-3.11.1-py2.7.egg/zope/testbrowser/browser.py", line 639, in click
    self.browser._clickSubmit(self.mech_form, self.mech_control, (1,1))
  File "/home/jenkins/.buildout/eggs/zope.testbrowser-3.11.1-py2.7.egg/zope/testbrowser/browser.py", line 418, in _clickSubmit
    label=label, coord=coord)
  File "/home/jenkins/.buildout/eggs/mechanize-0.2.5-py2.7.egg/mechanize/_mechanize.py", line 541, in submit
    return self.open(self.click(*args, **kwds))
  File "/home/jenkins/.buildout/eggs/mechanize-0.2.5-py2.7.egg/mechanize/_mechanize.py", line 203, in open
    return self._mech_open(url, data, timeout=timeout)
  File "/home/jenkins/.buildout/eggs/mechanize-0.2.5-py2.7.egg/mechanize/_mechanize.py", line 230, in _mech_open
    response = UserAgentBase.open(self, request, data)
  File "/home/jenkins/.buildout/eggs/mechanize-0.2.5-py2.7.egg/mechanize/_opener.py", line 204, in open
    response = meth(req, response)
  File "/home/jenkins/.buildout/eggs/mechanize-0.2.5-py2.7.egg/mechanize/_urllib2_fork.py", line 457, in http_response
    'http', request, response, code, msg, hdrs)
  File "/home/jenkins/.buildout/eggs/mechanize-0.2.5-py2.7.egg/mechanize/_opener.py", line 221, in error
    result = apply(self._call_chain, args)
  File "/home/jenkins/.buildout/eggs/mechanize-0.2.5-py2.7.egg/mechanize/_urllib2_fork.py", line 332, in _call_chain
    result = func(*args)
  File "/home/jenkins/.buildout/eggs/mechanize-0.2.5-py2.7.egg/mechanize/_urllib2_fork.py", line 571, in http_error_302
    return self.parent.open(new)
  File "/home/jenkins/.buildout/eggs/mechanize-0.2.5-py2.7.egg/mechanize/_mechanize.py", line 203, in open
    return self._mech_open(url, data, timeout=timeout)
  File "/home/jenkins/.buildout/eggs/mechanize-0.2.5-py2.7.egg/mechanize/_mechanize.py", line 230, in _mech_open
    response = UserAgentBase.open(self, request, data)
  File "/home/jenkins/.buildout/eggs/mechanize-0.2.5-py2.7.egg/mechanize/_opener.py", line 193, in open
    response = urlopen(self, req, data)
  File "/home/jenkins/.buildout/eggs/mechanize-0.2.5-py2.7.egg/mechanize/_urllib2_fork.py", line 344, in _open
    '_open', req)
  File "/home/jenkins/.buildout/eggs/mechanize-0.2.5-py2.7.egg/mechanize/_urllib2_fork.py", line 332, in _call_chain
    result = func(*args)
  File "/home/jenkins/.buildout/eggs/plone.testing-4.1.1-py2.7.egg/plone/testing/_z2_testbrowser.py", line 82, in http_open
    return self.do_open(connectionFactory, req)
  File "/usr/lib/python2.7/urllib2.py", line 1195, in do_open
    h.request(req.get_method(), req.get_selector(), req.data, headers)
  File "/home/jenkins/.buildout/eggs/zope.testbrowser-3.11.1-py2.7.egg/zope/testbrowser/testing.py", line 76, in request
    self.response = self.caller(request_string, handle_errors)
  File "/home/jenkins/.buildout/eggs/plone.testing-4.1.1-py2.7.egg/plone/testing/_z2_testbrowser.py", line 144, in wrapped_func
    return func(*args, **kw)
  File "/home/jenkins/.buildout/eggs/plone.testing-4.1.1-py2.7.egg/plone/testing/_z2_testbrowser.py", line 246, in __call__
    debug=not handle_errors,
  File "/home/jenkins/.buildout/eggs/Zope2-2.13.24-py2.7.egg/ZPublisher/Test.py", line 202, in publish_module
    response = publish(request, module_name, after_list, debug=debug)
  File "/home/jenkins/.buildout/eggs/Zope2-2.13.24-py2.7.egg/ZPublisher/Publish.py", line 138, in publish
    request, bind=1)
  File "/home/jenkins/.buildout/eggs/Zope2-2.13.24-py2.7.egg/ZPublisher/mapply.py", line 77, in mapply
    if debug is not None: return debug(object,args,context)
  File "/home/jenkins/.buildout/eggs/Zope2-2.13.24-py2.7.egg/ZPublisher/Publish.py", line 48, in call_object
    result=apply(object,args) # Type s<cr> to step into published object.
  File "/home/jenkins/.buildout/eggs/plone.z3cform-0.8.1-py2.7.egg/plone/z3cform/layout.py", line 66, in __call__
    self.update()
  File "/home/jenkins/.buildout/eggs/plone.z3cform-0.8.1-py2.7.egg/plone/z3cform/layout.py", line 50, in update
    self.form_instance.update()
  File "/home/jenkins/.buildout/eggs/z3c.form-3.2.10-py2.7.egg/z3c/form/form.py", line 226, in update
    super(Form, self).update()
  File "/home/jenkins/.buildout/eggs/plone.z3cform-0.8.1-py2.7.egg/plone/z3cform/patch.py", line 21, in BaseForm_update
    _original_BaseForm_update(self)
  File "/home/jenkins/.buildout/eggs/z3c.form-3.2.10-py2.7.egg/z3c/form/form.py", line 154, in update
    self.updateWidgets()
  File "/home/jenkins/.buildout/eggs/plone.app.contenttypes-1.2.17-py2.7.egg/plone/app/contenttypes/migration/browser.py", line 413, in updateWidgets
    if not len(widget.items):


FAILED:  plone.app.contenttypes.tests.test_migration.MigrationFunctionalTests.test_pac_installer_with_content

Error Message:
object of type 'instancemethod' has no len()

Stack Trace:
object of type 'instancemethod' has no len()

  File "/home/jenkins/.buildout/eggs/unittest2-0.5.1-py2.7.egg/unittest2/case.py", line 340, in run
    testMethod()
  File "/home/jenkins/.buildout/eggs/plone.app.contenttypes-1.2.17-py2.7.egg/plone/app/contenttypes/tests/test_migration.py", line 2074, in test_pac_installer_with_content
    self.browser.getControl('Install').click()
  File "/home/jenkins/.buildout/eggs/zope.testbrowser-3.11.1-py2.7.egg/zope/testbrowser/browser.py", line 639, in click
    self.browser._clickSubmit(self.mech_form, self.mech_control, (1,1))
  File "/home/jenkins/.buildout/eggs/zope.testbrowser-3.11.1-py2.7.egg/zope/testbrowser/browser.py", line 418, in _clickSubmit
    label=label, coord=coord)
  File "/home/jenkins/.buildout/eggs/mechanize-0.2.5-py2.7.egg/mechanize/_mechanize.py", line 541, in submit
    return self.open(self.click(*args, **kwds))
  File "/home/jenkins/.buildout/eggs/mechanize-0.2.5-py2.7.egg/mechanize/_mechanize.py", line 203, in open
    return self._mech_open(url, data, timeout=timeout)
  File "/home/jenkins/.buildout/eggs/mechanize-0.2.5-py2.7.egg/mechanize/_mechanize.py", line 230, in _mech_open
    response = UserAgentBase.open(self, request, data)
  File "/home/jenkins/.buildout/eggs/mechanize-0.2.5-py2.7.egg/mechanize/_opener.py", line 204, in open
    response = meth(req, response)
  File "/home/jenkins/.buildout/eggs/mechanize-0.2.5-py2.7.egg/mechanize/_urllib2_fork.py", line 457, in http_response
    'http', request, response, code, msg, hdrs)
  File "/home/jenkins/.buildout/eggs/mechanize-0.2.5-py2.7.egg/mechanize/_opener.py", line 221, in error
    result = apply(self._call_chain, args)
  File "/home/jenkins/.buildout/eggs/mechanize-0.2.5-py2.7.egg/mechanize/_urllib2_fork.py", line 332, in _call_chain
    result = func(*args)
  File "/home/jenkins/.buildout/eggs/mechanize-0.2.5-py2.7.egg/mechanize/_urllib2_fork.py", line 571, in http_error_302
    return self.parent.open(new)
  File "/home/jenkins/.buildout/eggs/mechanize-0.2.5-py2.7.egg/mechanize/_mechanize.py", line 203, in open
    return self._mech_open(url, data, timeout=timeout)
  File "/home/jenkins/.buildout/eggs/mechanize-0.2.5-py2.7.egg/mechanize/_mechanize.py", line 230, in _mech_open
    response = UserAgentBase.open(self, request, data)
  File "/home/jenkins/.buildout/eggs/mechanize-0.2.5-py2.7.egg/mechanize/_opener.py", line 193, in open
    response = urlopen(self, req, data)
  File "/home/jenkins/.buildout/eggs/mechanize-0.2.5-py2.7.egg/mechanize/_urllib2_fork.py", line 344, in _open
    '_open', req)
  File "/home/jenkins/.buildout/eggs/mechanize-0.2.5-py2.7.egg/mechanize/_urllib2_fork.py", line 332, in _call_chain
    result = func(*args)
  File "/home/jenkins/.buildout/eggs/plone.testing-4.1.1-py2.7.egg/plone/testing/_z2_testbrowser.py", line 82, in http_open
    return self.do_open(connectionFactory, req)
  File "/usr/lib/python2.7/urllib2.py", line 1195, in do_open
    h.request(req.get_method(), req.get_selector(), req.data, headers)
  File "/home/jenkins/.buildout/eggs/zope.testbrowser-3.11.1-py2.7.egg/zope/testbrowser/testing.py", line 76, in request
    self.response = self.caller(request_string, handle_errors)
  File "/home/jenkins/.buildout/eggs/plone.testing-4.1.1-py2.7.egg/plone/testing/_z2_testbrowser.py", line 144, in wrapped_func
    return func(*args, **kw)
  File "/home/jenkins/.buildout/eggs/plone.testing-4.1.1-py2.7.egg/plone/testing/_z2_testbrowser.py", line 246, in __call__
    debug=not handle_errors,
  File "/home/jenkins/.buildout/eggs/Zope2-2.13.24-py2.7.egg/ZPublisher/Test.py", line 202, in publish_module
    response = publish(request, module_name, after_list, debug=debug)
  File "/home/jenkins/.buildout/eggs/Zope2-2.13.24-py2.7.egg/ZPublisher/Publish.py", line 138, in publish
    request, bind=1)
  File "/home/jenkins/.buildout/eggs/Zope2-2.13.24-py2.7.egg/ZPublisher/mapply.py", line 77, in mapply
    if debug is not None: return debug(object,args,context)
  File "/home/jenkins/.buildout/eggs/Zope2-2.13.24-py2.7.egg/ZPublisher/Publish.py", line 48, in call_object
    result=apply(object,args) # Type s<cr> to step into published object.
  File "/home/jenkins/.buildout/eggs/plone.z3cform-0.8.1-py2.7.egg/plone/z3cform/layout.py", line 66, in __call__
    self.update()
  File "/home/jenkins/.buildout/eggs/plone.z3cform-0.8.1-py2.7.egg/plone/z3cform/layout.py", line 50, in update
    self.form_instance.update()
  File "/home/jenkins/.buildout/eggs/z3c.form-3.2.10-py2.7.egg/z3c/form/form.py", line 226, in update
    super(Form, self).update()
  File "/home/jenkins/.buildout/eggs/plone.z3cform-0.8.1-py2.7.egg/plone/z3cform/patch.py", line 21, in BaseForm_update
    _original_BaseForm_update(self)
  File "/home/jenkins/.buildout/eggs/z3c.form-3.2.10-py2.7.egg/z3c/form/form.py", line 154, in update
    self.updateWidgets()
  File "/home/jenkins/.buildout/eggs/plone.app.contenttypes-1.2.17-py2.7.egg/plone/app/contenttypes/migration/browser.py", line 413, in updateWidgets
    if not len(widget.items):


FAILED:  plone.app.contenttypes.tests.test_migration.MigrationFunctionalTests.test_pac_installer_without_content

Error Message:
object of type 'instancemethod' has no len()

Stack Trace:
object of type 'instancemethod' has no len()

  File "/home/jenkins/.buildout/eggs/unittest2-0.5.1-py2.7.egg/unittest2/case.py", line 340, in run
    testMethod()
  File "/home/jenkins/.buildout/eggs/plone.app.contenttypes-1.2.17-py2.7.egg/plone/app/contenttypes/tests/test_migration.py", line 2057, in test_pac_installer_without_content
    self.browser.getControl('Install').click()
  File "/home/jenkins/.buildout/eggs/zope.testbrowser-3.11.1-py2.7.egg/zope/testbrowser/browser.py", line 639, in click
    self.browser._clickSubmit(self.mech_form, self.mech_control, (1,1))
  File "/home/jenkins/.buildout/eggs/zope.testbrowser-3.11.1-py2.7.egg/zope/testbrowser/browser.py", line 418, in _clickSubmit
    label=label, coord=coord)
  File "/home/jenkins/.buildout/eggs/mechanize-0.2.5-py2.7.egg/mechanize/_mechanize.py", line 541, in submit
    return self.open(self.click(*args, **kwds))
  File "/home/jenkins/.buildout/eggs/mechanize-0.2.5-py2.7.egg/mechanize/_mechanize.py", line 203, in open
    return self._mech_open(url, data, timeout=timeout)
  File "/home/jenkins/.buildout/eggs/mechanize-0.2.5-py2.7.egg/mechanize/_mechanize.py", line 230, in _mech_open
    response = UserAgentBase.open(self, request, data)
  File "/home/jenkins/.buildout/eggs/mechanize-0.2.5-py2.7.egg/mechanize/_opener.py", line 204, in open
    response = meth(req, response)
  File "/home/jenkins/.buildout/eggs/mechanize-0.2.5-py2.7.egg/mechanize/_urllib2_fork.py", line 457, in http_response
    'http', request, response, code, msg, hdrs)
  File "/home/jenkins/.buildout/eggs/mechanize-0.2.5-py2.7.egg/mechanize/_opener.py", line 221, in error
    result = apply(self._call_chain, args)
  File "/home/jenkins/.buildout/eggs/mechanize-0.2.5-py2.7.egg/mechanize/_urllib2_fork.py", line 332, in _call_chain
    result = func(*args)
  File "/home/jenkins/.buildout/eggs/mechanize-0.2.5-py2.7.egg/mechanize/_urllib2_fork.py", line 571, in http_error_302
    return self.parent.open(new)
  File "/home/jenkins/.buildout/eggs/mechanize-0.2.5-py2.7.egg/mechanize/_mechanize.py", line 203, in open
    return self._mech_open(url, data, timeout=timeout)
  File "/home/jenkins/.buildout/eggs/mechanize-0.2.5-py2.7.egg/mechanize/_mechanize.py", line 230, in _mech_open
    response = UserAgentBase.open(self, request, data)
  File "/home/jenkins/.buildout/eggs/mechanize-0.2.5-py2.7.egg/mechanize/_opener.py", line 193, in open
    response = urlopen(self, req, data)
  File "/home/jenkins/.buildout/eggs/mechanize-0.2.5-py2.7.egg/mechanize/_urllib2_fork.py", line 344, in _open
    '_open', req)
  File "/home/jenkins/.buildout/eggs/mechanize-0.2.5-py2.7.egg/mechanize/_urllib2_fork.py", line 332, in _call_chain
    result = func(*args)
  File "/home/jenkins/.buildout/eggs/plone.testing-4.1.1-py2.7.egg/plone/testing/_z2_testbrowser.py", line 82, in http_open
    return self.do_open(connectionFactory, req)
  File "/usr/lib/python2.7/urllib2.py", line 1195, in do_open
    h.request(req.get_method(), req.get_selector(), req.data, headers)
  File "/home/jenkins/.buildout/eggs/zope.testbrowser-3.11.1-py2.7.egg/zope/testbrowser/testing.py", line 76, in request
    self.response = self.caller(request_string, handle_errors)
  File "/home/jenkins/.buildout/eggs/plone.testing-4.1.1-py2.7.egg/plone/testing/_z2_testbrowser.py", line 144, in wrapped_func
    return func(*args, **kw)
  File "/home/jenkins/.buildout/eggs/plone.testing-4.1.1-py2.7.egg/plone/testing/_z2_testbrowser.py", line 246, in __call__
    debug=not handle_errors,
  File "/home/jenkins/.buildout/eggs/Zope2-2.13.24-py2.7.egg/ZPublisher/Test.py", line 202, in publish_module
    response = publish(request, module_name, after_list, debug=debug)
  File "/home/jenkins/.buildout/eggs/Zope2-2.13.24-py2.7.egg/ZPublisher/Publish.py", line 138, in publish
    request, bind=1)
  File "/home/jenkins/.buildout/eggs/Zope2-2.13.24-py2.7.egg/ZPublisher/mapply.py", line 77, in mapply
    if debug is not None: return debug(object,args,context)
  File "/home/jenkins/.buildout/eggs/Zope2-2.13.24-py2.7.egg/ZPublisher/Publish.py", line 48, in call_object
    result=apply(object,args) # Type s<cr> to step into published object.
  File "/home/jenkins/.buildout/eggs/plone.z3cform-0.8.1-py2.7.egg/plone/z3cform/layout.py", line 66, in __call__
    self.update()
  File "/home/jenkins/.buildout/eggs/plone.z3cform-0.8.1-py2.7.egg/plone/z3cform/layout.py", line 50, in update
    self.form_instance.update()
  File "/home/jenkins/.buildout/eggs/z3c.form-3.2.10-py2.7.egg/z3c/form/form.py", line 226, in update
    super(Form, self).update()
  File "/home/jenkins/.buildout/eggs/plone.z3cform-0.8.1-py2.7.egg/plone/z3cform/patch.py", line 21, in BaseForm_update
    _original_BaseForm_update(self)
  File "/home/jenkins/.buildout/eggs/z3c.form-3.2.10-py2.7.egg/z3c/form/form.py", line 154, in update
    self.updateWidgets()
  File "/home/jenkins/.buildout/eggs/plone.app.contenttypes-1.2.17-py2.7.egg/plone/app/contenttypes/migration/browser.py", line 413, in updateWidgets
    if not len(widget.items):


FAILED:  plone.app.contenttypes.tests.test_migration_custom.CustomMigrationFunctionalTests.test_custom_migration_form

Error Message:
object of type 'instancemethod' has no len()

Stack Trace:
object of type 'instancemethod' has no len()

  File "/home/jenkins/.buildout/eggs/unittest2-0.5.1-py2.7.egg/unittest2/case.py", line 340, in run
    testMethod()
  File "/home/jenkins/.buildout/eggs/plone.app.contenttypes-1.2.17-py2.7.egg/plone/app/contenttypes/tests/test_migration_custom.py", line 496, in test_custom_migration_form
    self.browser.getControl('Install').click()
  File "/home/jenkins/.buildout/eggs/zope.testbrowser-3.11.1-py2.7.egg/zope/testbrowser/browser.py", line 639, in click
    self.browser._clickSubmit(self.mech_form, self.mech_control, (1,1))
  File "/home/jenkins/.buildout/eggs/zope.testbrowser-3.11.1-py2.7.egg/zope/testbrowser/browser.py", line 418, in _clickSubmit
    label=label, coord=coord)
  File "/home/jenkins/.buildout/eggs/mechanize-0.2.5-py2.7.egg/mechanize/_mechanize.py", line 541, in submit
    return self.open(self.click(*args, **kwds))
  File "/home/jenkins/.buildout/eggs/mechanize-0.2.5-py2.7.egg/mechanize/_mechanize.py", line 203, in open
    return self._mech_open(url, data, timeout=timeout)
  File "/home/jenkins/.buildout/eggs/mechanize-0.2.5-py2.7.egg/mechanize/_mechanize.py", line 230, in _mech_open
    response = UserAgentBase.open(self, request, data)
  File "/home/jenkins/.buildout/eggs/mechanize-0.2.5-py2.7.egg/mechanize/_opener.py", line 204, in open
    response = meth(req, response)
  File "/home/jenkins/.buildout/eggs/mechanize-0.2.5-py2.7.egg/mechanize/_urllib2_fork.py", line 457, in http_response
    'http', request, response, code, msg, hdrs)
  File "/home/jenkins/.buildout/eggs/mechanize-0.2.5-py2.7.egg/mechanize/_opener.py", line 221, in error
    result = apply(self._call_chain, args)
  File "/home/jenkins/.buildout/eggs/mechanize-0.2.5-py2.7.egg/mechanize/_urllib2_fork.py", line 332, in _call_chain
    result = func(*args)
  File "/home/jenkins/.buildout/eggs/mechanize-0.2.5-py2.7.egg/mechanize/_urllib2_fork.py", line 571, in http_error_302
    return self.parent.open(new)
  File "/home/jenkins/.buildout/eggs/mechanize-0.2.5-py2.7.egg/mechanize/_mechanize.py", line 203, in open
    return self._mech_open(url, data, timeout=timeout)
  File "/home/jenkins/.buildout/eggs/mechanize-0.2.5-py2.7.egg/mechanize/_mechanize.py", line 230, in _mech_open
    response = UserAgentBase.open(self, request, data)
  File "/home/jenkins/.buildout/eggs/mechanize-0.2.5-py2.7.egg/mechanize/_opener.py", line 193, in open
    response = urlopen(self, req, data)
  File "/home/jenkins/.buildout/eggs/mechanize-0.2.5-py2.7.egg/mechanize/_urllib2_fork.py", line 344, in _open
    '_open', req)
  File "/home/jenkins/.buildout/eggs/mechanize-0.2.5-py2.7.egg/mechanize/_urllib2_fork.py", line 332, in _call_chain
    result = func(*args)
  File "/home/jenkins/.buildout/eggs/plone.testing-4.1.1-py2.7.egg/plone/testing/_z2_testbrowser.py", line 82, in http_open
    return self.do_open(connectionFactory, req)
  File "/usr/lib/python2.7/urllib2.py", line 1195, in do_open
    h.request(req.get_method(), req.get_selector(), req.data, headers)
  File "/home/jenkins/.buildout/eggs/zope.testbrowser-3.11.1-py2.7.egg/zope/testbrowser/testing.py", line 76, in request
    self.response = self.caller(request_string, handle_errors)
  File "/home/jenkins/.buildout/eggs/plone.testing-4.1.1-py2.7.egg/plone/testing/_z2_testbrowser.py", line 144, in wrapped_func
    return func(*args, **kw)
  File "/home/jenkins/.buildout/eggs/plone.testing-4.1.1-py2.7.egg/plone/testing/_z2_testbrowser.py", line 246, in __call__
    debug=not handle_errors,
  File "/home/jenkins/.buildout/eggs/Zope2-2.13.24-py2.7.egg/ZPublisher/Test.py", line 202, in publish_module
    response = publish(request, module_name, after_list, debug=debug)
  File "/home/jenkins/.buildout/eggs/Zope2-2.13.24-py2.7.egg/ZPublisher/Publish.py", line 138, in publish
    request, bind=1)
  File "/home/jenkins/.buildout/eggs/Zope2-2.13.24-py2.7.egg/ZPublisher/mapply.py", line 77, in mapply
    if debug is not None: return debug(object,args,context)
  File "/home/jenkins/.buildout/eggs/Zope2-2.13.24-py2.7.egg/ZPublisher/Publish.py", line 48, in call_object
    result=apply(object,args) # Type s<cr> to step into published object.
  File "/home/jenkins/.buildout/eggs/plone.z3cform-0.8.1-py2.7.egg/plone/z3cform/layout.py", line 66, in __call__
    self.update()
  File "/home/jenkins/.buildout/eggs/plone.z3cform-0.8.1-py2.7.egg/plone/z3cform/layout.py", line 50, in update
    self.form_instance.update()
  File "/home/jenkins/.buildout/eggs/z3c.form-3.2.10-py2.7.egg/z3c/form/form.py", line 226, in update
    super(Form, self).update()
  File "/home/jenkins/.buildout/eggs/plone.z3cform-0.8.1-py2.7.egg/plone/z3cform/patch.py", line 21, in BaseForm_update
    _original_BaseForm_update(self)
  File "/home/jenkins/.buildout/eggs/z3c.form-3.2.10-py2.7.egg/z3c/form/form.py", line 154, in update
    self.updateWidgets()
  File "/home/jenkins/.buildout/eggs/plone.app.contenttypes-1.2.17-py2.7.egg/plone/app/contenttypes/migration/browser.py", line 413, in updateWidgets
    if not len(widget.items):


FAILED:  plone.app.contenttypes.tests.test_migration_custom.CustomMigrationFunctionalTests.test_custom_migration_form_for_types_with_spaces

Error Message:
object of type 'instancemethod' has no len()

Stack Trace:
object of type 'instancemethod' has no len()

  File "/home/jenkins/.buildout/eggs/unittest2-0.5.1-py2.7.egg/unittest2/case.py", line 340, in run
    testMethod()
  File "/home/jenkins/.buildout/eggs/plone.app.contenttypes-1.2.17-py2.7.egg/plone/app/contenttypes/tests/test_migration_custom.py", line 539, in test_custom_migration_form_for_types_with_spaces
    self.browser.getControl('Install').click()
  File "/home/jenkins/.buildout/eggs/zope.testbrowser-3.11.1-py2.7.egg/zope/testbrowser/browser.py", line 639, in click
    self.browser._clickSubmit(self.mech_form, self.mech_control, (1,1))
  File "/home/jenkins/.buildout/eggs/zope.testbrowser-3.11.1-py2.7.egg/zope/testbrowser/browser.py", line 418, in _clickSubmit
    label=label, coord=coord)
  File "/home/jenkins/.buildout/eggs/mechanize-0.2.5-py2.7.egg/mechanize/_mechanize.py", line 541, in submit
    return self.open(self.click(*args, **kwds))
  File "/home/jenkins/.buildout/eggs/mechanize-0.2.5-py2.7.egg/mechanize/_mechanize.py", line 203, in open
    return self._mech_open(url, data, timeout=timeout)
  File "/home/jenkins/.buildout/eggs/mechanize-0.2.5-py2.7.egg/mechanize/_mechanize.py", line 230, in _mech_open
    response = UserAgentBase.open(self, request, data)
  File "/home/jenkins/.buildout/eggs/mechanize-0.2.5-py2.7.egg/mechanize/_opener.py", line 204, in open
    response = meth(req, response)
  File "/home/jenkins/.buildout/eggs/mechanize-0.2.5-py2.7.egg/mechanize/_urllib2_fork.py", line 457, in http_response
    'http', request, response, code, msg, hdrs)
  File "/home/jenkins/.buildout/eggs/mechanize-0.2.5-py2.7.egg/mechanize/_opener.py", line 221, in error
    result = apply(self._call_chain, args)
  File "/home/jenkins/.buildout/eggs/mechanize-0.2.5-py2.7.egg/mechanize/_urllib2_fork.py", line 332, in _call_chain
    result = func(*args)
  File "/home/jenkins/.buildout/eggs/mechanize-0.2.5-py2.7.egg/mechanize/_urllib2_fork.py", line 571, in http_error_302
    return self.parent.open(new)
  File "/home/jenkins/.buildout/eggs/mechanize-0.2.5-py2.7.egg/mechanize/_mechanize.py", line 203, in open
    return self._mech_open(url, data, timeout=timeout)
  File "/home/jenkins/.buildout/eggs/mechanize-0.2.5-py2.7.egg/mechanize/_mechanize.py", line 230, in _mech_open
    response = UserAgentBase.open(self, request, data)
  File "/home/jenkins/.buildout/eggs/mechanize-0.2.5-py2.7.egg/mechanize/_opener.py", line 193, in open
    response = urlopen(self, req, data)
  File "/home/jenkins/.buildout/eggs/mechanize-0.2.5-py2.7.egg/mechanize/_urllib2_fork.py", line 344, in _open
    '_open', req)
  File "/home/jenkins/.buildout/eggs/mechanize-0.2.5-py2.7.egg/mechanize/_urllib2_fork.py", line 332, in _call_chain
    result = func(*args)
  File "/home/jenkins/.buildout/eggs/plone.testing-4.1.1-py2.7.egg/plone/testing/_z2_testbrowser.py", line 82, in http_open
    return self.do_open(connectionFactory, req)
  File "/usr/lib/python2.7/urllib2.py", line 1195, in do_open
    h.request(req.get_method(), req.get_selector(), req.data, headers)
  File "/home/jenkins/.buildout/eggs/zope.testbrowser-3.11.1-py2.7.egg/zope/testbrowser/testing.py", line 76, in request
    self.response = self.caller(request_string, handle_errors)
  File "/home/jenkins/.buildout/eggs/plone.testing-4.1.1-py2.7.egg/plone/testing/_z2_testbrowser.py", line 144, in wrapped_func
    return func(*args, **kw)
  File "/home/jenkins/.buildout/eggs/plone.testing-4.1.1-py2.7.egg/plone/testing/_z2_testbrowser.py", line 246, in __call__
    debug=not handle_errors,
  File "/home/jenkins/.buildout/eggs/Zope2-2.13.24-py2.7.egg/ZPublisher/Test.py", line 202, in publish_module
    response = publish(request, module_name, after_list, debug=debug)
  File "/home/jenkins/.buildout/eggs/Zope2-2.13.24-py2.7.egg/ZPublisher/Publish.py", line 138, in publish
    request, bind=1)
  File "/home/jenkins/.buildout/eggs/Zope2-2.13.24-py2.7.egg/ZPublisher/mapply.py", line 77, in mapply
    if debug is not None: return debug(object,args,context)
  File "/home/jenkins/.buildout/eggs/Zope2-2.13.24-py2.7.egg/ZPublisher/Publish.py", line 48, in call_object
    result=apply(object,args) # Type s<cr> to step into published object.
  File "/home/jenkins/.buildout/eggs/plone.z3cform-0.8.1-py2.7.egg/plone/z3cform/layout.py", line 66, in __call__
    self.update()
  File "/home/jenkins/.buildout/eggs/plone.z3cform-0.8.1-py2.7.egg/plone/z3cform/layout.py", line 50, in update
    self.form_instance.update()
  File "/home/jenkins/.buildout/eggs/z3c.form-3.2.10-py2.7.egg/z3c/form/form.py", line 226, in update
    super(Form, self).update()
  File "/home/jenkins/.buildout/eggs/plone.z3cform-0.8.1-py2.7.egg/plone/z3cform/patch.py", line 21, in BaseForm_update
    _original_BaseForm_update(self)
  File "/home/jenkins/.buildout/eggs/z3c.form-3.2.10-py2.7.egg/z3c/form/form.py", line 154, in update
    self.updateWidgets()
  File "/home/jenkins/.buildout/eggs/plone.app.contenttypes-1.2.17-py2.7.egg/plone/app/contenttypes/migration/browser.py", line 413, in updateWidgets
    if not len(widget.items):





More information about the Testbot mailing list