[Testbot] Plone 4.3 - Python 2.6 - Build # 1568 - Failure!

jenkins at plone.org jenkins at plone.org
Wed Aug 17 21:03:39 UTC 2016


Plone 4.3 - Python 2.6 - Build # 1568 - Failure:

Check console output at http://jenkins.plone.org/job/plone-4.3-python-2.6/1568/ to view the results.

Changes:

[paul] [fc] Repository: plone.app.robotframework Branch: refs/heads/master







Test Results:

3 tests failed.
FAILED:  Products.CMFPlone.tests.test_robot.RobotTestCase.Scenario Change default content item of a folder overlay closes

Error Message:
Setup failed:

Stack Trace:
Setup failed:
Page should have contained element 'css=#archetypes-fieldname-title input' but did not

  File "/home/jenkins/.buildout/eggs/unittest2-0.5.1-py2.6.egg/unittest2/case.py", line 340, in run
    testMethod()
  File "/home/jenkins/.buildout/eggs/robotsuite-1.7.0-py2.6.egg/robotsuite/__init__.py", line 461, in runTest
    assert last_status == 'PASS', last_message


FAILED:  Products.CMFPlone.tests.test_robot.RobotTestCase.Scenario New user overlay remains on wrong data

Error Message:
Setup failed:

Stack Trace:
Setup failed:
Page should have contained element 'css=#archetypes-fieldname-title input' but did not

  File "/home/jenkins/.buildout/eggs/unittest2-0.5.1-py2.6.egg/unittest2/case.py", line 340, in run
    testMethod()
  File "/home/jenkins/.buildout/eggs/robotsuite-1.7.0-py2.6.egg/robotsuite/__init__.py", line 461, in runTest
    assert last_status == 'PASS', last_message


FAILED:  Products.GenericSetup.tests.test_tool.SetupToolTests.test_runAllImportStepsFromProfile_step_registration_with_depends

Error Message:


Stack Trace:


  File "/usr/lib/python2.6/unittest.py", line 279, in run
    testMethod()
  File "/home/jenkins/.buildout/eggs/Products.GenericSetup-1.8.3-py2.6.egg/Products/GenericSetup/tests/test_tool.py", line 746, in test_runAllImportStepsFromProfile_step_registration_with_depends
    self.failUnless('one' in result['steps'])
  File "/usr/lib/python2.6/unittest.py", line 325, in failUnless
    if not expr: raise self.failureException, msg





More information about the Testbot mailing list