[Testbot] Plone 5.0 - Python 2.7 - Build # 4838 - Failure!

jenkins at plone.org jenkins at plone.org
Mon Aug 15 22:46:07 UTC 2016


Plone 5.0 - Python 2.7 - Build # 4838 - Failure:

Check console output at http://jenkins.plone.org/job/plone-5.0-python-2.7/4838/ to view the results.

Changes:

[Eric Steele] [fc] Repository: plone.app.upgrade Branch: refs/heads/master Date:

[Eric Steele] [fc] Repository: plone.app.upgrade Branch: refs/heads/master Date:







Test Results:

6 tests failed.
FAILED:  Products.CMFPlone.tests.testMigrationTool.TestMigrationTool.testDoUpgrades

Error Message:
Tuples differ: ('5016',) != (u'5015',)

Stack Trace:
Tuples differ: ('5016',) != (u'5015',)

First differing element 0:
'5016'
u'5015'

- ('5016',)
?      ^

+ (u'5015',)
?  +    ^


  File "/usr/lib/python2.7/unittest/case.py", line 329, in run
    testMethod()
  File "/home/jenkins/workspace/plone-5.0-python-2.7/src/Products.CMFPlone/Products/CMFPlone/tests/testMigrationTool.py", line 59, in testDoUpgrades
    self.assertEqual(last, current)
  File "/usr/lib/python2.7/unittest/case.py", line 513, in assertEqual
    assertion_func(first, second, msg=msg)
  File "/usr/lib/python2.7/unittest/case.py", line 753, in assertTupleEqual
    self.assertSequenceEqual(tuple1, tuple2, msg, seq_type=tuple)
  File "/usr/lib/python2.7/unittest/case.py", line 724, in assertSequenceEqual
    self.fail(msg)
  File "/usr/lib/python2.7/unittest/case.py", line 410, in fail
    raise self.failureException(msg)


FAILED:  Products.CMFPlone.tests.testMigrationTool.TestMigrationTool.testListUpgradeSteps

Error Message:
False is not true

Stack Trace:
False is not true

  File "/usr/lib/python2.7/unittest/case.py", line 329, in run
    testMethod()
  File "/home/jenkins/workspace/plone-5.0-python-2.7/src/Products.CMFPlone/Products/CMFPlone/tests/testMigrationTool.py", line 33, in testListUpgradeSteps
    self.assertTrue(len(upgrades) == 0)
  File "/usr/lib/python2.7/unittest/case.py", line 422, in assertTrue
    raise self.failureException(msg)


FAILED:  Products.CMFPlone.tests.testMigrationTool.TestMigrationTool.testUpgrade

Error Message:
False is not true

Stack Trace:
False is not true

  File "/usr/lib/python2.7/unittest/case.py", line 329, in run
    testMethod()
  File "/home/jenkins/workspace/plone-5.0-python-2.7/src/Products.CMFPlone/Products/CMFPlone/tests/testMigrationTool.py", line 78, in testUpgrade
    self.assertTrue(len(upgrades) == 0)
  File "/usr/lib/python2.7/unittest/case.py", line 422, in assertTrue
    raise self.failureException(msg)


FAILED:  plone.app.upgrade.tests.test_upgrade.TestUpgrade.testDoUpgrades

Error Message:
Tuples differ: ('5016',) != (u'5015',)

Stack Trace:
Tuples differ: ('5016',) != (u'5015',)

First differing element 0:
'5016'
u'5015'

- ('5016',)
?      ^

+ (u'5015',)
?  +    ^


  File "/usr/lib/python2.7/unittest/case.py", line 329, in run
    testMethod()
  File "/home/jenkins/workspace/plone-5.0-python-2.7/src/plone.app.upgrade/plone/app/upgrade/tests/test_upgrade.py", line 62, in testDoUpgrades
    self.assertEqual(last, current)
  File "/usr/lib/python2.7/unittest/case.py", line 513, in assertEqual
    assertion_func(first, second, msg=msg)
  File "/usr/lib/python2.7/unittest/case.py", line 753, in assertTupleEqual
    self.assertSequenceEqual(tuple1, tuple2, msg, seq_type=tuple)
  File "/usr/lib/python2.7/unittest/case.py", line 724, in assertSequenceEqual
    self.fail(msg)
  File "/usr/lib/python2.7/unittest/case.py", line 410, in fail
    raise self.failureException(msg)


FAILED:  plone.app.upgrade.tests.test_upgrade.TestUpgrade.testListUpgradeSteps

Error Message:
1 != 0

Stack Trace:
1 != 0

  File "/usr/lib/python2.7/unittest/case.py", line 329, in run
    testMethod()
  File "/home/jenkins/workspace/plone-5.0-python-2.7/src/plone.app.upgrade/plone/app/upgrade/tests/test_upgrade.py", line 16, in testListUpgradeSteps
    self.assertEqual(len(upgrades), 0)
  File "/usr/lib/python2.7/unittest/case.py", line 513, in assertEqual
    assertion_func(first, second, msg=msg)
  File "/usr/lib/python2.7/unittest/case.py", line 506, in _baseAssertEqual
    raise self.failureException(msg)


FAILED:  plone.app.upgrade.v50.tests.TestFunctionalMigrations.testFullyUpgraded

Error Message:
True is not false

Stack Trace:
True is not false

  File "/usr/lib/python2.7/unittest/case.py", line 329, in run
    testMethod()
  File "/home/jenkins/workspace/plone-5.0-python-2.7/src/plone.app.upgrade/plone/app/upgrade/v50/tests.py", line 107, in testFullyUpgraded
    self.assertFalse(self.portal.portal_migration.needUpgrading())
  File "/usr/lib/python2.7/unittest/case.py", line 416, in assertFalse
    raise self.failureException(msg)





More information about the Testbot mailing list