[Testbot] Plone 4.3 - Python 2.6 - Build # 1564 - Failure!

jenkins at plone.org jenkins at plone.org
Mon Aug 15 22:20:30 UTC 2016


Plone 4.3 - Python 2.6 - Build # 1564 - Failure:

Check console output at http://jenkins.plone.org/job/plone-4.3-python-2.6/1564/ to view the results.

Changes:

[Eric Steele] [fc] Repository: plone.app.upgrade Branch: refs/heads/master Date:

[Eric Steele] Products.CMFPlone 4.3.11

[Eric Steele] [fc] Repository: plone.app.upgrade Branch: refs/heads/master Date:







Test Results:

3 tests failed.
FAILED:  Products.CMFPlone.tests.testMigrationTool.TestMigrationTool.testDoUpgrades

Error Message:
('4313',) != (u'4314',)

Stack Trace:
('4313',) != (u'4314',)

  File "/usr/lib/python2.6/unittest.py", line 279, in run
    testMethod()
  File "/home/jenkins/.buildout/eggs/Products.CMFPlone-4.3.11-py2.6.egg/Products/CMFPlone/tests/testMigrationTool.py", line 59, in testDoUpgrades
    self.assertEqual(last, current)
  File "/usr/lib/python2.6/unittest.py", line 350, in failUnlessEqual
    (msg or '%r != %r' % (first, second))


FAILED:  Products.CMFPlone.tests.testMigrationTool.TestMigrationTool.testUpgrade

Error Message:
('4313',) != (u'4314',)

Stack Trace:
('4313',) != (u'4314',)

  File "/usr/lib/python2.6/unittest.py", line 279, in run
    testMethod()
  File "/home/jenkins/.buildout/eggs/Products.CMFPlone-4.3.11-py2.6.egg/Products/CMFPlone/tests/testMigrationTool.py", line 74, in testUpgrade
    self.assertEqual(last, current)
  File "/usr/lib/python2.6/unittest.py", line 350, in failUnlessEqual
    (msg or '%r != %r' % (first, second))


FAILED:  plone.app.upgrade.tests.test_upgrade.TestUpgrade.testDoUpgrades

Error Message:
('4313',) != (u'4314',)

Stack Trace:
('4313',) != (u'4314',)

  File "/usr/lib/python2.6/unittest.py", line 279, in run
    testMethod()
  File "/home/jenkins/.buildout/eggs/plone.app.upgrade-1.3.26-py2.6.egg/plone/app/upgrade/tests/test_upgrade.py", line 62, in testDoUpgrades
    self.assertEqual(last, current)
  File "/usr/lib/python2.6/unittest.py", line 350, in failUnlessEqual
    (msg or '%r != %r' % (first, second))





More information about the Testbot mailing list