[Testbot] Plone 5.1 - Python 2.7 - Build # 671 - Still Failing!

jenkins at plone.org jenkins at plone.org
Fri Aug 12 17:14:03 UTC 2016


Plone 5.1 - Python 2.7 - Build # 671 - Still Failing:

Check console output at http://jenkins.plone.org/job/plone-5.1-python-2.7/671/ to view the results.

Changes:

[Maurits van Rees] plone.namedfile 4.0







Test Results:

14 tests failed.
FAILED:  plone.app.multilingual.tests.test_alternates.Startup

Error Message:
No module named dexterity.behaviors.exclfromnav

Stack Trace:
No module named dexterity.behaviors.exclfromnav

  File "/home/jenkins/workspace/plone-5.1-python-2.7 at 2/src/plone.app.multilingual/src/plone/app/multilingual/tests/test_alternates.py", line 5, in <module>
    from plone.app.multilingual.testing import PAM_FUNCTIONAL_TESTING
  File "/home/jenkins/workspace/plone-5.1-python-2.7 at 2/src/plone.app.multilingual/src/plone/app/multilingual/testing.py", line 5, in <module>
    from plone.app.multilingual.browser.setup import SetupMultilingualSite
  File "/home/jenkins/workspace/plone-5.1-python-2.7 at 2/src/plone.app.multilingual/src/plone/app/multilingual/browser/setup.py", line 6, in <module>
    from plone.app.dexterity.behaviors.exclfromnav import IExcludeFromNavigation


FAILED:  plone.app.multilingual.tests.test_api.Startup

Error Message:
No module named dexterity.behaviors.exclfromnav

Stack Trace:
No module named dexterity.behaviors.exclfromnav

  File "/home/jenkins/workspace/plone-5.1-python-2.7 at 2/src/plone.app.multilingual/src/plone/app/multilingual/tests/test_api.py", line 9, in <module>
    from plone.app.multilingual.testing import PAM_FUNCTIONAL_TESTING
  File "/home/jenkins/workspace/plone-5.1-python-2.7 at 2/src/plone.app.multilingual/src/plone/app/multilingual/testing.py", line 5, in <module>
    from plone.app.multilingual.browser.setup import SetupMultilingualSite
  File "/home/jenkins/workspace/plone-5.1-python-2.7 at 2/src/plone.app.multilingual/src/plone/app/multilingual/browser/setup.py", line 6, in <module>
    from plone.app.dexterity.behaviors.exclfromnav import IExcludeFromNavigation


FAILED:  plone.app.multilingual.tests.test_catalog.Startup

Error Message:
No module named dexterity.behaviors.exclfromnav

Stack Trace:
No module named dexterity.behaviors.exclfromnav

  File "/home/jenkins/workspace/plone-5.1-python-2.7 at 2/src/plone.app.multilingual/src/plone/app/multilingual/tests/test_catalog.py", line 4, in <module>
    from plone.app.multilingual.testing import PAM_FUNCTIONAL_TESTING
  File "/home/jenkins/workspace/plone-5.1-python-2.7 at 2/src/plone.app.multilingual/src/plone/app/multilingual/testing.py", line 5, in <module>
    from plone.app.multilingual.browser.setup import SetupMultilingualSite
  File "/home/jenkins/workspace/plone-5.1-python-2.7 at 2/src/plone.app.multilingual/src/plone/app/multilingual/browser/setup.py", line 6, in <module>
    from plone.app.dexterity.behaviors.exclfromnav import IExcludeFromNavigation


FAILED:  plone.app.multilingual.tests.test_directives.Startup

Error Message:
No module named dexterity.behaviors.exclfromnav

Stack Trace:
No module named dexterity.behaviors.exclfromnav

  File "/home/jenkins/workspace/plone-5.1-python-2.7 at 2/src/plone.app.multilingual/src/plone/app/multilingual/tests/test_directives.py", line 4, in <module>
    from plone.app.multilingual.testing import PAM_INTEGRATION_TESTING
  File "/home/jenkins/workspace/plone-5.1-python-2.7 at 2/src/plone.app.multilingual/src/plone/app/multilingual/testing.py", line 5, in <module>
    from plone.app.multilingual.browser.setup import SetupMultilingualSite
  File "/home/jenkins/workspace/plone-5.1-python-2.7 at 2/src/plone.app.multilingual/src/plone/app/multilingual/browser/setup.py", line 6, in <module>
    from plone.app.dexterity.behaviors.exclfromnav import IExcludeFromNavigation


FAILED:  plone.app.multilingual.tests.test_form.Startup

Error Message:
No module named dexterity.behaviors.exclfromnav

Stack Trace:
No module named dexterity.behaviors.exclfromnav

  File "/home/jenkins/workspace/plone-5.1-python-2.7 at 2/src/plone.app.multilingual/src/plone/app/multilingual/tests/test_form.py", line 2, in <module>
    from plone.app.multilingual.testing import PAM_FUNCTIONAL_TESTING
  File "/home/jenkins/workspace/plone-5.1-python-2.7 at 2/src/plone.app.multilingual/src/plone/app/multilingual/testing.py", line 5, in <module>
    from plone.app.multilingual.browser.setup import SetupMultilingualSite
  File "/home/jenkins/workspace/plone-5.1-python-2.7 at 2/src/plone.app.multilingual/src/plone/app/multilingual/browser/setup.py", line 6, in <module>
    from plone.app.dexterity.behaviors.exclfromnav import IExcludeFromNavigation


FAILED:  plone.app.multilingual.tests.test_helper_views.Startup

Error Message:
No module named dexterity.behaviors.exclfromnav

Stack Trace:
No module named dexterity.behaviors.exclfromnav

  File "/home/jenkins/workspace/plone-5.1-python-2.7 at 2/src/plone.app.multilingual/src/plone/app/multilingual/tests/test_helper_views.py", line 6, in <module>
    from plone.app.multilingual.testing import PAM_FUNCTIONAL_TESTING
  File "/home/jenkins/workspace/plone-5.1-python-2.7 at 2/src/plone.app.multilingual/src/plone/app/multilingual/testing.py", line 5, in <module>
    from plone.app.multilingual.browser.setup import SetupMultilingualSite
  File "/home/jenkins/workspace/plone-5.1-python-2.7 at 2/src/plone.app.multilingual/src/plone/app/multilingual/browser/setup.py", line 6, in <module>
    from plone.app.dexterity.behaviors.exclfromnav import IExcludeFromNavigation


FAILED:  plone.app.multilingual.tests.test_lif.Startup

Error Message:
No module named dexterity.behaviors.exclfromnav

Stack Trace:
No module named dexterity.behaviors.exclfromnav

  File "/home/jenkins/workspace/plone-5.1-python-2.7 at 2/src/plone.app.multilingual/src/plone/app/multilingual/tests/test_lif.py", line 6, in <module>
    from plone.app.multilingual.testing import PAM_FUNCTIONAL_TESTING
  File "/home/jenkins/workspace/plone-5.1-python-2.7 at 2/src/plone.app.multilingual/src/plone/app/multilingual/testing.py", line 5, in <module>
    from plone.app.multilingual.browser.setup import SetupMultilingualSite
  File "/home/jenkins/workspace/plone-5.1-python-2.7 at 2/src/plone.app.multilingual/src/plone/app/multilingual/browser/setup.py", line 6, in <module>
    from plone.app.dexterity.behaviors.exclfromnav import IExcludeFromNavigation


FAILED:  plone.app.multilingual.tests.test_lrf.Startup

Error Message:
No module named dexterity.behaviors.exclfromnav

Stack Trace:
No module named dexterity.behaviors.exclfromnav

  File "/home/jenkins/workspace/plone-5.1-python-2.7 at 2/src/plone.app.multilingual/src/plone/app/multilingual/tests/test_lrf.py", line 6, in <module>
    from plone.app.multilingual.testing import PAM_FUNCTIONAL_TESTING
  File "/home/jenkins/workspace/plone-5.1-python-2.7 at 2/src/plone.app.multilingual/src/plone/app/multilingual/testing.py", line 5, in <module>
    from plone.app.multilingual.browser.setup import SetupMultilingualSite
  File "/home/jenkins/workspace/plone-5.1-python-2.7 at 2/src/plone.app.multilingual/src/plone/app/multilingual/browser/setup.py", line 6, in <module>
    from plone.app.dexterity.behaviors.exclfromnav import IExcludeFromNavigation


FAILED:  plone.app.multilingual.tests.test_menu.Startup

Error Message:
No module named dexterity.behaviors.exclfromnav

Stack Trace:
No module named dexterity.behaviors.exclfromnav

  File "/home/jenkins/workspace/plone-5.1-python-2.7 at 2/src/plone.app.multilingual/src/plone/app/multilingual/tests/test_menu.py", line 2, in <module>
    from plone.app.multilingual.testing import PAM_FUNCTIONAL_TESTING
  File "/home/jenkins/workspace/plone-5.1-python-2.7 at 2/src/plone.app.multilingual/src/plone/app/multilingual/testing.py", line 5, in <module>
    from plone.app.multilingual.browser.setup import SetupMultilingualSite
  File "/home/jenkins/workspace/plone-5.1-python-2.7 at 2/src/plone.app.multilingual/src/plone/app/multilingual/browser/setup.py", line 6, in <module>
    from plone.app.dexterity.behaviors.exclfromnav import IExcludeFromNavigation


FAILED:  plone.app.multilingual.tests.test_robot.Startup

Error Message:
No module named dexterity.behaviors.exclfromnav

Stack Trace:
No module named dexterity.behaviors.exclfromnav

  File "/home/jenkins/workspace/plone-5.1-python-2.7 at 2/src/plone.app.multilingual/src/plone/app/multilingual/tests/test_robot.py", line 2, in <module>
    from plone.app.multilingual.testing import PAM_ROBOT_TESTING
  File "/home/jenkins/workspace/plone-5.1-python-2.7 at 2/src/plone.app.multilingual/src/plone/app/multilingual/testing.py", line 5, in <module>
    from plone.app.multilingual.browser.setup import SetupMultilingualSite
  File "/home/jenkins/workspace/plone-5.1-python-2.7 at 2/src/plone.app.multilingual/src/plone/app/multilingual/browser/setup.py", line 6, in <module>
    from plone.app.dexterity.behaviors.exclfromnav import IExcludeFromNavigation


FAILED:  plone.app.multilingual.tests.test_selector.Startup

Error Message:
No module named dexterity.behaviors.exclfromnav

Stack Trace:
No module named dexterity.behaviors.exclfromnav

  File "/home/jenkins/workspace/plone-5.1-python-2.7 at 2/src/plone.app.multilingual/src/plone/app/multilingual/tests/test_selector.py", line 12, in <module>
    from plone.app.multilingual.testing import PAM_FUNCTIONAL_TESTING
  File "/home/jenkins/workspace/plone-5.1-python-2.7 at 2/src/plone.app.multilingual/src/plone/app/multilingual/testing.py", line 5, in <module>
    from plone.app.multilingual.browser.setup import SetupMultilingualSite
  File "/home/jenkins/workspace/plone-5.1-python-2.7 at 2/src/plone.app.multilingual/src/plone/app/multilingual/browser/setup.py", line 6, in <module>
    from plone.app.dexterity.behaviors.exclfromnav import IExcludeFromNavigation


FAILED:  plone.app.multilingual.tests.test_setup.Startup

Error Message:
No module named dexterity.behaviors.exclfromnav

Stack Trace:
No module named dexterity.behaviors.exclfromnav

  File "/home/jenkins/workspace/plone-5.1-python-2.7 at 2/src/plone.app.multilingual/src/plone/app/multilingual/tests/test_setup.py", line 7, in <module>
    from plone.app.multilingual.browser.setup import SetupMultilingualSite
  File "/home/jenkins/workspace/plone-5.1-python-2.7 at 2/src/plone.app.multilingual/src/plone/app/multilingual/browser/setup.py", line 6, in <module>
    from plone.app.dexterity.behaviors.exclfromnav import IExcludeFromNavigation


FAILED:  plone.app.multilingual.tests.test_subscribers.Startup

Error Message:
No module named dexterity.behaviors.exclfromnav

Stack Trace:
No module named dexterity.behaviors.exclfromnav

  File "/home/jenkins/workspace/plone-5.1-python-2.7 at 2/src/plone.app.multilingual/src/plone/app/multilingual/tests/test_subscribers.py", line 7, in <module>
    from plone.app.multilingual.testing import PAM_FUNCTIONAL_TESTING
  File "/home/jenkins/workspace/plone-5.1-python-2.7 at 2/src/plone.app.multilingual/src/plone/app/multilingual/testing.py", line 5, in <module>
    from plone.app.multilingual.browser.setup import SetupMultilingualSite
  File "/home/jenkins/workspace/plone-5.1-python-2.7 at 2/src/plone.app.multilingual/src/plone/app/multilingual/browser/setup.py", line 6, in <module>
    from plone.app.dexterity.behaviors.exclfromnav import IExcludeFromNavigation


FAILED:  plone.app.multilingual.tests.test_vocabularies.Startup

Error Message:
No module named dexterity.behaviors.exclfromnav

Stack Trace:
No module named dexterity.behaviors.exclfromnav

  File "/home/jenkins/workspace/plone-5.1-python-2.7 at 2/src/plone.app.multilingual/src/plone/app/multilingual/tests/test_vocabularies.py", line 5, in <module>
    from plone.app.multilingual.testing import PAM_FUNCTIONAL_TESTING
  File "/home/jenkins/workspace/plone-5.1-python-2.7 at 2/src/plone.app.multilingual/src/plone/app/multilingual/testing.py", line 5, in <module>
    from plone.app.multilingual.browser.setup import SetupMultilingualSite
  File "/home/jenkins/workspace/plone-5.1-python-2.7 at 2/src/plone.app.multilingual/src/plone/app/multilingual/browser/setup.py", line 6, in <module>
    from plone.app.dexterity.behaviors.exclfromnav import IExcludeFromNavigation





More information about the Testbot mailing list