[Testbot] Plone 4.3 - Python 2.6 - Build # 1057 - Failure!

jenkins at plone.org jenkins at plone.org
Tue Dec 29 13:34:42 UTC 2015


Plone 4.3 - Python 2.6 - Build # 1057 - Failure:

Check console output at http://jenkins.plone.org/job/plone-4.3-python-2.6/1057/ to view the results.

Changes:

[Jens W. Klein] merged https://github.com/plone/plone.portlet.collection/pull/12







Test Results:

2 tests failed.
FAILED:  plone.app.testing.layers.rst

Error Message:
Failed doctest test for layers.rst

Stack Trace:
Failed doctest test for layers.rst
  File "/home/jenkins/.buildout/eggs/plone.app.testing-4.2.5-py2.6.egg/plone/app/testing/layers.rst", line 0

----------------------------------------------------------------------
File "/home/jenkins/.buildout/eggs/plone.app.testing-4.2.5-py2.6.egg/plone/app/testing/layers.rst", line 394, in layers.rst
Failed example:
    runner.setup_layer(options, layers.PLONE_FTP_SERVER, setupLayers)
Exception raised:
    Traceback (most recent call last):
      File "/usr/lib/python2.6/doctest.py", line 1253, in __run
        compileflags, 1) in test.globs
      File "<doctest layers.rst[109]>", line 1, in <module>
        runner.setup_layer(options, layers.PLONE_FTP_SERVER, setupLayers)
      File "/home/jenkins/.buildout/eggs/zope.testing-3.9.7-py2.6.egg/zope/testing/testrunner/runner.py", line 628, in setup_layer
        setup_layer(options, base, setup_layers)
      File "/home/jenkins/.buildout/eggs/zope.testing-3.9.7-py2.6.egg/zope/testing/testrunner/runner.py", line 633, in setup_layer
        layer.setUp()
      File "/home/jenkins/workspace/plone-4.3-python-2.6/src/plone.testing/src/plone/testing/z2.py", line 968, in setUp
        self.setUpServer()
      File "/home/jenkins/workspace/plone-4.3-python-2.6/src/plone.testing/src/plone/testing/z2.py", line 1084, in setUpServer
        logger_object=zopeLog)
      File "/home/jenkins/.buildout/eggs/Zope2-2.13.23-py2.6.egg/ZServer/FTPServer.py", line 637, in __init__
        ftp_server.__init__(self, None, *args, **kw)
      File "/home/jenkins/.buildout/eggs/Zope2-2.13.23-py2.6.egg/ZServer/medusa/ftp_server.py", line 727, in __init__
        self.bind ((self.ip, self.port))
      File "/usr/lib/python2.6/asyncore.py", line 333, in bind
        return self.socket.bind(addr)
      File "<string>", line 1, in bind
    error: [Errno 98] Address already in use


  File "/usr/lib/python2.6/unittest.py", line 279, in run
    testMethod()
  File "/usr/lib/python2.6/doctest.py", line 2163, in runTest
    raise self.failureException(self.format_failure(new.getvalue()))


FAILED:  src.plone.testing.z2.rst

Error Message:
Failed doctest test for z2.rst

Stack Trace:
Failed doctest test for z2.rst
  File "/home/jenkins/workspace/plone-4.3-python-2.6/src/plone.testing/src/plone/testing/z2.rst", line 0

----------------------------------------------------------------------
File "/home/jenkins/workspace/plone-4.3-python-2.6/src/plone.testing/src/plone/testing/z2.rst", line 560, in z2.rst
Failed example:
    runner.setup_layer(options, z2.FTP_SERVER, setupLayers)
Exception raised:
    Traceback (most recent call last):
      File "/usr/lib/python2.6/doctest.py", line 1253, in __run
        compileflags, 1) in test.globs
      File "<doctest z2.rst[146]>", line 1, in <module>
        runner.setup_layer(options, z2.FTP_SERVER, setupLayers)
      File "/home/jenkins/.buildout/eggs/zope.testrunner-4.4.4-py2.6.egg/zope/testrunner/runner.py", line 708, in setup_layer
        setup_layer(options, base, setup_layers)
      File "/home/jenkins/.buildout/eggs/zope.testrunner-4.4.4-py2.6.egg/zope/testrunner/runner.py", line 713, in setup_layer
        layer.setUp()
      File "/home/jenkins/workspace/plone-4.3-python-2.6/src/plone.testing/src/plone/testing/z2.py", line 968, in setUp
        self.setUpServer()
      File "/home/jenkins/workspace/plone-4.3-python-2.6/src/plone.testing/src/plone/testing/z2.py", line 1084, in setUpServer
        logger_object=zopeLog)
      File "/home/jenkins/.buildout/eggs/Zope2-2.13.23-py2.6.egg/ZServer/FTPServer.py", line 637, in __init__
        ftp_server.__init__(self, None, *args, **kw)
      File "/home/jenkins/.buildout/eggs/Zope2-2.13.23-py2.6.egg/ZServer/medusa/ftp_server.py", line 727, in __init__
        self.bind ((self.ip, self.port))
      File "/usr/lib/python2.6/asyncore.py", line 333, in bind
        return self.socket.bind(addr)
      File "<string>", line 1, in bind
    error: [Errno 98] Address already in use


  File "/usr/lib/python2.6/unittest.py", line 279, in run
    testMethod()
  File "/usr/lib/python2.6/doctest.py", line 2163, in runTest
    raise self.failureException(self.format_failure(new.getvalue()))





More information about the Testbot mailing list