[Testbot] Plone 4.3 - Python 2.6 - Build # 1046 - Failure!

jenkins at plone.org jenkins at plone.org
Tue Dec 15 23:47:30 UTC 2015


Plone 4.3 - Python 2.6 - Build # 1046 - Failure:

Check console output at http://jenkins.plone.org/job/plone-4.3-python-2.6/1046/ to view the results.

Changes:

[Johannes Raggam] [fc] Repository: plone.testing Branch: refs/heads/master Date:







Test Results:

22 tests failed.
FAILED:  Products.Archetypes.tests.test_metadata.ExtensibleMetadataTest.xml.<init>

Error Message:


Stack Trace:
Test report file /home/jenkins/workspace/plone-4.3-python-2.6/parts/jenkins-test/testreports/Products.Archetypes.tests.test_metadata.ExtensibleMetadataTest.xml was length 0

FAILED:  Products.CMFDefault.tests.test_Favorite.FavoriteTests.xml.<init>

Error Message:


Stack Trace:
Test report file /home/jenkins/workspace/plone-4.3-python-2.6/parts/jenkins-test/testreports/Products.CMFDefault.tests.test_Favorite.FavoriteTests.xml was length 0

FAILED:  Products.CMFTestCase.testCMFTestCase.TestVersionConstants.xml.<init>

Error Message:


Stack Trace:
Test report file /home/jenkins/workspace/plone-4.3-python-2.6/parts/jenkins-test/testreports/Products.CMFTestCase.testCMFTestCase.TestVersionConstants.xml was length 0

FAILED:  Products.ExtendedPathIndex.tests.testIndexedAttrs.IndexedAttrsTests.xml.<init>

Error Message:


Stack Trace:
Test report file /home/jenkins/workspace/plone-4.3-python-2.6/parts/jenkins-test/testreports/Products.ExtendedPathIndex.tests.testIndexedAttrs.IndexedAttrsTests.xml was length 0

FAILED:  Products.PluggableAuthService.plugins.tests.test_ZODBUserManager.ZODBUserManagerTests.xml.<init>

Error Message:


Stack Trace:
Test report file /home/jenkins/workspace/plone-4.3-python-2.6/parts/jenkins-test/testreports/Products.PluggableAuthService.plugins.tests.test_ZODBUserManager.ZODBUserManagerTests.xml was length 0

FAILED:  Products.ResourceRegistries.tests.testBaseRegistry.BaseRegistryTestCase.xml.<init>

Error Message:


Stack Trace:
Test report file /home/jenkins/workspace/plone-4.3-python-2.6/parts/jenkins-test/testreports/Products.ResourceRegistries.tests.testBaseRegistry.BaseRegistryTestCase.xml was length 0

FAILED:  archetypes.referencebrowserwidget.tests.test_utils.UtilsTestCase.xml.<init>

Error Message:


Stack Trace:
Test report file /home/jenkins/workspace/plone-4.3-python-2.6/parts/jenkins-test/testreports/archetypes.referencebrowserwidget.tests.test_utils.UtilsTestCase.xml was length 0

FAILED:  archetypes.schemaextender.tests.testSchemaFactory.OrderableExtenderTests.xml.<init>

Error Message:


Stack Trace:
Test report file /home/jenkins/workspace/plone-4.3-python-2.6/parts/jenkins-test/testreports/archetypes.schemaextender.tests.testSchemaFactory.OrderableExtenderTests.xml was length 0

FAILED:  diazo.tests.test_diazo.Test-v1-if-not-path.xml.<init>

Error Message:


Stack Trace:
Test report file /home/jenkins/workspace/plone-4.3-python-2.6/parts/jenkins-test/testreports/diazo.tests.test_diazo.Test-v1-if-not-path.xml was length 0

FAILED:  doctest-five-intid-README.txt.xml.<init>

Error Message:


Stack Trace:
Test report file /home/jenkins/workspace/plone-4.3-python-2.6/parts/jenkins-test/testreports/doctest-five-intid-README.txt.xml was length 0

FAILED:  doctest-plone-app-viewletmanager-tests-storage.rst.xml.<init>

Error Message:


Stack Trace:
Test report file /home/jenkins/workspace/plone-4.3-python-2.6/parts/jenkins-test/testreports/doctest-plone-app-viewletmanager-tests-storage.rst.xml was length 0

FAILED:  doctest-plone-formwidget-autocomplete-README.txt.xml.<init>

Error Message:


Stack Trace:
Test report file /home/jenkins/workspace/plone-4.3-python-2.6/parts/jenkins-test/testreports/doctest-plone-formwidget-autocomplete-README.txt.xml was length 0

FAILED:  doctest-plone-portlets-utils.txt.xml.<init>

Error Message:


Stack Trace:
Test report file /home/jenkins/workspace/plone-4.3-python-2.6/parts/jenkins-test/testreports/doctest-plone-portlets-utils.txt.xml was length 0

FAILED:  plone.app.blob.tests.test_utils.UtilityTests.xml.<init>

Error Message:


Stack Trace:
Test report file /home/jenkins/workspace/plone-4.3-python-2.6/parts/jenkins-test/testreports/plone.app.blob.tests.test_utils.UtilityTests.xml was length 0

FAILED:  plone.app.caching.tests.test_purge.TestObjectFieldPurgePaths.xml.<init>

Error Message:


Stack Trace:
Test report file /home/jenkins/workspace/plone-4.3-python-2.6/parts/jenkins-test/testreports/plone.app.caching.tests.test_purge.TestObjectFieldPurgePaths.xml was length 0

FAILED:  plone.app.folder.tests.test_utils.UtilsTests.xml.<init>

Error Message:


Stack Trace:
Test report file /home/jenkins/workspace/plone-4.3-python-2.6/parts/jenkins-test/testreports/plone.app.folder.tests.test_utils.UtilsTests.xml was length 0

FAILED:  plone.app.imaging.tests.test_traverse.TraverseTests.xml.<init>

Error Message:


Stack Trace:
Test report file /home/jenkins/workspace/plone-4.3-python-2.6/parts/jenkins-test/testreports/plone.app.imaging.tests.test_traverse.TraverseTests.xml was length 0

FAILED:  plone.app.linkintegrity.tests.test_doctests.LinkIntegrityTestCase.xml.<init>

Error Message:


Stack Trace:
Test report file /home/jenkins/workspace/plone-4.3-python-2.6/parts/jenkins-test/testreports/plone.app.linkintegrity.tests.test_doctests.LinkIntegrityTestCase.xml was length 0

FAILED:  plone.app.users.tests.test_account.TestAccountPanelSchemaAdapter.xml.<init>

Error Message:


Stack Trace:
Test report file /home/jenkins/workspace/plone-4.3-python-2.6/parts/jenkins-test/testreports/plone.app.users.tests.test_account.TestAccountPanelSchemaAdapter.xml was length 0

FAILED:  plone.app.vocabularies.datetimerelated.xml.<init>

Error Message:


Stack Trace:
Test report file /home/jenkins/workspace/plone-4.3-python-2.6/parts/jenkins-test/testreports/plone.app.vocabularies.datetimerelated.xml was length 0

FAILED:  plone.caching.tests.test_hooks.TestMutateResponse.xml.<init>

Error Message:


Stack Trace:
Test report file /home/jenkins/workspace/plone-4.3-python-2.6/parts/jenkins-test/testreports/plone.caching.tests.test_hooks.TestMutateResponse.xml was length 0

FAILED:  zope.testing.doctest.DocTestCase.xml.<init>

Error Message:


Stack Trace:
Test report file /home/jenkins/workspace/plone-4.3-python-2.6/parts/jenkins-test/testreports/zope.testing.doctest.DocTestCase.xml was length 0




More information about the Testbot mailing list