[Testbot] Plone 4.3 - Python 2.6 - Build # 1038 - Still Failing!

jenkins at plone.org jenkins at plone.org
Sun Dec 13 20:59:50 UTC 2015


Plone 4.3 - Python 2.6 - Build # 1038 - Still Failing:

Check console output at http://jenkins.plone.org/job/plone-4.3-python-2.6/1038/ to view the results.

Changes:

[Gil Forcada Codinachs] Versions according too 2015-10-06 hotfix

[Gil Forcada Codinachs] Bump package versions

[Gil Forcada Codinachs] p.contentrules and p.a.imaging changes

[Gil Forcada Codinachs] Changes on P.ATContentTypes







Test Results:

38 tests failed.
FAILED:  Products.CMFPlacefulWorkflow.tests.testCMFPlacefulWorkflow.Startup

Error Message:
File "/home/jenkins/.buildout/eggs/Zope2-2.13.23-py2.6.egg/Zope2/utilities/skel/etc/site.zcml", line 16.2-16.23

Stack Trace:
File "/home/jenkins/.buildout/eggs/Zope2-2.13.23-py2.6.egg/Zope2/utilities/skel/etc/site.zcml", line 16.2-16.23
    ZopeXMLConfigurationError: File "/home/jenkins/workspace/plone-4.3-python-2.6 at 2/src/Products.CMFPlone/Products/CMFPlone/configure.zcml", line 15.2-15.46
    ZopeXMLConfigurationError: File "/home/jenkins/.buildout/eggs/plone.app.contentrules-3.0.9-py2.6.egg/plone/app/contentrules/configure.zcml", line 10.4-10.44
    ZopeXMLConfigurationError: File "/home/jenkins/.buildout/eggs/plone.stringinterp-1.0.13-py2.6.egg/plone/stringinterp/configure.zcml", line 21.3-26.9
    ImportError: cannot import name OrderedDict

  File "/home/jenkins/.buildout/eggs/Products.CMFPlacefulWorkflow-1.5.12-py2.6.egg/Products/CMFPlacefulWorkflow/tests/testCMFPlacefulWorkflow.py", line 28, in <module>
    from CMFPlacefulWorkflowTestCase import CMFPlacefulWorkflowTestCase
  File "/home/jenkins/.buildout/eggs/Products.CMFPlacefulWorkflow-1.5.12-py2.6.egg/Products/CMFPlacefulWorkflow/tests/CMFPlacefulWorkflowTestCase.py", line 89, in <module>
    app = ZopeTestCase.app()
  File "/home/jenkins/.buildout/eggs/Zope2-2.13.23-py2.6.egg/Testing/ZopeTestCase/base.py", line 30, in app
    app = Zope2.app()
  File "/home/jenkins/.buildout/eggs/Zope2-2.13.23-py2.6.egg/Zope2/__init__.py", line 51, in app
    startup()
  File "/home/jenkins/.buildout/eggs/Zope2-2.13.23-py2.6.egg/Zope2/__init__.py", line 47, in startup
    _startup()
  File "/home/jenkins/.buildout/eggs/Zope2-2.13.23-py2.6.egg/Zope2/App/startup.py", line 118, in startup
    load_zcml()
  File "/home/jenkins/.buildout/eggs/Zope2-2.13.23-py2.6.egg/Zope2/App/startup.py", line 52, in load_zcml
    load_site()
  File "/home/jenkins/.buildout/eggs/Zope2-2.13.23-py2.6.egg/Zope2/App/zcml.py", line 46, in load_site
    _context = xmlconfig.file(site_zcml)
  File "/home/jenkins/.buildout/eggs/zope.configuration-3.7.4-py2.6.egg/zope/configuration/xmlconfig.py", line 649, in file
    include(context, name, package)
  File "/home/jenkins/.buildout/eggs/zope.configuration-3.7.4-py2.6.egg/zope/configuration/xmlconfig.py", line 548, in include
    processxmlfile(f, context)
  File "/home/jenkins/.buildout/eggs/zope.configuration-3.7.4-py2.6.egg/zope/configuration/xmlconfig.py", line 380, in processxmlfile
    parser.parse(src)
  File "/usr/lib/python2.6/xml/sax/expatreader.py", line 107, in parse
    xmlreader.IncrementalParser.parse(self, source)
  File "/usr/lib/python2.6/xml/sax/xmlreader.py", line 123, in parse
    self.feed(buffer)
  File "/usr/lib/python2.6/xml/sax/expatreader.py", line 207, in feed
    self._parser.Parse(data, isFinal)
  File "/usr/lib/python2.6/xml/sax/expatreader.py", line 349, in end_element_ns
    self._cont_handler.endElementNS(pair, None)
  File "/home/jenkins/.buildout/eggs/zope.configuration-3.7.4-py2.6.egg/zope/configuration/xmlconfig.py", line 359, in endElementNS
    self.context.end()
  File "/home/jenkins/.buildout/eggs/zope.configuration-3.7.4-py2.6.egg/zope/configuration/config.py", line 558, in end
    self.stack.pop().finish()
  File "/home/jenkins/.buildout/eggs/zope.configuration-3.7.4-py2.6.egg/zope/configuration/config.py", line 706, in finish
    actions = self.handler(context, **args)
  File "/home/jenkins/.buildout/eggs/Zope2-2.13.23-py2.6.egg/OFS/metaconfigure.py", line 46, in loadProducts
    xmlconfig.include(_context, zcml, package=product)
  File "/home/jenkins/.buildout/eggs/zope.configuration-3.7.4-py2.6.egg/zope/configuration/xmlconfig.py", line 548, in include
    processxmlfile(f, context)
  File "/home/jenkins/.buildout/eggs/zope.configuration-3.7.4-py2.6.egg/zope/configuration/xmlconfig.py", line 380, in processxmlfile
    parser.parse(src)
  File "/usr/lib/python2.6/xml/sax/expatreader.py", line 107, in parse
    xmlreader.IncrementalParser.parse(self, source)
  File "/usr/lib/python2.6/xml/sax/xmlreader.py", line 123, in parse
    self.feed(buffer)
  File "/usr/lib/python2.6/xml/sax/expatreader.py", line 207, in feed
    self._parser.Parse(data, isFinal)
  File "/usr/lib/python2.6/xml/sax/expatreader.py", line 349, in end_element_ns
    self._cont_handler.endElementNS(pair, None)
  File "/home/jenkins/.buildout/eggs/zope.configuration-3.7.4-py2.6.egg/zope/configuration/xmlconfig.py", line 359, in endElementNS
    self.context.end()
  File "/home/jenkins/.buildout/eggs/zope.configuration-3.7.4-py2.6.egg/zope/configuration/config.py", line 558, in end
    self.stack.pop().finish()
  File "/home/jenkins/.buildout/eggs/zope.configuration-3.7.4-py2.6.egg/zope/configuration/config.py", line 706, in finish
    actions = self.handler(context, **args)
  File "/home/jenkins/.buildout/eggs/zope.configuration-3.7.4-py2.6.egg/zope/configuration/xmlconfig.py", line 548, in include
    processxmlfile(f, context)
  File "/home/jenkins/.buildout/eggs/zope.configuration-3.7.4-py2.6.egg/zope/configuration/xmlconfig.py", line 380, in processxmlfile
    parser.parse(src)
  File "/usr/lib/python2.6/xml/sax/expatreader.py", line 107, in parse
    xmlreader.IncrementalParser.parse(self, source)
  File "/usr/lib/python2.6/xml/sax/xmlreader.py", line 123, in parse
    self.feed(buffer)
  File "/usr/lib/python2.6/xml/sax/expatreader.py", line 207, in feed
    self._parser.Parse(data, isFinal)
  File "/usr/lib/python2.6/xml/sax/expatreader.py", line 349, in end_element_ns
    self._cont_handler.endElementNS(pair, None)
  File "/home/jenkins/.buildout/eggs/zope.configuration-3.7.4-py2.6.egg/zope/configuration/xmlconfig.py", line 359, in endElementNS
    self.context.end()
  File "/home/jenkins/.buildout/eggs/zope.configuration-3.7.4-py2.6.egg/zope/configuration/config.py", line 558, in end
    self.stack.pop().finish()
  File "/home/jenkins/.buildout/eggs/zope.configuration-3.7.4-py2.6.egg/zope/configuration/config.py", line 706, in finish
    actions = self.handler(context, **args)
  File "/home/jenkins/.buildout/eggs/zope.configuration-3.7.4-py2.6.egg/zope/configuration/xmlconfig.py", line 548, in include
    processxmlfile(f, context)
  File "/home/jenkins/.buildout/eggs/zope.configuration-3.7.4-py2.6.egg/zope/configuration/xmlconfig.py", line 380, in processxmlfile
    parser.parse(src)
  File "/usr/lib/python2.6/xml/sax/expatreader.py", line 107, in parse
    xmlreader.IncrementalParser.parse(self, source)
  File "/usr/lib/python2.6/xml/sax/xmlreader.py", line 123, in parse
    self.feed(buffer)
  File "/usr/lib/python2.6/xml/sax/expatreader.py", line 207, in feed
    self._parser.Parse(data, isFinal)
  File "/usr/lib/python2.6/xml/sax/expatreader.py", line 349, in end_element_ns
    self._cont_handler.endElementNS(pair, None)
  File "/home/jenkins/.buildout/eggs/zope.configuration-3.7.4-py2.6.egg/zope/configuration/xmlconfig.py", line 359, in endElementNS
    self.context.end()
  File "/home/jenkins/.buildout/eggs/zope.configuration-3.7.4-py2.6.egg/zope/configuration/config.py", line 558, in end
    self.stack.pop().finish()
  File "/home/jenkins/.buildout/eggs/zope.configuration-3.7.4-py2.6.egg/zope/configuration/config.py", line 705, in finish
    args = toargs(context, *self.argdata)
  File "/home/jenkins/.buildout/eggs/zope.configuration-3.7.4-py2.6.egg/zope/configuration/config.py", line 1397, in toargs
    args[str(name)] = field.fromUnicode(s)
  File "/home/jenkins/.buildout/eggs/zope.configuration-3.7.4-py2.6.egg/zope/configuration/fields.py", line 227, in fromUnicode
    v = vt.fromUnicode(s)
  File "/home/jenkins/.buildout/eggs/zope.configuration-3.7.4-py2.6.egg/zope/configuration/fields.py", line 137, in fromUnicode
    value = self.context.resolve(name)
  File "/home/jenkins/.buildout/eggs/zope.configuration-3.7.4-py2.6.egg/zope/configuration/config.py", line 179, in resolve
    mod = __import__(mname, *_import_chickens)
  File "/home/jenkins/.buildout/eggs/plone.stringinterp-1.0.13-py2.6.egg/plone/stringinterp/adapters.py", line 18, in <module>
    from Products.PlonePAS.interfaces.group import IGroupData
  File "/home/jenkins/.buildout/eggs/Products.PlonePAS-5.0.5-py2.6.egg/Products/PlonePAS/__init__.py", line 8, in <module>
    from Products.PlonePAS.plugins import group
  File "/home/jenkins/.buildout/eggs/Products.PlonePAS-5.0.5-py2.6.egg/Products/PlonePAS/plugins/group.py", line 25, in <module>
    from ufactory import PloneUser
  File "/home/jenkins/.buildout/eggs/Products.PlonePAS-5.0.5-py2.6.egg/Products/PlonePAS/plugins/ufactory.py", line 15, in <module>
    from collections import OrderedDict


FAILED:  Products.CMFPlacefulWorkflow.tests.test_configlet.Startup

Error Message:
'NoneType' object is not callable

Stack Trace:
'NoneType' object is not callable

  File "/home/jenkins/.buildout/eggs/Products.CMFPlacefulWorkflow-1.5.12-py2.6.egg/Products/CMFPlacefulWorkflow/tests/test_configlet.py", line 27, in <module>
    from CMFPlacefulWorkflowTestCase import CMFPlacefulWorkflowFunctionalTestCase
  File "/home/jenkins/.buildout/eggs/Products.CMFPlacefulWorkflow-1.5.12-py2.6.egg/Products/CMFPlacefulWorkflow/tests/CMFPlacefulWorkflowTestCase.py", line 89, in <module>
    app = ZopeTestCase.app()
  File "/home/jenkins/.buildout/eggs/Zope2-2.13.23-py2.6.egg/Testing/ZopeTestCase/base.py", line 30, in app
    app = Zope2.app()
  File "/home/jenkins/.buildout/eggs/Zope2-2.13.23-py2.6.egg/Zope2/__init__.py", line 52, in app
    return bobo_application(*args, **kw)


FAILED:  Products.CMFPlacefulWorkflow.tests.test_exportimport.Startup

Error Message:
'NoneType' object is not callable

Stack Trace:
'NoneType' object is not callable

  File "/home/jenkins/.buildout/eggs/Products.CMFPlacefulWorkflow-1.5.12-py2.6.egg/Products/CMFPlacefulWorkflow/tests/test_exportimport.py", line 30, in <module>
    from CMFPlacefulWorkflowTestCase import CMFPlacefulWorkflowTestCase
  File "/home/jenkins/.buildout/eggs/Products.CMFPlacefulWorkflow-1.5.12-py2.6.egg/Products/CMFPlacefulWorkflow/tests/CMFPlacefulWorkflowTestCase.py", line 89, in <module>
    app = ZopeTestCase.app()
  File "/home/jenkins/.buildout/eggs/Zope2-2.13.23-py2.6.egg/Testing/ZopeTestCase/base.py", line 30, in app
    app = Zope2.app()
  File "/home/jenkins/.buildout/eggs/Zope2-2.13.23-py2.6.egg/Zope2/__init__.py", line 52, in app
    return bobo_application(*args, **kw)


FAILED:  Products.CMFPlacefulWorkflow.tests.test_policy_form.Startup

Error Message:
'NoneType' object is not callable

Stack Trace:
'NoneType' object is not callable

  File "/home/jenkins/.buildout/eggs/Products.CMFPlacefulWorkflow-1.5.12-py2.6.egg/Products/CMFPlacefulWorkflow/tests/test_policy_form.py", line 26, in <module>
    from CMFPlacefulWorkflowTestCase import CMFPlacefulWorkflowFunctionalTestCase
  File "/home/jenkins/.buildout/eggs/Products.CMFPlacefulWorkflow-1.5.12-py2.6.egg/Products/CMFPlacefulWorkflow/tests/CMFPlacefulWorkflowTestCase.py", line 89, in <module>
    app = ZopeTestCase.app()
  File "/home/jenkins/.buildout/eggs/Zope2-2.13.23-py2.6.egg/Testing/ZopeTestCase/base.py", line 30, in app
    app = Zope2.app()
  File "/home/jenkins/.buildout/eggs/Zope2-2.13.23-py2.6.egg/Zope2/__init__.py", line 52, in app
    return bobo_application(*args, **kw)


FAILED:  Products.CMFPlone.tests.testNavigationView.Startup

Error Message:
cannot import name OrderedDict

Stack Trace:
cannot import name OrderedDict

  File "/home/jenkins/workspace/plone-4.3-python-2.6 at 2/src/Products.CMFPlone/Products/CMFPlone/tests/testNavigationView.py", line 5, in <module>
    from Products.CMFPlone.tests.utils import validateCSSIdentifier
  File "/home/jenkins/workspace/plone-4.3-python-2.6 at 2/src/Products.CMFPlone/Products/CMFPlone/tests/utils.py", line 6, in <module>
    from Products.CMFPlone.patches.securemailhost import secureSend
  File "/home/jenkins/workspace/plone-4.3-python-2.6 at 2/src/Products.CMFPlone/Products/CMFPlone/patches/__init__.py", line 13, in <module>
    csrf.applyPatches()             # CSRF attacks
  File "/home/jenkins/workspace/plone-4.3-python-2.6 at 2/src/Products.CMFPlone/Products/CMFPlone/patches/csrf.py", line 22, in applyPatches
    from Products.PlonePAS.tools.membership import MembershipTool as PMT
  File "/home/jenkins/.buildout/eggs/Products.PlonePAS-5.0.5-py2.6.egg/Products/PlonePAS/__init__.py", line 8, in <module>
    from Products.PlonePAS.plugins import group
  File "/home/jenkins/.buildout/eggs/Products.PlonePAS-5.0.5-py2.6.egg/Products/PlonePAS/plugins/group.py", line 25, in <module>
    from ufactory import PloneUser
  File "/home/jenkins/.buildout/eggs/Products.PlonePAS-5.0.5-py2.6.egg/Products/PlonePAS/plugins/ufactory.py", line 15, in <module>
    from collections import OrderedDict


FAILED:  Products.CMFPlone.tests.testPortalCreation.Startup

Error Message:
cannot import name OrderedDict

Stack Trace:
cannot import name OrderedDict

  File "/home/jenkins/workspace/plone-4.3-python-2.6 at 2/src/Products.CMFPlone/Products/CMFPlone/tests/testPortalCreation.py", line 20, in <module>
    from Products.CMFPlone import setuphandlers
  File "/home/jenkins/workspace/plone-4.3-python-2.6 at 2/src/Products.CMFPlone/Products/CMFPlone/setuphandlers.py", line 5, in <module>
    from borg.localrole.utils import replace_local_role_manager
  File "/home/jenkins/.buildout/eggs/borg.localrole-3.0.2-py2.6.egg/borg/localrole/__init__.py", line 4, in <module>
    from borg.localrole import workspace
  File "/home/jenkins/.buildout/eggs/borg.localrole-3.0.2-py2.6.egg/borg/localrole/workspace.py", line 11, in <module>
    from Products.PlonePAS.interfaces.plugins import ILocalRolesPlugin
  File "/home/jenkins/.buildout/eggs/Products.PlonePAS-5.0.5-py2.6.egg/Products/PlonePAS/__init__.py", line 8, in <module>
    from Products.PlonePAS.plugins import group
  File "/home/jenkins/.buildout/eggs/Products.PlonePAS-5.0.5-py2.6.egg/Products/PlonePAS/plugins/group.py", line 25, in <module>
    from ufactory import PloneUser
  File "/home/jenkins/.buildout/eggs/Products.PlonePAS-5.0.5-py2.6.egg/Products/PlonePAS/plugins/ufactory.py", line 15, in <module>
    from collections import OrderedDict


FAILED:  Products.CMFPlone.tests.testRegistrationTool.Startup

Error Message:
cannot import name OrderedDict

Stack Trace:
cannot import name OrderedDict

  File "/home/jenkins/workspace/plone-4.3-python-2.6 at 2/src/Products.CMFPlone/Products/CMFPlone/tests/testRegistrationTool.py", line 9, in <module>
    from Products.CMFPlone.tests.utils import MockMailHost
  File "/home/jenkins/workspace/plone-4.3-python-2.6 at 2/src/Products.CMFPlone/Products/CMFPlone/tests/utils.py", line 6, in <module>
    from Products.CMFPlone.patches.securemailhost import secureSend
  File "/home/jenkins/workspace/plone-4.3-python-2.6 at 2/src/Products.CMFPlone/Products/CMFPlone/patches/__init__.py", line 13, in <module>
    csrf.applyPatches()             # CSRF attacks
  File "/home/jenkins/workspace/plone-4.3-python-2.6 at 2/src/Products.CMFPlone/Products/CMFPlone/patches/csrf.py", line 22, in applyPatches
    from Products.PlonePAS.tools.membership import MembershipTool as PMT
  File "/home/jenkins/.buildout/eggs/Products.PlonePAS-5.0.5-py2.6.egg/Products/PlonePAS/__init__.py", line 8, in <module>
    from Products.PlonePAS.plugins import group
  File "/home/jenkins/.buildout/eggs/Products.PlonePAS-5.0.5-py2.6.egg/Products/PlonePAS/plugins/group.py", line 25, in <module>
    from ufactory import PloneUser
  File "/home/jenkins/.buildout/eggs/Products.PlonePAS-5.0.5-py2.6.egg/Products/PlonePAS/plugins/ufactory.py", line 15, in <module>
    from collections import OrderedDict


FAILED:  Products.CMFPlone.tests.testSecurity.TestAttackVectorsUnit.test_PT_allow_module_not_available_in_RestrictedPython_1

Error Message:
(<type 'exceptions.ImportError'>, <class 'zExceptions.unauthorized.Unauthorized'>) not raised

Stack Trace:
(<type 'exceptions.ImportError'>, <class 'zExceptions.unauthorized.Unauthorized'>) not raised

  File "/usr/lib/python2.6/unittest.py", line 279, in run
    testMethod()
  File "/home/jenkins/workspace/plone-4.3-python-2.6 at 2/src/Products.CMFPlone/Products/CMFPlone/tests/testSecurity.py", line 44, in test_PT_allow_module_not_available_in_RestrictedPython_1
    self.assertRaises((ImportError, Unauthorized), script)
  File "/usr/lib/python2.6/unittest.py", line 342, in failUnlessRaises
    raise self.failureException, "%s not raised" % excName


FAILED:  Products.CMFPlone.tests.testSecurity.TestAttackVectorsUnit.test_PT_allow_module_not_available_in_RestrictedPython_2

Error Message:
(<type 'exceptions.ImportError'>, <class 'zExceptions.unauthorized.Unauthorized'>) not raised

Stack Trace:
(<type 'exceptions.ImportError'>, <class 'zExceptions.unauthorized.Unauthorized'>) not raised

  File "/usr/lib/python2.6/unittest.py", line 279, in run
    testMethod()
  File "/home/jenkins/workspace/plone-4.3-python-2.6 at 2/src/Products.CMFPlone/Products/CMFPlone/tests/testSecurity.py", line 55, in test_PT_allow_module_not_available_in_RestrictedPython_2
    self.assertRaises((ImportError, Unauthorized), script)
  File "/usr/lib/python2.6/unittest.py", line 342, in failUnlessRaises
    raise self.failureException, "%s not raised" % excName


FAILED:  Products.CMFPlone.tests.testSecurity.TestAttackVectorsUnit.test_gtbn_funcglobals

Error Message:
getToolByName should block access to non CMF tools

Stack Trace:
getToolByName should block access to non CMF tools

  File "/usr/lib/python2.6/unittest.py", line 279, in run
    testMethod()
  File "/home/jenkins/workspace/plone-4.3-python-2.6 at 2/src/Products.CMFPlone/Products/CMFPlone/tests/testSecurity.py", line 21, in test_gtbn_funcglobals
    self.fail('getToolByName should block access to non CMF tools')
  File "/usr/lib/python2.6/unittest.py", line 317, in fail
    raise self.failureException, msg


FAILED:  Products.CMFPlone.tests.test_mails.Startup

Error Message:
cannot import name OrderedDict

Stack Trace:
cannot import name OrderedDict

  File "/home/jenkins/workspace/plone-4.3-python-2.6 at 2/src/Products.CMFPlone/Products/CMFPlone/tests/test_mails.py", line 10, in <module>
    from Products.CMFPlone.tests.utils import MockMailHost
  File "/home/jenkins/workspace/plone-4.3-python-2.6 at 2/src/Products.CMFPlone/Products/CMFPlone/tests/utils.py", line 6, in <module>
    from Products.CMFPlone.patches.securemailhost import secureSend
  File "/home/jenkins/workspace/plone-4.3-python-2.6 at 2/src/Products.CMFPlone/Products/CMFPlone/patches/__init__.py", line 13, in <module>
    csrf.applyPatches()             # CSRF attacks
  File "/home/jenkins/workspace/plone-4.3-python-2.6 at 2/src/Products.CMFPlone/Products/CMFPlone/patches/csrf.py", line 22, in applyPatches
    from Products.PlonePAS.tools.membership import MembershipTool as PMT
  File "/home/jenkins/.buildout/eggs/Products.PlonePAS-5.0.5-py2.6.egg/Products/PlonePAS/__init__.py", line 8, in <module>
    from Products.PlonePAS.plugins import group
  File "/home/jenkins/.buildout/eggs/Products.PlonePAS-5.0.5-py2.6.egg/Products/PlonePAS/plugins/group.py", line 25, in <module>
    from ufactory import PloneUser
  File "/home/jenkins/.buildout/eggs/Products.PlonePAS-5.0.5-py2.6.egg/Products/PlonePAS/plugins/ufactory.py", line 15, in <module>
    from collections import OrderedDict


FAILED:  Products.CMFPlone.tests.test_ploneutils.Startup

Error Message:
cannot import name OrderedDict

Stack Trace:
cannot import name OrderedDict

  File "/home/jenkins/workspace/plone-4.3-python-2.6 at 2/src/Products.CMFPlone/Products/CMFPlone/tests/test_ploneutils.py", line 4, in <module>
    from Products.CMFPlone.testing import PRODUCTS_CMFPLONE_INTEGRATION_TESTING
  File "/home/jenkins/workspace/plone-4.3-python-2.6 at 2/src/Products.CMFPlone/Products/CMFPlone/testing.py", line 15, in <module>
    from plone.app.robotframework import RemoteLibraryLayer
  File "/home/jenkins/.buildout/eggs/plone.app.robotframework-0.9.9-py2.6.egg/plone/app/robotframework/__init__.py", line 12, in <module>
    from plone.app.robotframework.autologin import AutoLogin
  File "/home/jenkins/.buildout/eggs/plone.app.robotframework-0.9.9-py2.6.egg/plone/app/robotframework/autologin.py", line 2, in <module>
    from Products.PlonePAS.Extensions.Install import activatePluginInterfaces
  File "/home/jenkins/.buildout/eggs/Products.PlonePAS-5.0.5-py2.6.egg/Products/PlonePAS/__init__.py", line 8, in <module>
    from Products.PlonePAS.plugins import group
  File "/home/jenkins/.buildout/eggs/Products.PlonePAS-5.0.5-py2.6.egg/Products/PlonePAS/plugins/group.py", line 25, in <module>
    from ufactory import PloneUser
  File "/home/jenkins/.buildout/eggs/Products.PlonePAS-5.0.5-py2.6.egg/Products/PlonePAS/plugins/ufactory.py", line 15, in <module>
    from collections import OrderedDict


FAILED:  Products.CMFPlone.tests.test_robot.Startup

Error Message:
cannot import name OrderedDict

Stack Trace:
cannot import name OrderedDict

  File "/home/jenkins/workspace/plone-4.3-python-2.6 at 2/src/Products.CMFPlone/Products/CMFPlone/tests/test_robot.py", line 6, in <module>
    from Products.CMFPlone.testing import PRODUCTS_CMFPLONE_ROBOT_TESTING
  File "/home/jenkins/workspace/plone-4.3-python-2.6 at 2/src/Products.CMFPlone/Products/CMFPlone/testing.py", line 15, in <module>
    from plone.app.robotframework import RemoteLibraryLayer
  File "/home/jenkins/.buildout/eggs/plone.app.robotframework-0.9.9-py2.6.egg/plone/app/robotframework/__init__.py", line 12, in <module>
    from plone.app.robotframework.autologin import AutoLogin
  File "/home/jenkins/.buildout/eggs/plone.app.robotframework-0.9.9-py2.6.egg/plone/app/robotframework/autologin.py", line 2, in <module>
    from Products.PlonePAS.Extensions.Install import activatePluginInterfaces
  File "/home/jenkins/.buildout/eggs/Products.PlonePAS-5.0.5-py2.6.egg/Products/PlonePAS/__init__.py", line 8, in <module>
    from Products.PlonePAS.plugins import group
  File "/home/jenkins/.buildout/eggs/Products.PlonePAS-5.0.5-py2.6.egg/Products/PlonePAS/plugins/group.py", line 25, in <module>
    from ufactory import PloneUser
  File "/home/jenkins/.buildout/eggs/Products.PlonePAS-5.0.5-py2.6.egg/Products/PlonePAS/plugins/ufactory.py", line 15, in <module>
    from collections import OrderedDict


FAILED:  Products.PasswordResetTool.tests.test_doctests.Startup

Error Message:
cannot import name OrderedDict

Stack Trace:
cannot import name OrderedDict

  File "/home/jenkins/.buildout/eggs/Products.PasswordResetTool-2.0.18-py2.6.egg/Products/PasswordResetTool/tests/test_doctests.py", line 11, in <module>
    from Products.CMFPlone.tests.utils import MockMailHost
  File "/home/jenkins/workspace/plone-4.3-python-2.6 at 2/src/Products.CMFPlone/Products/CMFPlone/tests/utils.py", line 6, in <module>
    from Products.CMFPlone.patches.securemailhost import secureSend
  File "/home/jenkins/workspace/plone-4.3-python-2.6 at 2/src/Products.CMFPlone/Products/CMFPlone/patches/__init__.py", line 13, in <module>
    csrf.applyPatches()             # CSRF attacks
  File "/home/jenkins/workspace/plone-4.3-python-2.6 at 2/src/Products.CMFPlone/Products/CMFPlone/patches/csrf.py", line 22, in applyPatches
    from Products.PlonePAS.tools.membership import MembershipTool as PMT
  File "/home/jenkins/.buildout/eggs/Products.PlonePAS-5.0.5-py2.6.egg/Products/PlonePAS/__init__.py", line 8, in <module>
    from Products.PlonePAS.plugins import group
  File "/home/jenkins/.buildout/eggs/Products.PlonePAS-5.0.5-py2.6.egg/Products/PlonePAS/plugins/group.py", line 25, in <module>
    from ufactory import PloneUser
  File "/home/jenkins/.buildout/eggs/Products.PlonePAS-5.0.5-py2.6.egg/Products/PlonePAS/plugins/ufactory.py", line 15, in <module>
    from collections import OrderedDict


FAILED:  Products.TinyMCE.tests.test_bbb.BBBTests.test_implementedOrProvidedBy

Error Message:
'InterfaceClass' object has no attribute 'isImplementedBy'

Stack Trace:
'InterfaceClass' object has no attribute 'isImplementedBy'

  File "/usr/lib/python2.6/unittest.py", line 279, in run
    testMethod()
  File "/home/jenkins/workspace/plone-4.3-python-2.6 at 2/src/Products.TinyMCE/Products/TinyMCE/tests/test_bbb.py", line 20, in test_implementedOrProvidedBy
    self.assertFalse(implementedOrProvidedBy(ITestIface, myobj))
  File "/home/jenkins/workspace/plone-4.3-python-2.6 at 2/src/Products.TinyMCE/Products/TinyMCE/bbb.py", line 15, in implementedOrProvidedBy
    return anInterface.isImplementedBy(anObject)


FAILED:  archetypes.referencebrowserwidget.tests.test_browser.Startup

Error Message:
File "/home/jenkins/.buildout/eggs/Zope2-2.13.23-py2.6.egg/Zope2/utilities/skel/etc/site.zcml", line 16.2-16.23

Stack Trace:
File "/home/jenkins/.buildout/eggs/Zope2-2.13.23-py2.6.egg/Zope2/utilities/skel/etc/site.zcml", line 16.2-16.23
    ZopeXMLConfigurationError: File "/home/jenkins/workspace/plone-4.3-python-2.6 at 2/src/Products.CMFPlone/Products/CMFPlone/configure.zcml", line 15.2-15.46
    ZopeXMLConfigurationError: File "/home/jenkins/.buildout/eggs/plone.app.contentrules-3.0.9-py2.6.egg/plone/app/contentrules/configure.zcml", line 10.4-10.44
    ZopeXMLConfigurationError: File "/home/jenkins/.buildout/eggs/plone.stringinterp-1.0.13-py2.6.egg/plone/stringinterp/configure.zcml", line 21.3-26.9
    ImportError: cannot import name OrderedDict

  File "/home/jenkins/.buildout/eggs/archetypes.referencebrowserwidget-2.5.6-py2.6.egg/archetypes/referencebrowserwidget/tests/test_browser.py", line 4, in <module>
    from archetypes.referencebrowserwidget.tests.base import FunctionalTestCase
  File "/home/jenkins/.buildout/eggs/archetypes.referencebrowserwidget-2.5.6-py2.6.egg/archetypes/referencebrowserwidget/tests/base.py", line 21, in <module>
    app = ztc.app()
  File "/home/jenkins/.buildout/eggs/Zope2-2.13.23-py2.6.egg/Testing/ZopeTestCase/base.py", line 30, in app
    app = Zope2.app()
  File "/home/jenkins/.buildout/eggs/Zope2-2.13.23-py2.6.egg/Zope2/__init__.py", line 51, in app
    startup()
  File "/home/jenkins/.buildout/eggs/Zope2-2.13.23-py2.6.egg/Zope2/__init__.py", line 47, in startup
    _startup()
  File "/home/jenkins/.buildout/eggs/Zope2-2.13.23-py2.6.egg/Zope2/App/startup.py", line 118, in startup
    load_zcml()
  File "/home/jenkins/.buildout/eggs/Zope2-2.13.23-py2.6.egg/Zope2/App/startup.py", line 52, in load_zcml
    load_site()
  File "/home/jenkins/.buildout/eggs/Zope2-2.13.23-py2.6.egg/Zope2/App/zcml.py", line 46, in load_site
    _context = xmlconfig.file(site_zcml)
  File "/home/jenkins/.buildout/eggs/zope.configuration-3.7.4-py2.6.egg/zope/configuration/xmlconfig.py", line 649, in file
    include(context, name, package)
  File "/home/jenkins/.buildout/eggs/zope.configuration-3.7.4-py2.6.egg/zope/configuration/xmlconfig.py", line 548, in include
    processxmlfile(f, context)
  File "/home/jenkins/.buildout/eggs/zope.configuration-3.7.4-py2.6.egg/zope/configuration/xmlconfig.py", line 380, in processxmlfile
    parser.parse(src)
  File "/usr/lib/python2.6/xml/sax/expatreader.py", line 107, in parse
    xmlreader.IncrementalParser.parse(self, source)
  File "/usr/lib/python2.6/xml/sax/xmlreader.py", line 123, in parse
    self.feed(buffer)
  File "/usr/lib/python2.6/xml/sax/expatreader.py", line 207, in feed
    self._parser.Parse(data, isFinal)
  File "/usr/lib/python2.6/xml/sax/expatreader.py", line 349, in end_element_ns
    self._cont_handler.endElementNS(pair, None)
  File "/home/jenkins/.buildout/eggs/zope.configuration-3.7.4-py2.6.egg/zope/configuration/xmlconfig.py", line 359, in endElementNS
    self.context.end()
  File "/home/jenkins/.buildout/eggs/zope.configuration-3.7.4-py2.6.egg/zope/configuration/config.py", line 558, in end
    self.stack.pop().finish()
  File "/home/jenkins/.buildout/eggs/zope.configuration-3.7.4-py2.6.egg/zope/configuration/config.py", line 706, in finish
    actions = self.handler(context, **args)
  File "/home/jenkins/.buildout/eggs/Zope2-2.13.23-py2.6.egg/OFS/metaconfigure.py", line 46, in loadProducts
    xmlconfig.include(_context, zcml, package=product)
  File "/home/jenkins/.buildout/eggs/zope.configuration-3.7.4-py2.6.egg/zope/configuration/xmlconfig.py", line 548, in include
    processxmlfile(f, context)
  File "/home/jenkins/.buildout/eggs/zope.configuration-3.7.4-py2.6.egg/zope/configuration/xmlconfig.py", line 380, in processxmlfile
    parser.parse(src)
  File "/usr/lib/python2.6/xml/sax/expatreader.py", line 107, in parse
    xmlreader.IncrementalParser.parse(self, source)
  File "/usr/lib/python2.6/xml/sax/xmlreader.py", line 123, in parse
    self.feed(buffer)
  File "/usr/lib/python2.6/xml/sax/expatreader.py", line 207, in feed
    self._parser.Parse(data, isFinal)
  File "/usr/lib/python2.6/xml/sax/expatreader.py", line 349, in end_element_ns
    self._cont_handler.endElementNS(pair, None)
  File "/home/jenkins/.buildout/eggs/zope.configuration-3.7.4-py2.6.egg/zope/configuration/xmlconfig.py", line 359, in endElementNS
    self.context.end()
  File "/home/jenkins/.buildout/eggs/zope.configuration-3.7.4-py2.6.egg/zope/configuration/config.py", line 558, in end
    self.stack.pop().finish()
  File "/home/jenkins/.buildout/eggs/zope.configuration-3.7.4-py2.6.egg/zope/configuration/config.py", line 706, in finish
    actions = self.handler(context, **args)
  File "/home/jenkins/.buildout/eggs/zope.configuration-3.7.4-py2.6.egg/zope/configuration/xmlconfig.py", line 548, in include
    processxmlfile(f, context)
  File "/home/jenkins/.buildout/eggs/zope.configuration-3.7.4-py2.6.egg/zope/configuration/xmlconfig.py", line 380, in processxmlfile
    parser.parse(src)
  File "/usr/lib/python2.6/xml/sax/expatreader.py", line 107, in parse
    xmlreader.IncrementalParser.parse(self, source)
  File "/usr/lib/python2.6/xml/sax/xmlreader.py", line 123, in parse
    self.feed(buffer)
  File "/usr/lib/python2.6/xml/sax/expatreader.py", line 207, in feed
    self._parser.Parse(data, isFinal)
  File "/usr/lib/python2.6/xml/sax/expatreader.py", line 349, in end_element_ns
    self._cont_handler.endElementNS(pair, None)
  File "/home/jenkins/.buildout/eggs/zope.configuration-3.7.4-py2.6.egg/zope/configuration/xmlconfig.py", line 359, in endElementNS
    self.context.end()
  File "/home/jenkins/.buildout/eggs/zope.configuration-3.7.4-py2.6.egg/zope/configuration/config.py", line 558, in end
    self.stack.pop().finish()
  File "/home/jenkins/.buildout/eggs/zope.configuration-3.7.4-py2.6.egg/zope/configuration/config.py", line 706, in finish
    actions = self.handler(context, **args)
  File "/home/jenkins/.buildout/eggs/zope.configuration-3.7.4-py2.6.egg/zope/configuration/xmlconfig.py", line 548, in include
    processxmlfile(f, context)
  File "/home/jenkins/.buildout/eggs/zope.configuration-3.7.4-py2.6.egg/zope/configuration/xmlconfig.py", line 380, in processxmlfile
    parser.parse(src)
  File "/usr/lib/python2.6/xml/sax/expatreader.py", line 107, in parse
    xmlreader.IncrementalParser.parse(self, source)
  File "/usr/lib/python2.6/xml/sax/xmlreader.py", line 123, in parse
    self.feed(buffer)
  File "/usr/lib/python2.6/xml/sax/expatreader.py", line 207, in feed
    self._parser.Parse(data, isFinal)
  File "/usr/lib/python2.6/xml/sax/expatreader.py", line 349, in end_element_ns
    self._cont_handler.endElementNS(pair, None)
  File "/home/jenkins/.buildout/eggs/zope.configuration-3.7.4-py2.6.egg/zope/configuration/xmlconfig.py", line 359, in endElementNS
    self.context.end()
  File "/home/jenkins/.buildout/eggs/zope.configuration-3.7.4-py2.6.egg/zope/configuration/config.py", line 558, in end
    self.stack.pop().finish()
  File "/home/jenkins/.buildout/eggs/zope.configuration-3.7.4-py2.6.egg/zope/configuration/config.py", line 705, in finish
    args = toargs(context, *self.argdata)
  File "/home/jenkins/.buildout/eggs/zope.configuration-3.7.4-py2.6.egg/zope/configuration/config.py", line 1397, in toargs
    args[str(name)] = field.fromUnicode(s)
  File "/home/jenkins/.buildout/eggs/zope.configuration-3.7.4-py2.6.egg/zope/configuration/fields.py", line 227, in fromUnicode
    v = vt.fromUnicode(s)
  File "/home/jenkins/.buildout/eggs/zope.configuration-3.7.4-py2.6.egg/zope/configuration/fields.py", line 137, in fromUnicode
    value = self.context.resolve(name)
  File "/home/jenkins/.buildout/eggs/zope.configuration-3.7.4-py2.6.egg/zope/configuration/config.py", line 179, in resolve
    mod = __import__(mname, *_import_chickens)
  File "/home/jenkins/.buildout/eggs/plone.stringinterp-1.0.13-py2.6.egg/plone/stringinterp/adapters.py", line 18, in <module>
    from Products.PlonePAS.interfaces.group import IGroupData
  File "/home/jenkins/.buildout/eggs/Products.PlonePAS-5.0.5-py2.6.egg/Products/PlonePAS/__init__.py", line 8, in <module>
    from Products.PlonePAS.plugins import group
  File "/home/jenkins/.buildout/eggs/Products.PlonePAS-5.0.5-py2.6.egg/Products/PlonePAS/plugins/group.py", line 25, in <module>
    from ufactory import PloneUser
  File "/home/jenkins/.buildout/eggs/Products.PlonePAS-5.0.5-py2.6.egg/Products/PlonePAS/plugins/ufactory.py", line 15, in <module>
    from collections import OrderedDict


FAILED:  archetypes.referencebrowserwidget.tests.test_product.Startup

Error Message:
cannot import name Batch

Stack Trace:
cannot import name Batch

  File "/home/jenkins/.buildout/eggs/archetypes.referencebrowserwidget-2.5.6-py2.6.egg/archetypes/referencebrowserwidget/tests/test_product.py", line 41, in <module>
    from Products.CMFPlone import Batch


FAILED:  archetypes.referencebrowserwidget.tests.test_utils.Startup

Error Message:
'NoneType' object is not callable

Stack Trace:
'NoneType' object is not callable

  File "/home/jenkins/.buildout/eggs/archetypes.referencebrowserwidget-2.5.6-py2.6.egg/archetypes/referencebrowserwidget/tests/test_utils.py", line 4, in <module>
    from archetypes.referencebrowserwidget.tests.base import TestCase
  File "/home/jenkins/.buildout/eggs/archetypes.referencebrowserwidget-2.5.6-py2.6.egg/archetypes/referencebrowserwidget/tests/base.py", line 21, in <module>
    app = ztc.app()
  File "/home/jenkins/.buildout/eggs/Zope2-2.13.23-py2.6.egg/Testing/ZopeTestCase/base.py", line 30, in app
    app = Zope2.app()
  File "/home/jenkins/.buildout/eggs/Zope2-2.13.23-py2.6.egg/Zope2/__init__.py", line 52, in app
    return bobo_application(*args, **kw)


FAILED:  plone.app.testing.helpers.rst

Error Message:
Failed doctest test for helpers.rst

Stack Trace:
Failed doctest test for helpers.rst
  File "/home/jenkins/.buildout/eggs/plone.app.testing-4.2.5-py2.6.egg/plone/app/testing/helpers.rst", line 0

----------------------------------------------------------------------
File "/home/jenkins/.buildout/eggs/plone.app.testing-4.2.5-py2.6.egg/plone/app/testing/helpers.rst", line 117, in helpers.rst
Failed example:
    runner.setup_layer(options, HELPER_DEMOS_INTEGRATION_TESTING, setupLayers)
Exception raised:
    Traceback (most recent call last):
      File "/usr/lib/python2.6/doctest.py", line 1253, in __run
        compileflags, 1) in test.globs
      File "<doctest helpers.rst[11]>", line 1, in <module>
        runner.setup_layer(options, HELPER_DEMOS_INTEGRATION_TESTING, setupLayers)
      File "/home/jenkins/.buildout/eggs/zope.testing-3.9.7-py2.6.egg/zope/testing/testrunner/runner.py", line 628, in setup_layer
        setup_layer(options, base, setup_layers)
      File "/home/jenkins/.buildout/eggs/zope.testing-3.9.7-py2.6.egg/zope/testing/testrunner/runner.py", line 628, in setup_layer
        setup_layer(options, base, setup_layers)
      File "/home/jenkins/.buildout/eggs/zope.testing-3.9.7-py2.6.egg/zope/testing/testrunner/runner.py", line 628, in setup_layer
        setup_layer(options, base, setup_layers)
      File "/home/jenkins/.buildout/eggs/zope.testing-3.9.7-py2.6.egg/zope/testing/testrunner/runner.py", line 633, in setup_layer
        layer.setUp()
      File "/home/jenkins/workspace/plone-4.3-python-2.6 at 2/src/plone.testing/src/plone/testing/z2.py", line 345, in setUp
        self.setUpDatabase()
      File "/home/jenkins/workspace/plone-4.3-python-2.6 at 2/src/plone.testing/src/plone/testing/z2.py", line 555, in setUpDatabase
        name='Startup')
      File "/home/jenkins/workspace/plone-4.3-python-2.6 at 2/src/plone.testing/src/plone/testing/zodb.py", line 26, in stackDemoStorage
        storage = DemoStorage(name=name, base=db.storage)
    AttributeError: 'DB' object has no attribute 'storage'


  File "/usr/lib/python2.6/unittest.py", line 279, in run
    testMethod()
  File "/usr/lib/python2.6/doctest.py", line 2163, in runTest
    raise self.failureException(self.format_failure(new.getvalue()))


FAILED:  plone.app.testing.layers.rst

Error Message:
Failed doctest test for layers.rst

Stack Trace:
Failed doctest test for layers.rst
  File "/home/jenkins/.buildout/eggs/plone.app.testing-4.2.5-py2.6.egg/plone/app/testing/layers.rst", line 0

----------------------------------------------------------------------
File "/home/jenkins/.buildout/eggs/plone.app.testing-4.2.5-py2.6.egg/plone/app/testing/layers.rst", line 46, in layers.rst
Failed example:
    runner.setup_layer(options, layers.PLONE_FIXTURE, setupLayers)
Exception raised:
    Traceback (most recent call last):
      File "/usr/lib/python2.6/doctest.py", line 1253, in __run
        compileflags, 1) in test.globs
      File "<doctest layers.rst[4]>", line 1, in <module>
        runner.setup_layer(options, layers.PLONE_FIXTURE, setupLayers)
      File "/home/jenkins/.buildout/eggs/zope.testing-3.9.7-py2.6.egg/zope/testing/testrunner/runner.py", line 628, in setup_layer
        setup_layer(options, base, setup_layers)
      File "/home/jenkins/.buildout/eggs/zope.testing-3.9.7-py2.6.egg/zope/testing/testrunner/runner.py", line 633, in setup_layer
        layer.setUp()
      File "/home/jenkins/workspace/plone-4.3-python-2.6 at 2/src/plone.testing/src/plone/testing/z2.py", line 345, in setUp
        self.setUpDatabase()
      File "/home/jenkins/workspace/plone-4.3-python-2.6 at 2/src/plone.testing/src/plone/testing/z2.py", line 555, in setUpDatabase
        name='Startup')
      File "/home/jenkins/workspace/plone-4.3-python-2.6 at 2/src/plone.testing/src/plone/testing/zodb.py", line 26, in stackDemoStorage
        storage = DemoStorage(name=name, base=db.storage)
    AttributeError: 'DB' object has no attribute 'storage'


  File "/usr/lib/python2.6/unittest.py", line 279, in run
    testMethod()
  File "/usr/lib/python2.6/doctest.py", line 2163, in runTest
    raise self.failureException(self.format_failure(new.getvalue()))


FAILED:  src.plone.testing.z2.rst

Error Message:
Failed doctest test for z2.rst

Stack Trace:
Failed doctest test for z2.rst
  File "/home/jenkins/workspace/plone-4.3-python-2.6 at 2/src/plone.testing/src/plone/testing/z2.rst", line 0

----------------------------------------------------------------------
File "/home/jenkins/workspace/plone-4.3-python-2.6 at 2/src/plone.testing/src/plone/testing/z2.rst", line 46, in z2.rst
Failed example:
    runner.setup_layer(options, z2.STARTUP, setupLayers)
Exception raised:
    Traceback (most recent call last):
      File "/usr/lib/python2.6/doctest.py", line 1253, in __run
        compileflags, 1) in test.globs
      File "<doctest z2.rst[10]>", line 1, in <module>
        runner.setup_layer(options, z2.STARTUP, setupLayers)
      File "/home/jenkins/.buildout/eggs/zope.testrunner-4.4.4-py2.6.egg/zope/testrunner/runner.py", line 713, in setup_layer
        layer.setUp()
      File "/home/jenkins/workspace/plone-4.3-python-2.6 at 2/src/plone.testing/src/plone/testing/z2.py", line 345, in setUp
        self.setUpDatabase()
      File "/home/jenkins/workspace/plone-4.3-python-2.6 at 2/src/plone.testing/src/plone/testing/z2.py", line 555, in setUpDatabase
        name='Startup')
      File "/home/jenkins/workspace/plone-4.3-python-2.6 at 2/src/plone.testing/src/plone/testing/zodb.py", line 26, in stackDemoStorage
        storage = DemoStorage(name=name, base=db.storage)
    AttributeError: 'DB' object has no attribute 'storage'


  File "/usr/lib/python2.6/unittest.py", line 279, in run
    testMethod()
  File "/usr/lib/python2.6/doctest.py", line 2163, in runTest
    raise self.failureException(self.format_failure(new.getvalue()))


FAILED:  plone.app.collection.tests.test_robot.Startup

Error Message:
cannot import name OrderedDict

Stack Trace:
cannot import name OrderedDict

  File "/home/jenkins/.buildout/eggs/plone.app.collection-1.0.13-py2.6.egg/plone/app/collection/tests/test_robot.py", line 7, in <module>
    from plone.app.collection.testing import PLONEAPPCOLLECTION_ROBOT_TESTING
  File "/home/jenkins/.buildout/eggs/plone.app.collection-1.0.13-py2.6.egg/plone/app/collection/testing.py", line 15, in <module>
    from plone.app.robotframework.testing import REMOTE_LIBRARY_BUNDLE_FIXTURE
  File "/home/jenkins/.buildout/eggs/plone.app.robotframework-0.9.9-py2.6.egg/plone/app/robotframework/__init__.py", line 12, in <module>
    from plone.app.robotframework.autologin import AutoLogin
  File "/home/jenkins/.buildout/eggs/plone.app.robotframework-0.9.9-py2.6.egg/plone/app/robotframework/autologin.py", line 2, in <module>
    from Products.PlonePAS.Extensions.Install import activatePluginInterfaces
  File "/home/jenkins/.buildout/eggs/Products.PlonePAS-5.0.5-py2.6.egg/Products/PlonePAS/__init__.py", line 8, in <module>
    from Products.PlonePAS.plugins import group
  File "/home/jenkins/.buildout/eggs/Products.PlonePAS-5.0.5-py2.6.egg/Products/PlonePAS/plugins/group.py", line 25, in <module>
    from ufactory import PloneUser
  File "/home/jenkins/.buildout/eggs/Products.PlonePAS-5.0.5-py2.6.egg/Products/PlonePAS/plugins/ufactory.py", line 15, in <module>
    from collections import OrderedDict


FAILED:  plone.app.dexterity.tests.test_constrains.Startup

Error Message:
cannot import name OrderedDict

Stack Trace:
cannot import name OrderedDict

  File "/home/jenkins/.buildout/eggs/plone.app.dexterity-2.0.17-py2.6.egg/plone/app/dexterity/tests/test_constrains.py", line 16, in <module>
    from plone.app.dexterity.testing import (
  File "/home/jenkins/.buildout/eggs/plone.app.dexterity-2.0.17-py2.6.egg/plone/app/dexterity/testing.py", line 5, in <module>
    from plone.app.robotframework.testing import AUTOLOGIN_LIBRARY_FIXTURE
  File "/home/jenkins/.buildout/eggs/plone.app.robotframework-0.9.9-py2.6.egg/plone/app/robotframework/__init__.py", line 12, in <module>
    from plone.app.robotframework.autologin import AutoLogin
  File "/home/jenkins/.buildout/eggs/plone.app.robotframework-0.9.9-py2.6.egg/plone/app/robotframework/autologin.py", line 2, in <module>
    from Products.PlonePAS.Extensions.Install import activatePluginInterfaces
  File "/home/jenkins/.buildout/eggs/Products.PlonePAS-5.0.5-py2.6.egg/Products/PlonePAS/__init__.py", line 8, in <module>
    from Products.PlonePAS.plugins import group
  File "/home/jenkins/.buildout/eggs/Products.PlonePAS-5.0.5-py2.6.egg/Products/PlonePAS/plugins/group.py", line 25, in <module>
    from ufactory import PloneUser
  File "/home/jenkins/.buildout/eggs/Products.PlonePAS-5.0.5-py2.6.egg/Products/PlonePAS/plugins/ufactory.py", line 15, in <module>
    from collections import OrderedDict


FAILED:  plone.app.dexterity.tests.test_doctests.Startup

Error Message:
cannot import name OrderedDict

Stack Trace:
cannot import name OrderedDict

  File "/home/jenkins/.buildout/eggs/plone.app.dexterity-2.0.17-py2.6.egg/plone/app/dexterity/tests/test_doctests.py", line 4, in <module>
    from plone.app.dexterity.testing import DEXTERITY_FUNCTIONAL_TESTING
  File "/home/jenkins/.buildout/eggs/plone.app.dexterity-2.0.17-py2.6.egg/plone/app/dexterity/testing.py", line 5, in <module>
    from plone.app.robotframework.testing import AUTOLOGIN_LIBRARY_FIXTURE
  File "/home/jenkins/.buildout/eggs/plone.app.robotframework-0.9.9-py2.6.egg/plone/app/robotframework/__init__.py", line 12, in <module>
    from plone.app.robotframework.autologin import AutoLogin
  File "/home/jenkins/.buildout/eggs/plone.app.robotframework-0.9.9-py2.6.egg/plone/app/robotframework/autologin.py", line 2, in <module>
    from Products.PlonePAS.Extensions.Install import activatePluginInterfaces
  File "/home/jenkins/.buildout/eggs/Products.PlonePAS-5.0.5-py2.6.egg/Products/PlonePAS/__init__.py", line 8, in <module>
    from Products.PlonePAS.plugins import group
  File "/home/jenkins/.buildout/eggs/Products.PlonePAS-5.0.5-py2.6.egg/Products/PlonePAS/plugins/group.py", line 25, in <module>
    from ufactory import PloneUser
  File "/home/jenkins/.buildout/eggs/Products.PlonePAS-5.0.5-py2.6.egg/Products/PlonePAS/plugins/ufactory.py", line 15, in <module>
    from collections import OrderedDict


FAILED:  plone.app.dexterity.tests.test_export.Startup

Error Message:
cannot import name OrderedDict

Stack Trace:
cannot import name OrderedDict

  File "/home/jenkins/.buildout/eggs/plone.app.dexterity-2.0.17-py2.6.egg/plone/app/dexterity/tests/test_export.py", line 4, in <module>
    from plone.app.dexterity.testing import DEXTERITY_INTEGRATION_TESTING
  File "/home/jenkins/.buildout/eggs/plone.app.dexterity-2.0.17-py2.6.egg/plone/app/dexterity/testing.py", line 5, in <module>
    from plone.app.robotframework.testing import AUTOLOGIN_LIBRARY_FIXTURE
  File "/home/jenkins/.buildout/eggs/plone.app.robotframework-0.9.9-py2.6.egg/plone/app/robotframework/__init__.py", line 12, in <module>
    from plone.app.robotframework.autologin import AutoLogin
  File "/home/jenkins/.buildout/eggs/plone.app.robotframework-0.9.9-py2.6.egg/plone/app/robotframework/autologin.py", line 2, in <module>
    from Products.PlonePAS.Extensions.Install import activatePluginInterfaces
  File "/home/jenkins/.buildout/eggs/Products.PlonePAS-5.0.5-py2.6.egg/Products/PlonePAS/__init__.py", line 8, in <module>
    from Products.PlonePAS.plugins import group
  File "/home/jenkins/.buildout/eggs/Products.PlonePAS-5.0.5-py2.6.egg/Products/PlonePAS/plugins/group.py", line 25, in <module>
    from ufactory import PloneUser
  File "/home/jenkins/.buildout/eggs/Products.PlonePAS-5.0.5-py2.6.egg/Products/PlonePAS/plugins/ufactory.py", line 15, in <module>
    from collections import OrderedDict


FAILED:  plone.app.dexterity.tests.test_nextprevious.Startup

Error Message:
cannot import name OrderedDict

Stack Trace:
cannot import name OrderedDict

  File "/home/jenkins/.buildout/eggs/plone.app.dexterity-2.0.17-py2.6.egg/plone/app/dexterity/tests/test_nextprevious.py", line 3, in <module>
    from plone.app.dexterity.testing import DEXTERITY_INTEGRATION_TESTING
  File "/home/jenkins/.buildout/eggs/plone.app.dexterity-2.0.17-py2.6.egg/plone/app/dexterity/testing.py", line 5, in <module>
    from plone.app.robotframework.testing import AUTOLOGIN_LIBRARY_FIXTURE
  File "/home/jenkins/.buildout/eggs/plone.app.robotframework-0.9.9-py2.6.egg/plone/app/robotframework/__init__.py", line 12, in <module>
    from plone.app.robotframework.autologin import AutoLogin
  File "/home/jenkins/.buildout/eggs/plone.app.robotframework-0.9.9-py2.6.egg/plone/app/robotframework/autologin.py", line 2, in <module>
    from Products.PlonePAS.Extensions.Install import activatePluginInterfaces
  File "/home/jenkins/.buildout/eggs/Products.PlonePAS-5.0.5-py2.6.egg/Products/PlonePAS/__init__.py", line 8, in <module>
    from Products.PlonePAS.plugins import group
  File "/home/jenkins/.buildout/eggs/Products.PlonePAS-5.0.5-py2.6.egg/Products/PlonePAS/plugins/group.py", line 25, in <module>
    from ufactory import PloneUser
  File "/home/jenkins/.buildout/eggs/Products.PlonePAS-5.0.5-py2.6.egg/Products/PlonePAS/plugins/ufactory.py", line 15, in <module>
    from collections import OrderedDict


FAILED:  plone.app.dexterity.tests.test_robot.Startup

Error Message:
cannot import name OrderedDict

Stack Trace:
cannot import name OrderedDict

  File "/home/jenkins/.buildout/eggs/plone.app.dexterity-2.0.17-py2.6.egg/plone/app/dexterity/tests/test_robot.py", line 3, in <module>
    from plone.app.dexterity.testing import DEXTERITY_ACCEPTANCE_TESTING
  File "/home/jenkins/.buildout/eggs/plone.app.dexterity-2.0.17-py2.6.egg/plone/app/dexterity/testing.py", line 5, in <module>
    from plone.app.robotframework.testing import AUTOLOGIN_LIBRARY_FIXTURE
  File "/home/jenkins/.buildout/eggs/plone.app.robotframework-0.9.9-py2.6.egg/plone/app/robotframework/__init__.py", line 12, in <module>
    from plone.app.robotframework.autologin import AutoLogin
  File "/home/jenkins/.buildout/eggs/plone.app.robotframework-0.9.9-py2.6.egg/plone/app/robotframework/autologin.py", line 2, in <module>
    from Products.PlonePAS.Extensions.Install import activatePluginInterfaces
  File "/home/jenkins/.buildout/eggs/Products.PlonePAS-5.0.5-py2.6.egg/Products/PlonePAS/__init__.py", line 8, in <module>
    from Products.PlonePAS.plugins import group
  File "/home/jenkins/.buildout/eggs/Products.PlonePAS-5.0.5-py2.6.egg/Products/PlonePAS/plugins/group.py", line 25, in <module>
    from ufactory import PloneUser
  File "/home/jenkins/.buildout/eggs/Products.PlonePAS-5.0.5-py2.6.egg/Products/PlonePAS/plugins/ufactory.py", line 15, in <module>
    from collections import OrderedDict


FAILED:  plone.app.dexterity.tests.test_upgrades.Startup

Error Message:
cannot import name OrderedDict

Stack Trace:
cannot import name OrderedDict

  File "/home/jenkins/.buildout/eggs/plone.app.dexterity-2.0.17-py2.6.egg/plone/app/dexterity/tests/test_upgrades.py", line 2, in <module>
    from plone.app.dexterity.testing import DEXTERITY_INTEGRATION_TESTING
  File "/home/jenkins/.buildout/eggs/plone.app.dexterity-2.0.17-py2.6.egg/plone/app/dexterity/testing.py", line 5, in <module>
    from plone.app.robotframework.testing import AUTOLOGIN_LIBRARY_FIXTURE
  File "/home/jenkins/.buildout/eggs/plone.app.robotframework-0.9.9-py2.6.egg/plone/app/robotframework/__init__.py", line 12, in <module>
    from plone.app.robotframework.autologin import AutoLogin
  File "/home/jenkins/.buildout/eggs/plone.app.robotframework-0.9.9-py2.6.egg/plone/app/robotframework/autologin.py", line 2, in <module>
    from Products.PlonePAS.Extensions.Install import activatePluginInterfaces
  File "/home/jenkins/.buildout/eggs/Products.PlonePAS-5.0.5-py2.6.egg/Products/PlonePAS/__init__.py", line 8, in <module>
    from Products.PlonePAS.plugins import group
  File "/home/jenkins/.buildout/eggs/Products.PlonePAS-5.0.5-py2.6.egg/Products/PlonePAS/plugins/group.py", line 25, in <module>
    from ufactory import PloneUser
  File "/home/jenkins/.buildout/eggs/Products.PlonePAS-5.0.5-py2.6.egg/Products/PlonePAS/plugins/ufactory.py", line 15, in <module>
    from collections import OrderedDict


FAILED:  plone.app.discussion.tests.test_notifications.Startup

Error Message:
cannot import name OrderedDict

Stack Trace:
cannot import name OrderedDict

  File "/home/jenkins/.buildout/eggs/plone.app.discussion-2.2.15-py2.6.egg/plone/app/discussion/tests/test_notifications.py", line 14, in <module>
    from Products.CMFPlone.tests.utils import MockMailHost
  File "/home/jenkins/workspace/plone-4.3-python-2.6 at 2/src/Products.CMFPlone/Products/CMFPlone/tests/utils.py", line 6, in <module>
    from Products.CMFPlone.patches.securemailhost import secureSend
  File "/home/jenkins/workspace/plone-4.3-python-2.6 at 2/src/Products.CMFPlone/Products/CMFPlone/patches/__init__.py", line 13, in <module>
    csrf.applyPatches()             # CSRF attacks
  File "/home/jenkins/workspace/plone-4.3-python-2.6 at 2/src/Products.CMFPlone/Products/CMFPlone/patches/csrf.py", line 22, in applyPatches
    from Products.PlonePAS.tools.membership import MembershipTool as PMT
  File "/home/jenkins/.buildout/eggs/Products.PlonePAS-5.0.5-py2.6.egg/Products/PlonePAS/__init__.py", line 8, in <module>
    from Products.PlonePAS.plugins import group
  File "/home/jenkins/.buildout/eggs/Products.PlonePAS-5.0.5-py2.6.egg/Products/PlonePAS/plugins/group.py", line 25, in <module>
    from ufactory import PloneUser
  File "/home/jenkins/.buildout/eggs/Products.PlonePAS-5.0.5-py2.6.egg/Products/PlonePAS/plugins/ufactory.py", line 15, in <module>
    from collections import OrderedDict


FAILED:  plone.app.upgrade.v30.tests.Startup

Error Message:
cannot import name OrderedDict

Stack Trace:
cannot import name OrderedDict

  File "/home/jenkins/workspace/plone-4.3-python-2.6 at 2/src/plone.app.upgrade/plone/app/upgrade/v30/__init__.py", line 2, in <module>
    import alphas
  File "/home/jenkins/workspace/plone-4.3-python-2.6 at 2/src/plone.app.upgrade/plone/app/upgrade/v30/alphas.py", line 64, in <module>
    from Products.PlonePAS.interfaces.group import IGroupTool
  File "/home/jenkins/.buildout/eggs/Products.PlonePAS-5.0.5-py2.6.egg/Products/PlonePAS/__init__.py", line 8, in <module>
    from Products.PlonePAS.plugins import group
  File "/home/jenkins/.buildout/eggs/Products.PlonePAS-5.0.5-py2.6.egg/Products/PlonePAS/plugins/group.py", line 25, in <module>
    from ufactory import PloneUser
  File "/home/jenkins/.buildout/eggs/Products.PlonePAS-5.0.5-py2.6.egg/Products/PlonePAS/plugins/ufactory.py", line 15, in <module>
    from collections import OrderedDict


FAILED:  plone.app.upgrade.v31.tests.Startup

Error Message:
cannot import name OrderedDict

Stack Trace:
cannot import name OrderedDict

  File "/home/jenkins/workspace/plone-4.3-python-2.6 at 2/src/plone.app.upgrade/plone/app/upgrade/v31/__init__.py", line 1, in <module>
    import betas
  File "/home/jenkins/workspace/plone-4.3-python-2.6 at 2/src/plone.app.upgrade/plone/app/upgrade/v31/betas.py", line 1, in <module>
    from borg.localrole.utils import replace_local_role_manager
  File "/home/jenkins/.buildout/eggs/borg.localrole-3.0.2-py2.6.egg/borg/localrole/__init__.py", line 4, in <module>
    from borg.localrole import workspace
  File "/home/jenkins/.buildout/eggs/borg.localrole-3.0.2-py2.6.egg/borg/localrole/workspace.py", line 11, in <module>
    from Products.PlonePAS.interfaces.plugins import ILocalRolesPlugin
  File "/home/jenkins/.buildout/eggs/Products.PlonePAS-5.0.5-py2.6.egg/Products/PlonePAS/__init__.py", line 8, in <module>
    from Products.PlonePAS.plugins import group
  File "/home/jenkins/.buildout/eggs/Products.PlonePAS-5.0.5-py2.6.egg/Products/PlonePAS/plugins/group.py", line 25, in <module>
    from ufactory import PloneUser
  File "/home/jenkins/.buildout/eggs/Products.PlonePAS-5.0.5-py2.6.egg/Products/PlonePAS/plugins/ufactory.py", line 15, in <module>
    from collections import OrderedDict


FAILED:  plone.app.upgrade.v40.tests.Startup

Error Message:
cannot import name OrderedDict

Stack Trace:
cannot import name OrderedDict

  File "/home/jenkins/workspace/plone-4.3-python-2.6 at 2/src/plone.app.upgrade/plone/app/upgrade/v40/__init__.py", line 1, in <module>
    import alphas
  File "/home/jenkins/workspace/plone-4.3-python-2.6 at 2/src/plone.app.upgrade/plone/app/upgrade/v40/alphas.py", line 15, in <module>
    from Products.CMFPlone.setuphandlers import addCacheHandlers
  File "/home/jenkins/workspace/plone-4.3-python-2.6 at 2/src/Products.CMFPlone/Products/CMFPlone/setuphandlers.py", line 5, in <module>
    from borg.localrole.utils import replace_local_role_manager
  File "/home/jenkins/.buildout/eggs/borg.localrole-3.0.2-py2.6.egg/borg/localrole/__init__.py", line 4, in <module>
    from borg.localrole import workspace
  File "/home/jenkins/.buildout/eggs/borg.localrole-3.0.2-py2.6.egg/borg/localrole/workspace.py", line 11, in <module>
    from Products.PlonePAS.interfaces.plugins import ILocalRolesPlugin
  File "/home/jenkins/.buildout/eggs/Products.PlonePAS-5.0.5-py2.6.egg/Products/PlonePAS/__init__.py", line 8, in <module>
    from Products.PlonePAS.plugins import group
  File "/home/jenkins/.buildout/eggs/Products.PlonePAS-5.0.5-py2.6.egg/Products/PlonePAS/plugins/group.py", line 25, in <module>
    from ufactory import PloneUser
  File "/home/jenkins/.buildout/eggs/Products.PlonePAS-5.0.5-py2.6.egg/Products/PlonePAS/plugins/ufactory.py", line 15, in <module>
    from collections import OrderedDict


FAILED:  plone.app.upgrade.v41.tests.Startup

Error Message:
cannot import name OrderedDict

Stack Trace:
cannot import name OrderedDict

  File "/home/jenkins/workspace/plone-4.3-python-2.6 at 2/src/plone.app.upgrade/plone/app/upgrade/v41/__init__.py", line 2, in <module>
    import betas
  File "/home/jenkins/workspace/plone-4.3-python-2.6 at 2/src/plone.app.upgrade/plone/app/upgrade/v41/betas.py", line 13, in <module>
    from plone.app.upgrade.v40.betas import fix_cataloged_interface_names
  File "/home/jenkins/workspace/plone-4.3-python-2.6 at 2/src/plone.app.upgrade/plone/app/upgrade/v40/__init__.py", line 1, in <module>
    import alphas
  File "/home/jenkins/workspace/plone-4.3-python-2.6 at 2/src/plone.app.upgrade/plone/app/upgrade/v40/alphas.py", line 15, in <module>
    from Products.CMFPlone.setuphandlers import addCacheHandlers
  File "/home/jenkins/workspace/plone-4.3-python-2.6 at 2/src/Products.CMFPlone/Products/CMFPlone/setuphandlers.py", line 5, in <module>
    from borg.localrole.utils import replace_local_role_manager
  File "/home/jenkins/.buildout/eggs/borg.localrole-3.0.2-py2.6.egg/borg/localrole/__init__.py", line 4, in <module>
    from borg.localrole import workspace
  File "/home/jenkins/.buildout/eggs/borg.localrole-3.0.2-py2.6.egg/borg/localrole/workspace.py", line 11, in <module>
    from Products.PlonePAS.interfaces.plugins import ILocalRolesPlugin
  File "/home/jenkins/.buildout/eggs/Products.PlonePAS-5.0.5-py2.6.egg/Products/PlonePAS/__init__.py", line 8, in <module>
    from Products.PlonePAS.plugins import group
  File "/home/jenkins/.buildout/eggs/Products.PlonePAS-5.0.5-py2.6.egg/Products/PlonePAS/plugins/group.py", line 25, in <module>
    from ufactory import PloneUser
  File "/home/jenkins/.buildout/eggs/Products.PlonePAS-5.0.5-py2.6.egg/Products/PlonePAS/plugins/ufactory.py", line 15, in <module>
    from collections import OrderedDict


FAILED:  plone.app.upgrade.v43.tests.Startup

Error Message:
cannot import name OrderedDict

Stack Trace:
cannot import name OrderedDict

  File "/home/jenkins/workspace/plone-4.3-python-2.6 at 2/src/plone.app.upgrade/plone/app/upgrade/v43/__init__.py", line 1, in <module>
    import alphas
  File "/home/jenkins/workspace/plone-4.3-python-2.6 at 2/src/plone.app.upgrade/plone/app/upgrade/v43/alphas.py", line 7, in <module>
    from plone.app.upgrade.v40.alphas import cleanUpToolRegistry
  File "/home/jenkins/workspace/plone-4.3-python-2.6 at 2/src/plone.app.upgrade/plone/app/upgrade/v40/__init__.py", line 1, in <module>
    import alphas
  File "/home/jenkins/workspace/plone-4.3-python-2.6 at 2/src/plone.app.upgrade/plone/app/upgrade/v40/alphas.py", line 15, in <module>
    from Products.CMFPlone.setuphandlers import addCacheHandlers
  File "/home/jenkins/workspace/plone-4.3-python-2.6 at 2/src/Products.CMFPlone/Products/CMFPlone/setuphandlers.py", line 5, in <module>
    from borg.localrole.utils import replace_local_role_manager
  File "/home/jenkins/.buildout/eggs/borg.localrole-3.0.2-py2.6.egg/borg/localrole/__init__.py", line 4, in <module>
    from borg.localrole import workspace
  File "/home/jenkins/.buildout/eggs/borg.localrole-3.0.2-py2.6.egg/borg/localrole/workspace.py", line 11, in <module>
    from Products.PlonePAS.interfaces.plugins import ILocalRolesPlugin
  File "/home/jenkins/.buildout/eggs/Products.PlonePAS-5.0.5-py2.6.egg/Products/PlonePAS/__init__.py", line 8, in <module>
    from Products.PlonePAS.plugins import group
  File "/home/jenkins/.buildout/eggs/Products.PlonePAS-5.0.5-py2.6.egg/Products/PlonePAS/plugins/group.py", line 25, in <module>
    from ufactory import PloneUser
  File "/home/jenkins/.buildout/eggs/Products.PlonePAS-5.0.5-py2.6.egg/Products/PlonePAS/plugins/ufactory.py", line 15, in <module>
    from collections import OrderedDict


FAILED:  plone.app.users.tests.test_account.Startup

Error Message:
cannot import name OrderedDict

Stack Trace:
cannot import name OrderedDict

  File "/home/jenkins/.buildout/eggs/plone.app.users-1.2.3-py2.6.egg/plone/app/users/tests/__init__.py", line 3, in <module>
    from plone.app.users.tests.base import TestCase  # noqa
  File "/home/jenkins/.buildout/eggs/plone.app.users-1.2.3-py2.6.egg/plone/app/users/tests/base.py", line 12, in <module>
    from Products.CMFPlone.tests.utils import MockMailHost
  File "/home/jenkins/workspace/plone-4.3-python-2.6 at 2/src/Products.CMFPlone/Products/CMFPlone/tests/utils.py", line 6, in <module>
    from Products.CMFPlone.patches.securemailhost import secureSend
  File "/home/jenkins/workspace/plone-4.3-python-2.6 at 2/src/Products.CMFPlone/Products/CMFPlone/patches/__init__.py", line 13, in <module>
    csrf.applyPatches()             # CSRF attacks
  File "/home/jenkins/workspace/plone-4.3-python-2.6 at 2/src/Products.CMFPlone/Products/CMFPlone/patches/csrf.py", line 22, in applyPatches
    from Products.PlonePAS.tools.membership import MembershipTool as PMT
  File "/home/jenkins/.buildout/eggs/Products.PlonePAS-5.0.5-py2.6.egg/Products/PlonePAS/__init__.py", line 8, in <module>
    from Products.PlonePAS.plugins import group
  File "/home/jenkins/.buildout/eggs/Products.PlonePAS-5.0.5-py2.6.egg/Products/PlonePAS/plugins/group.py", line 25, in <module>
    from ufactory import PloneUser
  File "/home/jenkins/.buildout/eggs/Products.PlonePAS-5.0.5-py2.6.egg/Products/PlonePAS/plugins/ufactory.py", line 15, in <module>
    from collections import OrderedDict


FAILED:  plone.app.users.tests.test_doctests.Startup

Error Message:
cannot import name OrderedDict

Stack Trace:
cannot import name OrderedDict

  File "/home/jenkins/.buildout/eggs/plone.app.users-1.2.3-py2.6.egg/plone/app/users/tests/__init__.py", line 3, in <module>
    from plone.app.users.tests.base import TestCase  # noqa
  File "/home/jenkins/.buildout/eggs/plone.app.users-1.2.3-py2.6.egg/plone/app/users/tests/base.py", line 12, in <module>
    from Products.CMFPlone.tests.utils import MockMailHost
  File "/home/jenkins/workspace/plone-4.3-python-2.6 at 2/src/Products.CMFPlone/Products/CMFPlone/tests/utils.py", line 6, in <module>
    from Products.CMFPlone.patches.securemailhost import secureSend
  File "/home/jenkins/workspace/plone-4.3-python-2.6 at 2/src/Products.CMFPlone/Products/CMFPlone/patches/__init__.py", line 13, in <module>
    csrf.applyPatches()             # CSRF attacks
  File "/home/jenkins/workspace/plone-4.3-python-2.6 at 2/src/Products.CMFPlone/Products/CMFPlone/patches/csrf.py", line 22, in applyPatches
    from Products.PlonePAS.tools.membership import MembershipTool as PMT
  File "/home/jenkins/.buildout/eggs/Products.PlonePAS-5.0.5-py2.6.egg/Products/PlonePAS/__init__.py", line 8, in <module>
    from Products.PlonePAS.plugins import group
  File "/home/jenkins/.buildout/eggs/Products.PlonePAS-5.0.5-py2.6.egg/Products/PlonePAS/plugins/group.py", line 25, in <module>
    from ufactory import PloneUser
  File "/home/jenkins/.buildout/eggs/Products.PlonePAS-5.0.5-py2.6.egg/Products/PlonePAS/plugins/ufactory.py", line 15, in <module>
    from collections import OrderedDict


FAILED:  plone.app.users.tests.test_new_user.Startup

Error Message:
cannot import name OrderedDict

Stack Trace:
cannot import name OrderedDict

  File "/home/jenkins/.buildout/eggs/plone.app.users-1.2.3-py2.6.egg/plone/app/users/tests/__init__.py", line 3, in <module>
    from plone.app.users.tests.base import TestCase  # noqa
  File "/home/jenkins/.buildout/eggs/plone.app.users-1.2.3-py2.6.egg/plone/app/users/tests/base.py", line 12, in <module>
    from Products.CMFPlone.tests.utils import MockMailHost
  File "/home/jenkins/workspace/plone-4.3-python-2.6 at 2/src/Products.CMFPlone/Products/CMFPlone/tests/utils.py", line 6, in <module>
    from Products.CMFPlone.patches.securemailhost import secureSend
  File "/home/jenkins/workspace/plone-4.3-python-2.6 at 2/src/Products.CMFPlone/Products/CMFPlone/patches/__init__.py", line 13, in <module>
    csrf.applyPatches()             # CSRF attacks
  File "/home/jenkins/workspace/plone-4.3-python-2.6 at 2/src/Products.CMFPlone/Products/CMFPlone/patches/csrf.py", line 22, in applyPatches
    from Products.PlonePAS.tools.membership import MembershipTool as PMT
  File "/home/jenkins/.buildout/eggs/Products.PlonePAS-5.0.5-py2.6.egg/Products/PlonePAS/__init__.py", line 8, in <module>
    from Products.PlonePAS.plugins import group
  File "/home/jenkins/.buildout/eggs/Products.PlonePAS-5.0.5-py2.6.egg/Products/PlonePAS/plugins/group.py", line 25, in <module>
    from ufactory import PloneUser
  File "/home/jenkins/.buildout/eggs/Products.PlonePAS-5.0.5-py2.6.egg/Products/PlonePAS/plugins/ufactory.py", line 15, in <module>
    from collections import OrderedDict


FAILED:  plone.schemaeditor.tests.test_robot.Startup

Error Message:
cannot import name OrderedDict

Stack Trace:
cannot import name OrderedDict

  File "/home/jenkins/.buildout/eggs/plone.schemaeditor-1.3.11-py2.6.egg/plone/schemaeditor/tests/test_robot.py", line 3, in <module>
    from plone.schemaeditor.testing import ACCEPTANCE
  File "/home/jenkins/.buildout/eggs/plone.schemaeditor-1.3.11-py2.6.egg/plone/schemaeditor/testing.py", line 4, in <module>
    from plone.app.robotframework.testing import AUTOLOGIN_LIBRARY_FIXTURE
  File "/home/jenkins/.buildout/eggs/plone.app.robotframework-0.9.9-py2.6.egg/plone/app/robotframework/__init__.py", line 12, in <module>
    from plone.app.robotframework.autologin import AutoLogin
  File "/home/jenkins/.buildout/eggs/plone.app.robotframework-0.9.9-py2.6.egg/plone/app/robotframework/autologin.py", line 2, in <module>
    from Products.PlonePAS.Extensions.Install import activatePluginInterfaces
  File "/home/jenkins/.buildout/eggs/Products.PlonePAS-5.0.5-py2.6.egg/Products/PlonePAS/__init__.py", line 8, in <module>
    from Products.PlonePAS.plugins import group
  File "/home/jenkins/.buildout/eggs/Products.PlonePAS-5.0.5-py2.6.egg/Products/PlonePAS/plugins/group.py", line 25, in <module>
    from ufactory import PloneUser
  File "/home/jenkins/.buildout/eggs/Products.PlonePAS-5.0.5-py2.6.egg/Products/PlonePAS/plugins/ufactory.py", line 15, in <module>
    from collections import OrderedDict





More information about the Testbot mailing list